Diagnosed failure

Parameters/TestRpc.TestCallWithChainCertAndChainCA/SSL_TCP: /data0/somelongdirectorytoavoidrpathissues/src/kudu/src/kudu/rpc/rpc-test.cc:270: Failure
Failed
Bad status: Runtime error: could not verify certificate chain (error with cert: subject=CN = localhost, ST = sadfjas, C = AS, emailAddress = sdflkdsajf, O = lskdfjlsad, OU = sldfkja, issuer=C = AS, ST = ASDfkjdhf, L = lskdjf, O = saldfja, OU = skdjf, CN = localhost, emailAddress = sadjflkadsj): : certificate has expired
Google Test trace:
/data0/somelongdirectorytoavoidrpathissues/src/kudu/src/kudu/rpc/rpc-test.cc:267: Connecting to 0.0.0.0:38687
I20260928 23:58:35.907071  7576 test_util.cc:175] -----------------------------------------------
I20260928 23:58:35.907228  7576 test_util.cc:176] Had fatal failures, leaving test files at /tmp/dist-test-tasko6t7Nf/test-tmp/rpc-test.5.Parameters_TestRpc.TestCallWithChainCertAndChainCA_SSL_TCP.1790639914606199-7576-0

Full log

Note: This is test shard 6 of 8.
[==========] Running 21 tests from 2 test suites.
[----------] Global test environment set-up.
[----------] 20 tests from Parameters/TestRpc
[ RUN      ] Parameters/TestRpc.TestMessengerCreateDestroy/SSL_TCP
WARNING: Logging before InitGoogleLogging() is written to STDERR
I20260928 23:58:34.713140  7576 rpc-test.cc:169] started messenger TestCreateDestroy
[       OK ] Parameters/TestRpc.TestMessengerCreateDestroy/SSL_TCP (1105 ms)
[ RUN      ] Parameters/TestRpc.TestNegotiationDeadlock/SSL_TCP
I20260928 23:58:35.791239  7598 acceptor_pool.cc:254] collecting diagnostics on the listening RPC socket 0.0.0.0:37959 every 8 connection(s)
I20260928 23:58:35.792533  7599 acceptor_pool.cc:254] collecting diagnostics on the listening RPC socket 0.0.0.0:37959 every 8 connection(s)
[       OK ] Parameters/TestRpc.TestNegotiationDeadlock/SSL_TCP (79 ms)
[ RUN      ] Parameters/TestRpc.TestCallWithChainCertAndChainCA/SSL_TCP
I20260928 23:58:35.879338  7614 acceptor_pool.cc:254] collecting diagnostics on the listening RPC socket 0.0.0.0:38687 every 8 connection(s)
I20260928 23:58:35.881385  7615 acceptor_pool.cc:254] collecting diagnostics on the listening RPC socket 0.0.0.0:38687 every 8 connection(s)
/data0/somelongdirectorytoavoidrpathissues/src/kudu/src/kudu/rpc/rpc-test.cc:270: Failure
Failed
Bad status: Runtime error: could not verify certificate chain (error with cert: subject=CN = localhost, ST = sadfjas, C = AS, emailAddress = sdflkdsajf, O = lskdfjlsad, OU = sldfkja, issuer=C = AS, ST = ASDfkjdhf, L = lskdjf, O = saldfja, OU = skdjf, CN = localhost, emailAddress = sadjflkadsj): : certificate has expired
Google Test trace:
/data0/somelongdirectorytoavoidrpathissues/src/kudu/src/kudu/rpc/rpc-test.cc:267: Connecting to 0.0.0.0:38687
I20260928 23:58:35.907071  7576 test_util.cc:175] -----------------------------------------------
I20260928 23:58:35.907228  7576 test_util.cc:176] Had fatal failures, leaving test files at /tmp/dist-test-tasko6t7Nf/test-tmp/rpc-test.5.Parameters_TestRpc.TestCallWithChainCertAndChainCA_SSL_TCP.1790639914606199-7576-0
[  FAILED  ] Parameters/TestRpc.TestCallWithChainCertAndChainCA/SSL_TCP, where GetParam() = (true, false) (65 ms)
[ RUN      ] Parameters/TestRpc.TestCallWithPasswordProtectedKey/SSL_TCP
I20260928 23:58:35.923691  7639 acceptor_pool.cc:254] collecting diagnostics on the listening RPC socket 0.0.0.0:45503 every 8 connection(s)
I20260928 23:58:35.924381  7640 acceptor_pool.cc:254] collecting diagnostics on the listening RPC socket 0.0.0.0:45503 every 8 connection(s)
[       OK ] Parameters/TestRpc.TestCallWithPasswordProtectedKey/SSL_TCP (61 ms)
[ RUN      ] Parameters/TestRpc.TestCallToBadServer/SSL_TCP
I20260928 23:58:35.984929  7576 rpc-test.cc:394] Status: Network error: Client connection negotiation failed: client connection to 0.0.0.0:0: connect: Connection refused (error 111)
I20260928 23:58:35.986092  7576 rpc-test.cc:394] Status: Network error: Client connection negotiation failed: client connection to 0.0.0.0:0: connect: Connection refused (error 111)
I20260928 23:58:35.987215  7576 rpc-test.cc:394] Status: Network error: Client connection negotiation failed: client connection to 0.0.0.0:0: connect: Connection refused (error 111)
I20260928 23:58:35.988370  7576 rpc-test.cc:394] Status: Network error: Client connection negotiation failed: client connection to 0.0.0.0:0: connect: Connection refused (error 111)
I20260928 23:58:35.989451  7576 rpc-test.cc:394] Status: Network error: Client connection negotiation failed: client connection to 0.0.0.0:0: connect: Connection refused (error 111)
[       OK ] Parameters/TestRpc.TestCallToBadServer/SSL_TCP (22 ms)
[ RUN      ] Parameters/TestRpc.TestWrongService/SSL_TCP
I20260928 23:58:36.009835  7674 acceptor_pool.cc:254] collecting diagnostics on the listening RPC socket 0.0.0.0:39961 every 8 connection(s)
I20260928 23:58:36.010584  7675 acceptor_pool.cc:254] collecting diagnostics on the listening RPC socket 0.0.0.0:39961 every 8 connection(s)
I20260928 23:58:36.051895  7671 messenger.cc:345] service WrongServiceName not registered on TestServer
[       OK ] Parameters/TestRpc.TestWrongService/SSL_TCP (67 ms)
[ RUN      ] Parameters/TestRpc.TestConnectionKeepalive/SSL_TCP
I20260928 23:58:36.081559  7697 acceptor_pool.cc:254] collecting diagnostics on the listening RPC socket 0.0.0.0:33733 every 8 connection(s)
I20260928 23:58:36.082264  7699 acceptor_pool.cc:254] collecting diagnostics on the listening RPC socket 0.0.0.0:33733 every 8 connection(s)
I20260928 23:58:36.085222  7576 rpc-test.cc:488] Connecting to 0.0.0.0:33733
[       OK ] Parameters/TestRpc.TestConnectionKeepalive/SSL_TCP (1059 ms)
[ RUN      ] Parameters/TestRpc.TestClientConnectionMetrics/SSL_TCP
I20260928 23:58:37.145008  7723 acceptor_pool.cc:254] collecting diagnostics on the listening RPC socket 0.0.0.0:36345 every 8 connection(s)
I20260928 23:58:37.145685  7724 acceptor_pool.cc:254] collecting diagnostics on the listening RPC socket 0.0.0.0:36345 every 8 connection(s)
I20260928 23:58:37.148619  7576 rpc-test.cc:569] Connecting to 0.0.0.0:36345
[       OK ] Parameters/TestRpc.TestClientConnectionMetrics/SSL_TCP (110780 ms)
[ RUN      ] Parameters/TestRpc.TestCredentialsPolicy/SSL_TCP
I20260929 00:00:27.914736  7757 acceptor_pool.cc:254] collecting diagnostics on the listening RPC socket 0.0.0.0:43879 every 8 connection(s)
I20260929 00:00:27.915416  7758 acceptor_pool.cc:254] collecting diagnostics on the listening RPC socket 0.0.0.0:43879 every 8 connection(s)
I20260929 00:00:27.918356  7576 rpc-test.cc:700] Connecting to 0.0.0.0:43879
[       OK ] Parameters/TestRpc.TestCredentialsPolicy/SSL_TCP (79 ms)
[ RUN      ] Parameters/TestRpc.TestCallLongerThanKeepalive/SSL_TCP
I20260929 00:00:27.995000  7782 acceptor_pool.cc:254] collecting diagnostics on the listening RPC socket 0.0.0.0:43337 every 8 connection(s)
I20260929 00:00:27.995671  7783 acceptor_pool.cc:254] collecting diagnostics on the listening RPC socket 0.0.0.0:43337 every 8 connection(s)
I20260929 00:00:28.031782  7786 rpc-test-base.h:222] got call: sleep_micros: 3000000 deferred: true
I20260929 00:00:31.035862  7786 rpcz_store.cc:275] Call kudu.rpc.GenericCalculatorService.Sleep from 127.0.0.1:51882 (request call id 0) took 3004 ms. Trace:
I20260929 00:00:31.036183  7786 rpcz_store.cc:276] 0929 00:00:28.031544 (+     0us) service_pool.cc:170] Inserting onto call queue
0929 00:00:28.031640 (+    96us) service_pool.cc:227] Handling call
0929 00:00:31.035786 (+3004146us) inbound_call.cc:173] Queueing success response
Metrics: {}
[       OK ] Parameters/TestRpc.TestCallLongerThanKeepalive/SSL_TCP (3065 ms)
[ RUN      ] Parameters/TestRpc.TestRpcSidecar/SSL_TCP
I20260929 00:00:31.072108  7807 acceptor_pool.cc:254] collecting diagnostics on the listening RPC socket 0.0.0.0:46579 every 8 connection(s)
I20260929 00:00:31.072810  7808 acceptor_pool.cc:254] collecting diagnostics on the listening RPC socket 0.0.0.0:46579 every 8 connection(s)
[       OK ] Parameters/TestRpc.TestRpcSidecar/SSL_TCP (525 ms)
[ RUN      ] Parameters/TestRpc.TestRpcSidecarLimits/SSL_TCP
I20260929 00:00:48.194789  7835 acceptor_pool.cc:254] collecting diagnostics on the listening RPC socket 0.0.0.0:44069 every 8 connection(s)
I20260929 00:00:48.195581  7836 acceptor_pool.cc:254] collecting diagnostics on the listening RPC socket 0.0.0.0:44069 every 8 connection(s)
W20260929 00:00:48.210276  7576 serialization.cc:72] Serialized kudu.rpc_test.PushStringsRequestPB (2147483654 bytes) is larger than the maximum configured RPC message size (52428800 bytes). Sending anyway, but peer may reject the data.
W20260929 00:00:48.220650  7834 connection.cc:535] server connection from 127.0.0.1:35406 recv error: Network error: RPC frame had a length of 2147483714, but we only support messages up to 52428800 bytes long.
W20260929 00:00:48.220968  7834 connection.cc:158] shutting down server connection from 127.0.0.1:35406 with pending inbound data: 4/2147483714 bytes received; last active 0 ns ago: status Network error: RPC frame had a length of 2147483714, but we only support messages up to 52428800 bytes long.
W20260929 00:00:48.221741  7848 connection.cc:698] client connection to 0.0.0.0:44069 send error: Network error: failed to write to TLS socket: Connection reset by peer
W20260929 00:00:48.222267  7848 connection.cc:196] Error closing socket: Network error: TlsSocket::Close: Success
[       OK ] Parameters/TestRpc.TestRpcSidecarLimits/SSL_TCP (17257 ms)
[ RUN      ] Parameters/TestRpc.TestCallTimeoutDoesntAffectNegotiation/SSL_TCP
I20260929 00:00:48.847483  7860 acceptor_pool.cc:254] collecting diagnostics on the listening RPC socket 0.0.0.0:34221 every 8 connection(s)
I20260929 00:00:48.848194  7861 acceptor_pool.cc:254] collecting diagnostics on the listening RPC socket 0.0.0.0:34221 every 8 connection(s)
W20260929 00:00:48.868441  7856 negotiation.cc:266] Injecting 500ms delay in negotiation
I20260929 00:00:48.918951  7576 rpc-test-base.h:595] status: Timed out: connection negotiation to 0.0.0.0:34221 for RPC Sleep timed out after 0.050s (ON_OUTBOUND_QUEUE), seconds elapsed: 0.0515853
[       OK ] Parameters/TestRpc.TestCallTimeoutDoesntAffectNegotiation/SSL_TCP (557 ms)
[ RUN      ] Parameters/TestRpc.TestRpcHandlerLatencyMetric/SSL_TCP
I20260929 00:00:49.410560  7885 acceptor_pool.cc:254] collecting diagnostics on the listening RPC socket 0.0.0.0:35413 every 8 connection(s)
I20260929 00:00:49.411230  7886 acceptor_pool.cc:254] collecting diagnostics on the listening RPC socket 0.0.0.0:35413 every 8 connection(s)
I20260929 00:00:49.458734  7576 rpc-test.cc:1236] Sleep() min lat: 21593
I20260929 00:00:49.458925  7576 rpc-test.cc:1237] Sleep() mean lat: 21593
I20260929 00:00:49.459066  7576 rpc-test.cc:1238] Sleep() max lat: 21593
I20260929 00:00:49.459198  7576 rpc-test.cc:1239] Sleep() #calls: 1
[       OK ] Parameters/TestRpc.TestRpcHandlerLatencyMetric/SSL_TCP (80 ms)
[ RUN      ] Parameters/TestRpc.TimedOutOnResponseMetricServiceQueue/SSL_TCP
I20260929 00:00:49.487865  7911 acceptor_pool.cc:254] collecting diagnostics on the listening RPC socket 0.0.0.0:39283 every 8 connection(s)
I20260929 00:00:49.488559  7912 acceptor_pool.cc:254] collecting diagnostics on the listening RPC socket 0.0.0.0:39283 every 8 connection(s)
W20260929 00:00:49.557710  7913 rpcz_store.cc:267] Call kudu.rpc_test.CalculatorService.Sleep from 127.0.0.1:55824 (request call id 2) took 20 ms (client timeout 20 ms). Trace:
W20260929 00:00:49.558072  7913 rpcz_store.cc:269] 0929 00:00:49.537309 (+     0us) service_pool.cc:170] Inserting onto call queue
0929 00:00:49.557570 (+ 20261us) service_pool.cc:214] Skipping call since client already timed out
0929 00:00:49.557662 (+    92us) inbound_call.cc:173] Queueing failure response
Metrics: {}
[       OK ] Parameters/TestRpc.TimedOutOnResponseMetricServiceQueue/SSL_TCP (98 ms)
[ RUN      ] Parameters/TestRpc.RpcPendingConnectionsMetric/SSL_TCP
I20260929 00:00:49.574226  7934 acceptor_pool.cc:254] collecting diagnostics on the listening RPC socket 0.0.0.0:32851 every 8 connection(s)
I20260929 00:00:49.574904  7935 acceptor_pool.cc:254] collecting diagnostics on the listening RPC socket 0.0.0.0:32851 every 8 connection(s)
W20260929 00:00:49.579689  7930 negotiation.cc:337] Failed RPC negotiation. Trace:
0929 00:00:49.578519 (+     0us) reactor.cc:625] Submitting negotiation task for server connection from 127.0.0.1:40108 (local address 127.0.0.1:32851)
0929 00:00:49.578900 (+   381us) server_negotiation.cc:206] Beginning negotiation
0929 00:00:49.578918 (+    18us) server_negotiation.cc:399] Waiting for connection header
0929 00:00:49.579142 (+   224us) negotiation.cc:327] Negotiation complete: Network error: Server connection negotiation failed: server connection from 127.0.0.1:40108: BlockingRecv error: recv got EOF from 127.0.0.1:40108 (error 108)
Metrics: {"server-negotiator.queue_time_us":101}
[       OK ] Parameters/TestRpc.RpcPendingConnectionsMetric/SSL_TCP (27 ms)
[ RUN      ] Parameters/TestRpc.TestRpcContextClientDeadline/SSL_TCP
I20260929 00:00:49.638552  7950 acceptor_pool.cc:254] collecting diagnostics on the listening RPC socket 0.0.0.0:41687 every 8 connection(s)
I20260929 00:00:49.639253  7951 acceptor_pool.cc:254] collecting diagnostics on the listening RPC socket 0.0.0.0:41687 every 8 connection(s)
[       OK ] Parameters/TestRpc.TestRpcContextClientDeadline/SSL_TCP (106 ms)
[ RUN      ] Parameters/TestRpc.TestApplicationFeatureFlagUnsupportedServer/SSL_TCP
I20260929 00:00:49.720245  7975 acceptor_pool.cc:254] collecting diagnostics on the listening RPC socket 0.0.0.0:44809 every 8 connection(s)
I20260929 00:00:49.720942  7976 acceptor_pool.cc:254] collecting diagnostics on the listening RPC socket 0.0.0.0:44809 every 8 connection(s)
[       OK ] Parameters/TestRpc.TestApplicationFeatureFlagUnsupportedServer/SSL_TCP (71 ms)
[ RUN      ] Parameters/TestRpc.TestCancellationAsync/SSL_TCP
I20260929 00:00:49.810571  8000 acceptor_pool.cc:254] collecting diagnostics on the listening RPC socket 0.0.0.0:41989 every 8 connection(s)
I20260929 00:00:49.811251  8001 acceptor_pool.cc:254] collecting diagnostics on the listening RPC socket 0.0.0.0:41989 every 8 connection(s)
I20260929 00:00:49.814204  7576 rpc-test.cc:1716] Connecting to 0.0.0.0:41989
I20260929 00:00:49.836326  7576 test_util.cc:268] Using random seed: -535342837
I20260929 00:00:50.063643  8004 rpc-test-base.h:240] got call: sleep_micros: 500 pattern: 4294967295 num_repetitions: 2097152 sidecar_idx: 0
I20260929 00:00:50.218747  8003 rpc-test-base.h:240] got call: sleep_micros: 500 pattern: 4294967295 num_repetitions: 2097152 sidecar_idx: 0
I20260929 00:00:50.401947  8004 rpc-test-base.h:240] got call: sleep_micros: 500 pattern: 4294967295 num_repetitions: 2097152 sidecar_idx: 0
I20260929 00:00:50.579334  8003 rpc-test-base.h:240] got call: sleep_micros: 500 pattern: 4294967295 num_repetitions: 2097152 sidecar_idx: 0
I20260929 00:00:50.752177  8004 rpc-test-base.h:240] got call: sleep_micros: 500 pattern: 4294967295 num_repetitions: 2097152 sidecar_idx: 0
I20260929 00:00:50.922977  8003 rpc-test-base.h:240] got call: sleep_micros: 500 pattern: 4294967295 num_repetitions: 2097152 sidecar_idx: 0
I20260929 00:00:51.094520  8004 rpc-test-base.h:240] got call: sleep_micros: 500 pattern: 4294967295 num_repetitions: 2097152 sidecar_idx: 0
I20260929 00:00:51.265256  8003 rpc-test-base.h:240] got call: sleep_micros: 500 pattern: 4294967295 num_repetitions: 2097152 sidecar_idx: 0
W20260929 00:00:51.418502  7998 connection.cc:196] Error closing socket: Network error: TlsSocket::Close: Broken pipe
W20260929 00:00:51.427174  7998 connection.cc:441] server connection from 127.0.0.1:59468 torn down before Call kudu.rpc.GenericCalculatorService.SleepWithSidecar from 127.0.0.1:59468 (request call id 8) could send its response
[       OK ] Parameters/TestRpc.TestCancellationAsync/SSL_TCP (1664 ms)
[ RUN      ] Parameters/TestRpc.TestPerformanceBySocketType/SSL_TCP
I20260929 00:00:51.531939  8025 acceptor_pool.cc:254] collecting diagnostics on the listening RPC socket 0.0.0.0:36447 every 8 connection(s)
I20260929 00:00:51.532591  8026 acceptor_pool.cc:254] collecting diagnostics on the listening RPC socket 0.0.0.0:36447 every 8 connection(s)
I20260929 00:00:51.535518  7576 rpc-test.cc:1846] Connecting to 0.0.0.0:36447
I20260929 00:01:10.137810  7576 rpc-test.cc:1859] Sending 1024MB via ssl-enabled tcp socket: real 18.591s	user 16.342s	sys 10.234s
I20260929 00:01:28.558156  7576 rpc-test.cc:1859] Sending 1024MB via ssl-enabled tcp socket: real 18.420s	user 16.226s	sys 10.090s
I20260929 00:01:46.836753  7576 rpc-test.cc:1859] Sending 1024MB via ssl-enabled tcp socket: real 18.278s	user 16.031s	sys 10.000s
I20260929 00:02:05.030366  7576 rpc-test.cc:1859] Sending 1024MB via ssl-enabled tcp socket: real 18.193s	user 15.755s	sys 10.043s
I20260929 00:02:23.438597  7576 rpc-test.cc:1859] Sending 1024MB via ssl-enabled tcp socket: real 18.408s	user 16.257s	sys 9.967s
[       OK ] Parameters/TestRpc.TestPerformanceBySocketType/SSL_TCP (92017 ms)
[----------] 20 tests from Parameters/TestRpc (228797 ms total)

[----------] 1 test from Parameters/TestRpcSocketTxRxQueue
[ RUN      ] Parameters/TestRpcSocketTxRxQueue.OverCapacity/0
W20260929 00:02:23.887286  8069 negotiation.cc:337] Failed RPC negotiation. Trace:
0929 00:02:23.480539 (+     0us) reactor.cc:625] Submitting negotiation task for client connection to 0.0.0.0:34023 (local address 127.0.0.1:48580)
0929 00:02:23.481058 (+   519us) negotiation.cc:107] Waiting for socket to connect
0929 00:02:23.481088 (+    30us) client_negotiation.cc:174] Beginning negotiation
0929 00:02:23.481268 (+   180us) client_negotiation.cc:252] Sending NEGOTIATE NegotiatePB request
0929 00:02:23.886284 (+405016us) negotiation.cc:327] Negotiation complete: Network error: Client connection negotiation failed: client connection to 0.0.0.0:34023: BlockingRecv error: recv error from unknown peer: Transport endpoint is not connected (error 107)
Metrics: {"client-negotiator.queue_time_us":125}
W20260929 00:02:23.887326  8060 negotiation.cc:337] Failed RPC negotiation. Trace:
0929 00:02:23.473348 (+     0us) reactor.cc:625] Submitting negotiation task for client connection to 0.0.0.0:34023 (local address 127.0.0.1:48570)
0929 00:02:23.473927 (+   579us) negotiation.cc:107] Waiting for socket to connect
0929 00:02:23.473967 (+    40us) client_negotiation.cc:174] Beginning negotiation
0929 00:02:23.474224 (+   257us) client_negotiation.cc:252] Sending NEGOTIATE NegotiatePB request
0929 00:02:23.886234 (+412010us) negotiation.cc:327] Negotiation complete: Network error: Client connection negotiation failed: client connection to 0.0.0.0:34023: BlockingRecv error: recv error from unknown peer: Transport endpoint is not connected (error 107)
Metrics: {"client-negotiator.queue_time_us":147}
W20260929 00:02:23.887627  8078 negotiation.cc:337] Failed RPC negotiation. Trace:
0929 00:02:23.492641 (+     0us) reactor.cc:625] Submitting negotiation task for client connection to 0.0.0.0:34023 (local address 127.0.0.1:48586)
0929 00:02:23.493152 (+   511us) negotiation.cc:107] Waiting for socket to connect
0929 00:02:23.493188 (+    36us) client_negotiation.cc:174] Beginning negotiation
0929 00:02:23.493384 (+   196us) client_negotiation.cc:252] Sending NEGOTIATE NegotiatePB request
0929 00:02:23.886228 (+392844us) negotiation.cc:327] Negotiation complete: Network error: Client connection negotiation failed: client connection to 0.0.0.0:34023: BlockingRecv error: recv error from unknown peer: Transport endpoint is not connected (error 107)
Metrics: {"client-negotiator.queue_time_us":127}
W20260929 00:02:23.887686  8096 negotiation.cc:337] Failed RPC negotiation. Trace:
0929 00:02:23.516571 (+     0us) reactor.cc:625] Submitting negotiation task for client connection to 0.0.0.0:34023 (local address 127.0.0.1:48598)
0929 00:02:23.517101 (+   530us) negotiation.cc:107] Waiting for socket to connect
0929 00:02:23.517132 (+    31us) client_negotiation.cc:174] Beginning negotiation
0929 00:02:23.517314 (+   182us) client_negotiation.cc:252] Sending NEGOTIATE NegotiatePB request
0929 00:02:23.886765 (+369451us) negotiation.cc:327] Negotiation complete: Network error: Client connection negotiation failed: client connection to 0.0.0.0:34023: BlockingRecv error: recv error from unknown peer: Transport endpoint is not connected (error 107)
Metrics: {"client-negotiator.queue_time_us":135}
W20260929 00:02:23.888968  8087 negotiation.cc:337] Failed RPC negotiation. Trace:
0929 00:02:23.504642 (+     0us) reactor.cc:625] Submitting negotiation task for client connection to 0.0.0.0:34023 (local address 127.0.0.1:48588)
0929 00:02:23.505163 (+   521us) negotiation.cc:107] Waiting for socket to connect
0929 00:02:23.505193 (+    30us) client_negotiation.cc:174] Beginning negotiation
0929 00:02:23.505379 (+   186us) client_negotiation.cc:252] Sending NEGOTIATE NegotiatePB request
0929 00:02:23.887980 (+382601us) negotiation.cc:327] Negotiation complete: Network error: Client connection negotiation failed: client connection to 0.0.0.0:34023: BlockingRecv error: recv error from unknown peer: Transport endpoint is not connected (error 107)
Metrics: {"client-negotiator.queue_time_us":137}
W20260929 00:02:23.889001  8051 negotiation.cc:337] Failed RPC negotiation. Trace:
0929 00:02:23.466887 (+     0us) reactor.cc:625] Submitting negotiation task for client connection to 0.0.0.0:34023 (local address 127.0.0.1:48564)
0929 00:02:23.467562 (+   675us) negotiation.cc:107] Waiting for socket to connect
0929 00:02:23.467605 (+    43us) client_negotiation.cc:174] Beginning negotiation
0929 00:02:23.468077 (+   472us) client_negotiation.cc:252] Sending NEGOTIATE NegotiatePB request
0929 00:02:23.886250 (+418173us) negotiation.cc:327] Negotiation complete: Network error: Client connection negotiation failed: client connection to 0.0.0.0:34023: BlockingRecv error: recv error from unknown peer: Transport endpoint is not connected (error 107)
Metrics: {"client-negotiator.queue_time_us":135}
[       OK ] Parameters/TestRpcSocketTxRxQueue.OverCapacity/0 (1215 ms)
[----------] 1 test from Parameters/TestRpcSocketTxRxQueue (1215 ms total)

[----------] Global test environment tear-down
[==========] 21 tests from 2 test suites ran. (230014 ms total)
[  PASSED  ] 20 tests.
[  FAILED  ] 1 test, listed below:
[  FAILED  ] Parameters/TestRpc.TestCallWithChainCertAndChainCA/SSL_TCP, where GetParam() = (true, false)

 1 FAILED TEST