Diagnosed failure

Parameters/TestRpc.TestCallWithChainCertAndChainCA/SSL_TCP: /data0/somelongdirectorytoavoidrpathissues/src/kudu/src/kudu/rpc/rpc-test.cc:270: Failure
Failed
Bad status: Runtime error: could not verify certificate chain (error with cert: subject=CN = localhost, ST = sadfjas, C = AS, emailAddress = sdflkdsajf, O = lskdfjlsad, OU = sldfkja, issuer=C = AS, ST = ASDfkjdhf, L = lskdjf, O = saldfja, OU = skdjf, CN = localhost, emailAddress = sadjflkadsj): : certificate has expired
Google Test trace:
/data0/somelongdirectorytoavoidrpathissues/src/kudu/src/kudu/rpc/rpc-test.cc:267: Connecting to 0.0.0.0:46171
I20260927 21:39:57.003651  4028 test_util.cc:175] -----------------------------------------------
I20260927 21:39:57.003728  4028 test_util.cc:176] Had fatal failures, leaving test files at /tmp/dist-test-taskj4uZMO/test-tmp/rpc-test.5.Parameters_TestRpc.TestCallWithChainCertAndChainCA_SSL_TCP.1790545196929706-4028-0

Full log

Note: This is test shard 6 of 8.
[==========] Running 21 tests from 2 test suites.
[----------] Global test environment set-up.
[----------] 20 tests from Parameters/TestRpc
[ RUN      ] Parameters/TestRpc.TestMessengerCreateDestroy/SSL_TCP
WARNING: Logging before InitGoogleLogging() is written to STDERR
I20260927 21:39:56.957162  4028 rpc-test.cc:169] started messenger TestCreateDestroy
[       OK ] Parameters/TestRpc.TestMessengerCreateDestroy/SSL_TCP (25 ms)
[ RUN      ] Parameters/TestRpc.TestNegotiationDeadlock/SSL_TCP
I20260927 21:39:56.972167  4048 acceptor_pool.cc:254] collecting diagnostics on the listening RPC socket 0.0.0.0:46395 every 8 connection(s)
I20260927 21:39:56.972198  4049 acceptor_pool.cc:254] collecting diagnostics on the listening RPC socket 0.0.0.0:46395 every 8 connection(s)
[       OK ] Parameters/TestRpc.TestNegotiationDeadlock/SSL_TCP (22 ms)
[ RUN      ] Parameters/TestRpc.TestCallWithChainCertAndChainCA/SSL_TCP
I20260927 21:39:56.999420  4064 acceptor_pool.cc:254] collecting diagnostics on the listening RPC socket 0.0.0.0:46171 every 8 connection(s)
I20260927 21:39:56.999439  4065 acceptor_pool.cc:254] collecting diagnostics on the listening RPC socket 0.0.0.0:46171 every 8 connection(s)
/data0/somelongdirectorytoavoidrpathissues/src/kudu/src/kudu/rpc/rpc-test.cc:270: Failure
Failed
Bad status: Runtime error: could not verify certificate chain (error with cert: subject=CN = localhost, ST = sadfjas, C = AS, emailAddress = sdflkdsajf, O = lskdfjlsad, OU = sldfkja, issuer=C = AS, ST = ASDfkjdhf, L = lskdjf, O = saldfja, OU = skdjf, CN = localhost, emailAddress = sadjflkadsj): : certificate has expired
Google Test trace:
/data0/somelongdirectorytoavoidrpathissues/src/kudu/src/kudu/rpc/rpc-test.cc:267: Connecting to 0.0.0.0:46171
I20260927 21:39:57.003651  4028 test_util.cc:175] -----------------------------------------------
I20260927 21:39:57.003728  4028 test_util.cc:176] Had fatal failures, leaving test files at /tmp/dist-test-taskj4uZMO/test-tmp/rpc-test.5.Parameters_TestRpc.TestCallWithChainCertAndChainCA_SSL_TCP.1790545196929706-4028-0
[  FAILED  ] Parameters/TestRpc.TestCallWithChainCertAndChainCA/SSL_TCP, where GetParam() = (true, false) (23 ms)
[ RUN      ] Parameters/TestRpc.TestCallWithPasswordProtectedKey/SSL_TCP
I20260927 21:39:57.031021  4089 acceptor_pool.cc:254] collecting diagnostics on the listening RPC socket 0.0.0.0:35605 every 8 connection(s)
I20260927 21:39:57.031064  4090 acceptor_pool.cc:254] collecting diagnostics on the listening RPC socket 0.0.0.0:35605 every 8 connection(s)
[       OK ] Parameters/TestRpc.TestCallWithPasswordProtectedKey/SSL_TCP (40 ms)
[ RUN      ] Parameters/TestRpc.TestCallToBadServer/SSL_TCP
I20260927 21:39:57.056694  4028 rpc-test.cc:394] Status: Network error: Client connection negotiation failed: client connection to 0.0.0.0:0: connect: Connection refused (error 111)
I20260927 21:39:57.057201  4028 rpc-test.cc:394] Status: Network error: Client connection negotiation failed: client connection to 0.0.0.0:0: connect: Connection refused (error 111)
I20260927 21:39:57.057613  4028 rpc-test.cc:394] Status: Network error: Client connection negotiation failed: client connection to 0.0.0.0:0: connect: Connection refused (error 111)
I20260927 21:39:57.057977  4028 rpc-test.cc:394] Status: Network error: Client connection negotiation failed: client connection to 0.0.0.0:0: connect: Connection refused (error 111)
I20260927 21:39:57.058269  4028 rpc-test.cc:394] Status: Network error: Client connection negotiation failed: client connection to 0.0.0.0:0: connect: Connection refused (error 111)
[       OK ] Parameters/TestRpc.TestCallToBadServer/SSL_TCP (14 ms)
[ RUN      ] Parameters/TestRpc.TestWrongService/SSL_TCP
I20260927 21:39:57.067135  4124 acceptor_pool.cc:254] collecting diagnostics on the listening RPC socket 0.0.0.0:34363 every 8 connection(s)
I20260927 21:39:57.067188  4125 acceptor_pool.cc:254] collecting diagnostics on the listening RPC socket 0.0.0.0:34363 every 8 connection(s)
I20260927 21:39:57.084666  4123 messenger.cc:345] service WrongServiceName not registered on TestServer
[       OK ] Parameters/TestRpc.TestWrongService/SSL_TCP (27 ms)
[ RUN      ] Parameters/TestRpc.TestConnectionKeepalive/SSL_TCP
I20260927 21:39:57.092631  4147 acceptor_pool.cc:254] collecting diagnostics on the listening RPC socket 0.0.0.0:36567 every 8 connection(s)
I20260927 21:39:57.092690  4148 acceptor_pool.cc:254] collecting diagnostics on the listening RPC socket 0.0.0.0:36567 every 8 connection(s)
I20260927 21:39:57.092849  4028 rpc-test.cc:488] Connecting to 0.0.0.0:36567
[       OK ] Parameters/TestRpc.TestConnectionKeepalive/SSL_TCP (1037 ms)
[ RUN      ] Parameters/TestRpc.TestClientConnectionMetrics/SSL_TCP
I20260927 21:39:58.136039  4172 acceptor_pool.cc:254] collecting diagnostics on the listening RPC socket 0.0.0.0:42351 every 8 connection(s)
I20260927 21:39:58.136132  4173 acceptor_pool.cc:254] collecting diagnostics on the listening RPC socket 0.0.0.0:42351 every 8 connection(s)
I20260927 21:39:58.136276  4028 rpc-test.cc:569] Connecting to 0.0.0.0:42351
[       OK ] Parameters/TestRpc.TestClientConnectionMetrics/SSL_TCP (8717 ms)
[ RUN      ] Parameters/TestRpc.TestCredentialsPolicy/SSL_TCP
I20260927 21:40:06.864924  4195 acceptor_pool.cc:254] collecting diagnostics on the listening RPC socket 0.0.0.0:38871 every 8 connection(s)
I20260927 21:40:06.864936  4196 acceptor_pool.cc:254] collecting diagnostics on the listening RPC socket 0.0.0.0:38871 every 8 connection(s)
I20260927 21:40:06.865098  4028 rpc-test.cc:700] Connecting to 0.0.0.0:38871
[       OK ] Parameters/TestRpc.TestCredentialsPolicy/SSL_TCP (51 ms)
[ RUN      ] Parameters/TestRpc.TestCallLongerThanKeepalive/SSL_TCP
I20260927 21:40:06.899114  4221 acceptor_pool.cc:254] collecting diagnostics on the listening RPC socket 0.0.0.0:45551 every 8 connection(s)
I20260927 21:40:06.899066  4220 acceptor_pool.cc:254] collecting diagnostics on the listening RPC socket 0.0.0.0:45551 every 8 connection(s)
I20260927 21:40:06.919790  4224 rpc-test-base.h:222] got call: sleep_micros: 3000000 deferred: true
I20260927 21:40:09.920567  4224 rpcz_store.cc:275] Call kudu.rpc.GenericCalculatorService.Sleep from 127.0.0.1:51056 (request call id 0) took 3000 ms. Trace:
I20260927 21:40:09.920668  4224 rpcz_store.cc:276] 0927 21:40:06.919708 (+     0us) service_pool.cc:170] Inserting onto call queue
0927 21:40:06.919761 (+    53us) service_pool.cc:227] Handling call
0927 21:40:09.920552 (+3000791us) inbound_call.cc:173] Queueing success response
Metrics: {}
[       OK ] Parameters/TestRpc.TestCallLongerThanKeepalive/SSL_TCP (3030 ms)
[ RUN      ] Parameters/TestRpc.TestRpcSidecar/SSL_TCP
I20260927 21:40:09.942026  4245 acceptor_pool.cc:254] collecting diagnostics on the listening RPC socket 0.0.0.0:38217 every 8 connection(s)
I20260927 21:40:09.942067  4246 acceptor_pool.cc:254] collecting diagnostics on the listening RPC socket 0.0.0.0:38217 every 8 connection(s)
[       OK ] Parameters/TestRpc.TestRpcSidecar/SSL_TCP (64 ms)
[ RUN      ] Parameters/TestRpc.TestRpcSidecarLimits/SSL_TCP
I20260927 21:40:11.700459  4270 acceptor_pool.cc:254] collecting diagnostics on the listening RPC socket 0.0.0.0:46341 every 8 connection(s)
I20260927 21:40:11.700484  4271 acceptor_pool.cc:254] collecting diagnostics on the listening RPC socket 0.0.0.0:46341 every 8 connection(s)
W20260927 21:40:11.719767  4028 serialization.cc:72] Serialized kudu.rpc_test.PushStringsRequestPB (2147483654 bytes) is larger than the maximum configured RPC message size (52428800 bytes). Sending anyway, but peer may reject the data.
W20260927 21:40:11.723239  4267 connection.cc:535] server connection from 127.0.0.1:35496 recv error: Network error: RPC frame had a length of 2147483714, but we only support messages up to 52428800 bytes long.
W20260927 21:40:11.723292  4267 connection.cc:158] shutting down server connection from 127.0.0.1:35496 with pending inbound data: 4/2147483714 bytes received; last active 0 ns ago: status Network error: RPC frame had a length of 2147483714, but we only support messages up to 52428800 bytes long.
W20260927 21:40:11.723513  4283 connection.cc:196] Error closing socket: Network error: TlsSocket::Close: Connection reset by peer
I20260927 21:40:11.736428  4295 acceptor_pool.cc:254] collecting diagnostics on the listening RPC socket 0.0.0.0:41899 every 8 connection(s)
I20260927 21:40:11.736442  4296 acceptor_pool.cc:254] collecting diagnostics on the listening RPC socket 0.0.0.0:41899 every 8 connection(s)
W20260927 21:40:15.638486  4294 connection.cc:577] server connection from 127.0.0.1:54124: received bad data: 'Corruption: Invalid packet: message had a length of 2147483710, but we only support messages up to 2147483647 bytes
'
[       OK ] Parameters/TestRpc.TestRpcSidecarLimits/SSL_TCP (5653 ms)
[ RUN      ] Parameters/TestRpc.TestCallTimeoutDoesntAffectNegotiation/SSL_TCP
I20260927 21:40:15.668519  4320 acceptor_pool.cc:254] collecting diagnostics on the listening RPC socket 0.0.0.0:46777 every 8 connection(s)
I20260927 21:40:15.668548  4321 acceptor_pool.cc:254] collecting diagnostics on the listening RPC socket 0.0.0.0:46777 every 8 connection(s)
W20260927 21:40:15.688675  4316 negotiation.cc:266] Injecting 500ms delay in negotiation
I20260927 21:40:15.738932  4028 rpc-test-base.h:595] status: Timed out: connection negotiation to 0.0.0.0:46777 for RPC Sleep timed out after 0.050s (ON_OUTBOUND_QUEUE), seconds elapsed: 0.0509276
[       OK ] Parameters/TestRpc.TestCallTimeoutDoesntAffectNegotiation/SSL_TCP (552 ms)
[ RUN      ] Parameters/TestRpc.TestRpcHandlerLatencyMetric/SSL_TCP
I20260927 21:40:16.213477  4345 acceptor_pool.cc:254] collecting diagnostics on the listening RPC socket 0.0.0.0:41797 every 8 connection(s)
I20260927 21:40:16.213498  4346 acceptor_pool.cc:254] collecting diagnostics on the listening RPC socket 0.0.0.0:41797 every 8 connection(s)
I20260927 21:40:16.246120  4028 rpc-test.cc:1236] Sleep() min lat: 20289
I20260927 21:40:16.246193  4028 rpc-test.cc:1237] Sleep() mean lat: 20289
I20260927 21:40:16.246220  4028 rpc-test.cc:1238] Sleep() max lat: 20289
I20260927 21:40:16.246234  4028 rpc-test.cc:1239] Sleep() #calls: 1
[       OK ] Parameters/TestRpc.TestRpcHandlerLatencyMetric/SSL_TCP (54 ms)
[ RUN      ] Parameters/TestRpc.TimedOutOnResponseMetricServiceQueue/SSL_TCP
I20260927 21:40:16.263522  4371 acceptor_pool.cc:254] collecting diagnostics on the listening RPC socket 0.0.0.0:43103 every 8 connection(s)
I20260927 21:40:16.263566  4372 acceptor_pool.cc:254] collecting diagnostics on the listening RPC socket 0.0.0.0:43103 every 8 connection(s)
W20260927 21:40:16.324779  4373 rpcz_store.cc:267] Call kudu.rpc_test.CalculatorService.Sleep from 127.0.0.1:34864 (request call id 2) took 20 ms (client timeout 20 ms). Trace:
W20260927 21:40:16.324920  4373 rpcz_store.cc:269] 0927 21:40:16.304502 (+     0us) service_pool.cc:170] Inserting onto call queue
0927 21:40:16.324750 (+ 20248us) service_pool.cc:214] Skipping call since client already timed out
0927 21:40:16.324762 (+    12us) inbound_call.cc:173] Queueing failure response
Metrics: {}
[       OK ] Parameters/TestRpc.TimedOutOnResponseMetricServiceQueue/SSL_TCP (78 ms)
[ RUN      ] Parameters/TestRpc.RpcPendingConnectionsMetric/SSL_TCP
I20260927 21:40:16.328426  4394 acceptor_pool.cc:254] collecting diagnostics on the listening RPC socket 0.0.0.0:46725 every 8 connection(s)
I20260927 21:40:16.328492  4395 acceptor_pool.cc:254] collecting diagnostics on the listening RPC socket 0.0.0.0:46725 every 8 connection(s)
W20260927 21:40:16.337885  4390 negotiation.cc:337] Failed RPC negotiation. Trace:
0927 21:40:16.337632 (+     0us) reactor.cc:625] Submitting negotiation task for server connection from 127.0.0.1:44438 (local address 127.0.0.1:46725)
0927 21:40:16.337687 (+    55us) server_negotiation.cc:206] Beginning negotiation
0927 21:40:16.337689 (+     2us) server_negotiation.cc:399] Waiting for connection header
0927 21:40:16.337787 (+    98us) negotiation.cc:327] Negotiation complete: Network error: Server connection negotiation failed: server connection from 127.0.0.1:44438: BlockingRecv error: recv got EOF from 127.0.0.1:44438 (error 108)
Metrics: {"server-negotiator.queue_time_us":24}
[       OK ] Parameters/TestRpc.RpcPendingConnectionsMetric/SSL_TCP (22 ms)
[ RUN      ] Parameters/TestRpc.TestRpcContextClientDeadline/SSL_TCP
I20260927 21:40:16.363834  4410 acceptor_pool.cc:254] collecting diagnostics on the listening RPC socket 0.0.0.0:35087 every 8 connection(s)
I20260927 21:40:16.363870  4411 acceptor_pool.cc:254] collecting diagnostics on the listening RPC socket 0.0.0.0:35087 every 8 connection(s)
[       OK ] Parameters/TestRpc.TestRpcContextClientDeadline/SSL_TCP (47 ms)
[ RUN      ] Parameters/TestRpc.TestApplicationFeatureFlagUnsupportedServer/SSL_TCP
I20260927 21:40:16.404024  4435 acceptor_pool.cc:254] collecting diagnostics on the listening RPC socket 0.0.0.0:35203 every 8 connection(s)
I20260927 21:40:16.404062  4436 acceptor_pool.cc:254] collecting diagnostics on the listening RPC socket 0.0.0.0:35203 every 8 connection(s)
[       OK ] Parameters/TestRpc.TestApplicationFeatureFlagUnsupportedServer/SSL_TCP (33 ms)
[ RUN      ] Parameters/TestRpc.TestCancellationAsync/SSL_TCP
I20260927 21:40:16.435519  4460 acceptor_pool.cc:254] collecting diagnostics on the listening RPC socket 0.0.0.0:42203 every 8 connection(s)
I20260927 21:40:16.435550  4461 acceptor_pool.cc:254] collecting diagnostics on the listening RPC socket 0.0.0.0:42203 every 8 connection(s)
I20260927 21:40:16.435731  4028 rpc-test.cc:1716] Connecting to 0.0.0.0:42203
I20260927 21:40:16.460613  4028 test_util.cc:268] Using random seed: -879438014
I20260927 21:40:16.480819  4464 rpc-test-base.h:240] got call: sleep_micros: 500 pattern: 4294967295 num_repetitions: 2097152 sidecar_idx: 0
I20260927 21:40:16.493415  4464 rpc-test-base.h:240] got call: sleep_micros: 500 pattern: 4294967295 num_repetitions: 2097152 sidecar_idx: 0
I20260927 21:40:16.506246  4464 rpc-test-base.h:240] got call: sleep_micros: 500 pattern: 4294967295 num_repetitions: 2097152 sidecar_idx: 0
I20260927 21:40:16.523986  4464 rpc-test-base.h:240] got call: sleep_micros: 500 pattern: 4294967295 num_repetitions: 2097152 sidecar_idx: 0
I20260927 21:40:16.542057  4464 rpc-test-base.h:240] got call: sleep_micros: 500 pattern: 4294967295 num_repetitions: 2097152 sidecar_idx: 0
I20260927 21:40:16.560400  4464 rpc-test-base.h:240] got call: sleep_micros: 500 pattern: 4294967295 num_repetitions: 2097152 sidecar_idx: 0
I20260927 21:40:16.577991  4464 rpc-test-base.h:240] got call: sleep_micros: 500 pattern: 4294967295 num_repetitions: 2097152 sidecar_idx: 0
I20260927 21:40:16.596625  4464 rpc-test-base.h:240] got call: sleep_micros: 500 pattern: 4294967295 num_repetitions: 2097152 sidecar_idx: 0
W20260927 21:40:16.599783  4458 connection.cc:441] server connection from 127.0.0.1:56818 torn down before Call kudu.rpc.GenericCalculatorService.SleepWithSidecar from 127.0.0.1:56818 (request call id 9) could send its response
[       OK ] Parameters/TestRpc.TestCancellationAsync/SSL_TCP (171 ms)
[ RUN      ] Parameters/TestRpc.TestPerformanceBySocketType/SSL_TCP
I20260927 21:40:16.614902  4485 acceptor_pool.cc:254] collecting diagnostics on the listening RPC socket 0.0.0.0:35457 every 8 connection(s)
I20260927 21:40:16.614946  4486 acceptor_pool.cc:254] collecting diagnostics on the listening RPC socket 0.0.0.0:35457 every 8 connection(s)
I20260927 21:40:16.615204  4028 rpc-test.cc:1846] Connecting to 0.0.0.0:35457
I20260927 21:40:18.410259  4028 rpc-test.cc:1859] Sending 1024MB via ssl-enabled tcp socket: real 1.789s	user 1.714s	sys 1.455s
I20260927 21:40:20.018633  4028 rpc-test.cc:1859] Sending 1024MB via ssl-enabled tcp socket: real 1.608s	user 1.497s	sys 1.374s
I20260927 21:40:21.682052  4028 rpc-test.cc:1859] Sending 1024MB via ssl-enabled tcp socket: real 1.663s	user 1.461s	sys 1.507s
I20260927 21:40:23.391043  4028 rpc-test.cc:1859] Sending 1024MB via ssl-enabled tcp socket: real 1.709s	user 1.482s	sys 1.557s
I20260927 21:40:25.038709  4028 rpc-test.cc:1859] Sending 1024MB via ssl-enabled tcp socket: real 1.648s	user 1.442s	sys 1.485s
[       OK ] Parameters/TestRpc.TestPerformanceBySocketType/SSL_TCP (8439 ms)
[----------] 20 tests from Parameters/TestRpc (28108 ms total)

[----------] 1 test from Parameters/TestRpcSocketTxRxQueue
[ RUN      ] Parameters/TestRpcSocketTxRxQueue.OverCapacity/0
W20260927 21:40:25.313153  4520 negotiation.cc:337] Failed RPC negotiation. Trace:
0927 21:40:25.050480 (+     0us) reactor.cc:625] Submitting negotiation task for client connection to 0.0.0.0:38867 (local address 127.0.0.1:36018)
0927 21:40:25.050568 (+    88us) negotiation.cc:107] Waiting for socket to connect
0927 21:40:25.050594 (+    26us) client_negotiation.cc:174] Beginning negotiation
0927 21:40:25.050641 (+    47us) client_negotiation.cc:252] Sending NEGOTIATE NegotiatePB request
0927 21:40:25.312992 (+262351us) negotiation.cc:327] Negotiation complete: Network error: Client connection negotiation failed: client connection to 0.0.0.0:38867: BlockingRecv error: recv error from unknown peer: Transport endpoint is not connected (error 107)
Metrics: {"client-negotiator.queue_time_us":59}
W20260927 21:40:25.313218  4529 negotiation.cc:337] Failed RPC negotiation. Trace:
0927 21:40:25.051443 (+     0us) reactor.cc:625] Submitting negotiation task for client connection to 0.0.0.0:38867 (local address 127.0.0.1:36020)
0927 21:40:25.051512 (+    69us) negotiation.cc:107] Waiting for socket to connect
0927 21:40:25.051522 (+    10us) client_negotiation.cc:174] Beginning negotiation
0927 21:40:25.051572 (+    50us) client_negotiation.cc:252] Sending NEGOTIATE NegotiatePB request
0927 21:40:25.313049 (+261477us) negotiation.cc:327] Negotiation complete: Network error: Client connection negotiation failed: client connection to 0.0.0.0:38867: BlockingRecv error: recv error from unknown peer: Transport endpoint is not connected (error 107)
Metrics: {"client-negotiator.queue_time_us":38}
W20260927 21:40:25.313153  4511 negotiation.cc:337] Failed RPC negotiation. Trace:
0927 21:40:25.049419 (+     0us) reactor.cc:625] Submitting negotiation task for client connection to 0.0.0.0:38867 (local address 127.0.0.1:36004)
0927 21:40:25.049463 (+    44us) negotiation.cc:107] Waiting for socket to connect
0927 21:40:25.049473 (+    10us) client_negotiation.cc:174] Beginning negotiation
0927 21:40:25.049521 (+    48us) client_negotiation.cc:252] Sending NEGOTIATE NegotiatePB request
0927 21:40:25.312996 (+263475us) negotiation.cc:327] Negotiation complete: Network error: Client connection negotiation failed: client connection to 0.0.0.0:38867: BlockingRecv error: recv error from unknown peer: Transport endpoint is not connected (error 107)
Metrics: {"client-negotiator.queue_time_us":19}
W20260927 21:40:25.313567  4538 negotiation.cc:337] Failed RPC negotiation. Trace:
0927 21:40:25.052278 (+     0us) reactor.cc:625] Submitting negotiation task for client connection to 0.0.0.0:38867 (local address 127.0.0.1:36036)
0927 21:40:25.052317 (+    39us) negotiation.cc:107] Waiting for socket to connect
0927 21:40:25.052326 (+     9us) client_negotiation.cc:174] Beginning negotiation
0927 21:40:25.052372 (+    46us) client_negotiation.cc:252] Sending NEGOTIATE NegotiatePB request
0927 21:40:25.312992 (+260620us) negotiation.cc:327] Negotiation complete: Network error: Client connection negotiation failed: client connection to 0.0.0.0:38867: BlockingRecv error: recv error from unknown peer: Transport endpoint is not connected (error 107)
Metrics: {"client-negotiator.queue_time_us":16}
W20260927 21:40:25.313581  4547 negotiation.cc:337] Failed RPC negotiation. Trace:
0927 21:40:25.053242 (+     0us) reactor.cc:625] Submitting negotiation task for client connection to 0.0.0.0:38867 (local address 127.0.0.1:36050)
0927 21:40:25.053279 (+    37us) negotiation.cc:107] Waiting for socket to connect
0927 21:40:25.053286 (+     7us) client_negotiation.cc:174] Beginning negotiation
0927 21:40:25.053322 (+    36us) client_negotiation.cc:252] Sending NEGOTIATE NegotiatePB request
0927 21:40:25.313311 (+259989us) negotiation.cc:327] Negotiation complete: Network error: Client connection negotiation failed: client connection to 0.0.0.0:38867: BlockingRecv error: recv error from unknown peer: Transport endpoint is not connected (error 107)
Metrics: {"client-negotiator.queue_time_us":17}
W20260927 21:40:25.313685  4502 negotiation.cc:337] Failed RPC negotiation. Trace:
0927 21:40:25.048504 (+     0us) reactor.cc:625] Submitting negotiation task for client connection to 0.0.0.0:38867 (local address 127.0.0.1:36000)
0927 21:40:25.048572 (+    68us) negotiation.cc:107] Waiting for socket to connect
0927 21:40:25.048583 (+    11us) client_negotiation.cc:174] Beginning negotiation
0927 21:40:25.048640 (+    57us) client_negotiation.cc:252] Sending NEGOTIATE NegotiatePB request
0927 21:40:25.312997 (+264357us) negotiation.cc:327] Negotiation complete: Network error: Client connection negotiation failed: client connection to 0.0.0.0:38867: BlockingRecv error: recv error from unknown peer: Transport endpoint is not connected (error 107)
Metrics: {"client-negotiator.queue_time_us":36}
[       OK ] Parameters/TestRpcSocketTxRxQueue.OverCapacity/0 (1048 ms)
[----------] 1 test from Parameters/TestRpcSocketTxRxQueue (1048 ms total)

[----------] Global test environment tear-down
[==========] 21 tests from 2 test suites ran. (29156 ms total)
[  PASSED  ] 20 tests.
[  FAILED  ] 1 test, listed below:
[  FAILED  ] Parameters/TestRpc.TestCallWithChainCertAndChainCA/SSL_TCP, where GetParam() = (true, false)

 1 FAILED TEST