Diagnosed failure

Parameters/TestRpc.TestCallWithChainCertAndChainCA/SSL_UnixSocket: /data0/somelongdirectorytoavoidrpathissues/src/kudu/src/kudu/rpc/rpc-test.cc:270: Failure
Failed
Bad status: Runtime error: could not verify certificate chain (error with cert: subject=CN = localhost, ST = sadfjas, C = AS, emailAddress = sdflkdsajf, O = lskdfjlsad, OU = sldfkja, issuer=C = AS, ST = ASDfkjdhf, L = lskdjf, O = saldfja, OU = skdjf, CN = localhost, emailAddress = sadjflkadsj): : certificate has expired
Google Test trace:
/data0/somelongdirectorytoavoidrpathissues/src/kudu/src/kudu/rpc/rpc-test.cc:267: Connecting to unix:/tmp/dist-test-tasktg1VHa/test-tmp/rpc-test-709d0491456a49ccba4e3d46959df5ca.sock
I20260927 06:59:32.587821 12908 test_util.cc:175] -----------------------------------------------
I20260927 06:59:32.587873 12908 test_util.cc:176] Had fatal failures, leaving test files at /tmp/dist-test-tasktg1VHa/test-tmp/rpc-test.6.Parameters_TestRpc.TestCallWithChainCertAndChainCA_SSL_UnixSocket.1790492372538185-12908-0

Full log

Note: This is test shard 7 of 8.
[==========] Running 21 tests from 2 test suites.
[----------] Global test environment set-up.
[----------] 20 tests from Parameters/TestRpc
[ RUN      ] Parameters/TestRpc.TestMessengerCreateDestroy/SSL_UnixSocket
WARNING: Logging before InitGoogleLogging() is written to STDERR
I20260927 06:59:32.550674 12908 rpc-test.cc:169] started messenger TestCreateDestroy
[       OK ] Parameters/TestRpc.TestMessengerCreateDestroy/SSL_UnixSocket (10 ms)
[ RUN      ] Parameters/TestRpc.TestNegotiationDeadlock/SSL_UnixSocket
I20260927 06:59:32.557552 12929 acceptor_pool.cc:254] collecting diagnostics on the listening RPC socket unix:/tmp/dist-test-tasktg1VHa/test-tmp/rpc-test-c9e5e5d0d65f44bba197882d6c9de6d2.sock every 8 connection(s)
I20260927 06:59:32.557552 12928 acceptor_pool.cc:254] collecting diagnostics on the listening RPC socket unix:/tmp/dist-test-tasktg1VHa/test-tmp/rpc-test-c9e5e5d0d65f44bba197882d6c9de6d2.sock every 8 connection(s)
[       OK ] Parameters/TestRpc.TestNegotiationDeadlock/SSL_UnixSocket (12 ms)
[ RUN      ] Parameters/TestRpc.TestCallWithChainCertAndChainCA/SSL_UnixSocket
I20260927 06:59:32.583796 12944 acceptor_pool.cc:254] collecting diagnostics on the listening RPC socket unix:/tmp/dist-test-tasktg1VHa/test-tmp/rpc-test-709d0491456a49ccba4e3d46959df5ca.sock every 8 connection(s)
I20260927 06:59:32.583815 12945 acceptor_pool.cc:254] collecting diagnostics on the listening RPC socket unix:/tmp/dist-test-tasktg1VHa/test-tmp/rpc-test-709d0491456a49ccba4e3d46959df5ca.sock every 8 connection(s)
/data0/somelongdirectorytoavoidrpathissues/src/kudu/src/kudu/rpc/rpc-test.cc:270: Failure
Failed
Bad status: Runtime error: could not verify certificate chain (error with cert: subject=CN = localhost, ST = sadfjas, C = AS, emailAddress = sdflkdsajf, O = lskdfjlsad, OU = sldfkja, issuer=C = AS, ST = ASDfkjdhf, L = lskdjf, O = saldfja, OU = skdjf, CN = localhost, emailAddress = sadjflkadsj): : certificate has expired
Google Test trace:
/data0/somelongdirectorytoavoidrpathissues/src/kudu/src/kudu/rpc/rpc-test.cc:267: Connecting to unix:/tmp/dist-test-tasktg1VHa/test-tmp/rpc-test-709d0491456a49ccba4e3d46959df5ca.sock
I20260927 06:59:32.587821 12908 test_util.cc:175] -----------------------------------------------
I20260927 06:59:32.587873 12908 test_util.cc:176] Had fatal failures, leaving test files at /tmp/dist-test-tasktg1VHa/test-tmp/rpc-test.6.Parameters_TestRpc.TestCallWithChainCertAndChainCA_SSL_UnixSocket.1790492372538185-12908-0
[  FAILED  ] Parameters/TestRpc.TestCallWithChainCertAndChainCA/SSL_UnixSocket, where GetParam() = (true, true) (23 ms)
[ RUN      ] Parameters/TestRpc.TestCallWithPasswordProtectedKey/SSL_UnixSocket
I20260927 06:59:32.602224 12969 acceptor_pool.cc:254] collecting diagnostics on the listening RPC socket unix:/tmp/dist-test-tasktg1VHa/test-tmp/rpc-test-df160990a0c142c79f5b7d0b8387fc97.sock every 8 connection(s)
I20260927 06:59:32.602262 12970 acceptor_pool.cc:254] collecting diagnostics on the listening RPC socket unix:/tmp/dist-test-tasktg1VHa/test-tmp/rpc-test-df160990a0c142c79f5b7d0b8387fc97.sock every 8 connection(s)
W20260927 06:59:32.613262 12966 connection.cc:196] Error closing socket: Network error: TlsSocket::Close: Broken pipe
[       OK ] Parameters/TestRpc.TestCallWithPasswordProtectedKey/SSL_UnixSocket (26 ms)
[ RUN      ] Parameters/TestRpc.TestCallToBadServer/SSL_UnixSocket
I20260927 06:59:32.622907 12908 rpc-test.cc:394] Status: Network error: Client connection negotiation failed: client connection to 0.0.0.0:0: connect: Connection refused (error 111)
I20260927 06:59:32.623227 12908 rpc-test.cc:394] Status: Network error: Client connection negotiation failed: client connection to 0.0.0.0:0: connect: Connection refused (error 111)
I20260927 06:59:32.623466 12908 rpc-test.cc:394] Status: Network error: Client connection negotiation failed: client connection to 0.0.0.0:0: connect: Connection refused (error 111)
I20260927 06:59:32.623646 12908 rpc-test.cc:394] Status: Network error: Client connection negotiation failed: client connection to 0.0.0.0:0: connect: Connection refused (error 111)
I20260927 06:59:32.623806 12908 rpc-test.cc:394] Status: Network error: Client connection negotiation failed: client connection to 0.0.0.0:0: connect: Connection refused (error 111)
[       OK ] Parameters/TestRpc.TestCallToBadServer/SSL_UnixSocket (10 ms)
[ RUN      ] Parameters/TestRpc.TestWrongService/SSL_UnixSocket
I20260927 06:59:32.631661 13005 acceptor_pool.cc:254] collecting diagnostics on the listening RPC socket unix:/tmp/dist-test-tasktg1VHa/test-tmp/rpc-test-98bd4822bb624f43b27160735b817315.sock every 8 connection(s)
I20260927 06:59:32.631646 13004 acceptor_pool.cc:254] collecting diagnostics on the listening RPC socket unix:/tmp/dist-test-tasktg1VHa/test-tmp/rpc-test-98bd4822bb624f43b27160735b817315.sock every 8 connection(s)
I20260927 06:59:32.654114 13001 messenger.cc:345] service WrongServiceName not registered on TestServer
W20260927 06:59:32.654747 13001 connection.cc:196] Error closing socket: Network error: TlsSocket::Close: Broken pipe
[       OK ] Parameters/TestRpc.TestWrongService/SSL_UnixSocket (31 ms)
[ RUN      ] Parameters/TestRpc.TestConnectionKeepalive/SSL_UnixSocket
I20260927 06:59:32.679404 13028 acceptor_pool.cc:254] collecting diagnostics on the listening RPC socket unix:/tmp/dist-test-tasktg1VHa/test-tmp/rpc-test-0fd466e2348348a3a9e76b29cfac30c0.sock every 8 connection(s)
I20260927 06:59:32.679383 13027 acceptor_pool.cc:254] collecting diagnostics on the listening RPC socket unix:/tmp/dist-test-tasktg1VHa/test-tmp/rpc-test-0fd466e2348348a3a9e76b29cfac30c0.sock every 8 connection(s)
I20260927 06:59:32.679543 12908 rpc-test.cc:488] Connecting to unix:/tmp/dist-test-tasktg1VHa/test-tmp/rpc-test-0fd466e2348348a3a9e76b29cfac30c0.sock
W20260927 06:59:33.157761 13040 connection.cc:196] Error closing socket: Network error: TlsSocket::Close: Broken pipe
[       OK ] Parameters/TestRpc.TestConnectionKeepalive/SSL_UnixSocket (1057 ms)
[ RUN      ] Parameters/TestRpc.TestClientConnectionMetrics/SSL_UnixSocket
I20260927 06:59:33.728207 13052 acceptor_pool.cc:254] collecting diagnostics on the listening RPC socket unix:/tmp/dist-test-tasktg1VHa/test-tmp/rpc-test-6e9fde46c2984b2cbdf9120dea6eebb4.sock every 8 connection(s)
I20260927 06:59:33.728240 13053 acceptor_pool.cc:254] collecting diagnostics on the listening RPC socket unix:/tmp/dist-test-tasktg1VHa/test-tmp/rpc-test-6e9fde46c2984b2cbdf9120dea6eebb4.sock every 8 connection(s)
I20260927 06:59:33.728372 12908 rpc-test.cc:569] Connecting to unix:/tmp/dist-test-tasktg1VHa/test-tmp/rpc-test-6e9fde46c2984b2cbdf9120dea6eebb4.sock
W20260927 06:59:41.630497 13049 connection.cc:196] Error closing socket: Network error: TlsSocket::Close: Broken pipe
[       OK ] Parameters/TestRpc.TestClientConnectionMetrics/SSL_UnixSocket (7918 ms)
[ RUN      ] Parameters/TestRpc.TestCredentialsPolicy/SSL_UnixSocket
I20260927 06:59:41.644347 13075 acceptor_pool.cc:254] collecting diagnostics on the listening RPC socket unix:/tmp/dist-test-tasktg1VHa/test-tmp/rpc-test-95a63b7acaa34591b8a6d818dbf3c734.sock every 8 connection(s)
I20260927 06:59:41.644383 13076 acceptor_pool.cc:254] collecting diagnostics on the listening RPC socket unix:/tmp/dist-test-tasktg1VHa/test-tmp/rpc-test-95a63b7acaa34591b8a6d818dbf3c734.sock every 8 connection(s)
I20260927 06:59:41.644543 12908 rpc-test.cc:700] Connecting to unix:/tmp/dist-test-tasktg1VHa/test-tmp/rpc-test-95a63b7acaa34591b8a6d818dbf3c734.sock
W20260927 06:59:41.661806 13074 connection.cc:196] Error closing socket: Network error: TlsSocket::Close: Broken pipe
[       OK ] Parameters/TestRpc.TestCredentialsPolicy/SSL_UnixSocket (35 ms)
[ RUN      ] Parameters/TestRpc.TestCallLongerThanKeepalive/SSL_UnixSocket
I20260927 06:59:41.682605 13100 acceptor_pool.cc:254] collecting diagnostics on the listening RPC socket unix:/tmp/dist-test-tasktg1VHa/test-tmp/rpc-test-fc09bbb7f17445ceac03043615dfe28d.sock every 8 connection(s)
I20260927 06:59:41.682636 13101 acceptor_pool.cc:254] collecting diagnostics on the listening RPC socket unix:/tmp/dist-test-tasktg1VHa/test-tmp/rpc-test-fc09bbb7f17445ceac03043615dfe28d.sock every 8 connection(s)
I20260927 06:59:41.699334 13104 rpc-test-base.h:222] got call: sleep_micros: 3000000 deferred: true
I20260927 06:59:44.700038 13104 rpcz_store.cc:275] Call kudu.rpc.GenericCalculatorService.Sleep from unix:<unnamed> (request call id 0) took 3000 ms. Trace:
I20260927 06:59:44.700145 13104 rpcz_store.cc:276] 0927 06:59:41.699273 (+     0us) service_pool.cc:170] Inserting onto call queue
0927 06:59:41.699309 (+    36us) service_pool.cc:227] Handling call
0927 06:59:44.700022 (+3000713us) inbound_call.cc:173] Queueing success response
Metrics: {}
[       OK ] Parameters/TestRpc.TestCallLongerThanKeepalive/SSL_UnixSocket (3035 ms)
[ RUN      ] Parameters/TestRpc.TestRpcSidecar/SSL_UnixSocket
I20260927 06:59:44.717092 13125 acceptor_pool.cc:254] collecting diagnostics on the listening RPC socket unix:/tmp/dist-test-tasktg1VHa/test-tmp/rpc-test-0036a6b8a53f4d728e906564a0a6a8cd.sock every 8 connection(s)
I20260927 06:59:44.717146 13126 acceptor_pool.cc:254] collecting diagnostics on the listening RPC socket unix:/tmp/dist-test-tasktg1VHa/test-tmp/rpc-test-0036a6b8a53f4d728e906564a0a6a8cd.sock every 8 connection(s)
W20260927 06:59:44.751639 13122 connection.cc:196] Error closing socket: Network error: TlsSocket::Close: Broken pipe
[       OK ] Parameters/TestRpc.TestRpcSidecar/SSL_UnixSocket (50 ms)
[ RUN      ] Parameters/TestRpc.TestRpcSidecarLimits/SSL_UnixSocket
I20260927 06:59:46.426440 13150 acceptor_pool.cc:254] collecting diagnostics on the listening RPC socket unix:/tmp/dist-test-tasktg1VHa/test-tmp/rpc-test-eac0e52bc0de4f1baca9a1cfcd22c61d.sock every 8 connection(s)
I20260927 06:59:46.426486 13151 acceptor_pool.cc:254] collecting diagnostics on the listening RPC socket unix:/tmp/dist-test-tasktg1VHa/test-tmp/rpc-test-eac0e52bc0de4f1baca9a1cfcd22c61d.sock every 8 connection(s)
W20260927 06:59:46.456313 12908 serialization.cc:72] Serialized kudu.rpc_test.PushStringsRequestPB (2147483654 bytes) is larger than the maximum configured RPC message size (52428800 bytes). Sending anyway, but peer may reject the data.
W20260927 06:59:46.459424 13147 connection.cc:535] server connection from unix:<unnamed> recv error: Network error: RPC frame had a length of 2147483714, but we only support messages up to 52428800 bytes long.
W20260927 06:59:46.459481 13147 connection.cc:158] shutting down server connection from unix:<unnamed> with pending inbound data: 4/2147483714 bytes received; last active 0 ns ago: status Network error: RPC frame had a length of 2147483714, but we only support messages up to 52428800 bytes long.
W20260927 06:59:46.459623 13163 connection.cc:698] client connection to unix:/tmp/dist-test-tasktg1VHa/test-tmp/rpc-test-eac0e52bc0de4f1baca9a1cfcd22c61d.sock send error: Network error: failed to write to TLS socket: Broken pipe
W20260927 06:59:46.459746 13163 connection.cc:196] Error closing socket: Network error: TlsSocket::Close: Success
I20260927 06:59:46.480389 13175 acceptor_pool.cc:254] collecting diagnostics on the listening RPC socket unix:/tmp/dist-test-tasktg1VHa/test-tmp/rpc-test-eac0e52bc0de4f1baca9a1cfcd22c61d.sock every 8 connection(s)
I20260927 06:59:46.480508 13176 acceptor_pool.cc:254] collecting diagnostics on the listening RPC socket unix:/tmp/dist-test-tasktg1VHa/test-tmp/rpc-test-eac0e52bc0de4f1baca9a1cfcd22c61d.sock every 8 connection(s)
W20260927 06:59:50.746133 13172 connection.cc:577] server connection from unix:<unnamed>: received bad data: 'Corruption: Invalid packet: message had a length of 2147483710, but we only support messages up to 2147483647 bytes
'
W20260927 06:59:50.746388 13188 connection.cc:196] Error closing socket: Network error: TlsSocket::Close: Broken pipe
[       OK ] Parameters/TestRpc.TestRpcSidecarLimits/SSL_UnixSocket (5995 ms)
[ RUN      ] Parameters/TestRpc.TestCallTimeoutDoesntAffectNegotiation/SSL_UnixSocket
I20260927 06:59:50.756542 13200 acceptor_pool.cc:254] collecting diagnostics on the listening RPC socket unix:/tmp/dist-test-tasktg1VHa/test-tmp/rpc-test-b9bebf75454e4d95b2f1edaa3b31a367.sock every 8 connection(s)
I20260927 06:59:50.756592 13201 acceptor_pool.cc:254] collecting diagnostics on the listening RPC socket unix:/tmp/dist-test-tasktg1VHa/test-tmp/rpc-test-b9bebf75454e4d95b2f1edaa3b31a367.sock every 8 connection(s)
W20260927 06:59:50.773501 13196 negotiation.cc:266] Injecting 500ms delay in negotiation
I20260927 06:59:50.823782 12908 rpc-test-base.h:595] status: Timed out: connection negotiation to unix:/tmp/dist-test-tasktg1VHa/test-tmp/rpc-test-b9bebf75454e4d95b2f1edaa3b31a367.sock for RPC Sleep timed out after 0.050s (ON_OUTBOUND_QUEUE), seconds elapsed: 0.0505894
[       OK ] Parameters/TestRpc.TestCallTimeoutDoesntAffectNegotiation/SSL_UnixSocket (529 ms)
[ RUN      ] Parameters/TestRpc.TestRpcHandlerLatencyMetric/SSL_UnixSocket
I20260927 06:59:51.296906 13226 acceptor_pool.cc:254] collecting diagnostics on the listening RPC socket unix:/tmp/dist-test-tasktg1VHa/test-tmp/rpc-test-4a25813ed34e4c15a6d6e1b6d3b25211.sock every 8 connection(s)
I20260927 06:59:51.296892 13225 acceptor_pool.cc:254] collecting diagnostics on the listening RPC socket unix:/tmp/dist-test-tasktg1VHa/test-tmp/rpc-test-4a25813ed34e4c15a6d6e1b6d3b25211.sock every 8 connection(s)
I20260927 06:59:51.328439 12908 rpc-test.cc:1236] Sleep() min lat: 20267
I20260927 06:59:51.328510 12908 rpc-test.cc:1237] Sleep() mean lat: 20267
I20260927 06:59:51.328540 12908 rpc-test.cc:1238] Sleep() max lat: 20267
I20260927 06:59:51.328553 12908 rpc-test.cc:1239] Sleep() #calls: 1
W20260927 06:59:51.329085 13222 connection.cc:196] Error closing socket: Network error: TlsSocket::Close: Broken pipe
[       OK ] Parameters/TestRpc.TestRpcHandlerLatencyMetric/SSL_UnixSocket (51 ms)
[ RUN      ] Parameters/TestRpc.TimedOutOnResponseMetricServiceQueue/SSL_UnixSocket
I20260927 06:59:51.351996 13251 acceptor_pool.cc:254] collecting diagnostics on the listening RPC socket unix:/tmp/dist-test-tasktg1VHa/test-tmp/rpc-test-c0256bd0af504634b06e7c9af2034b67.sock every 8 connection(s)
I20260927 06:59:51.352038 13252 acceptor_pool.cc:254] collecting diagnostics on the listening RPC socket unix:/tmp/dist-test-tasktg1VHa/test-tmp/rpc-test-c0256bd0af504634b06e7c9af2034b67.sock every 8 connection(s)
W20260927 06:59:51.408806 13253 rpcz_store.cc:267] Call kudu.rpc_test.CalculatorService.Sleep from unix:<unnamed> (request call id 2) took 20 ms (client timeout 20 ms). Trace:
W20260927 06:59:51.408910 13253 rpcz_store.cc:269] 0927 06:59:51.388547 (+     0us) service_pool.cc:170] Inserting onto call queue
0927 06:59:51.408775 (+ 20228us) service_pool.cc:214] Skipping call since client already timed out
0927 06:59:51.408787 (+    12us) inbound_call.cc:173] Queueing failure response
Metrics: {}
W20260927 06:59:51.409531 13248 connection.cc:196] Error closing socket: Network error: TlsSocket::Close: Broken pipe
[       OK ] Parameters/TestRpc.TimedOutOnResponseMetricServiceQueue/SSL_UnixSocket (80 ms)
[ RUN      ] Parameters/TestRpc.RpcPendingConnectionsMetric/SSL_UnixSocket
I20260927 06:59:51.415192 13274 acceptor_pool.cc:254] collecting diagnostics on the listening RPC socket 0.0.0.0:43877 every 8 connection(s)
I20260927 06:59:51.415227 13275 acceptor_pool.cc:254] collecting diagnostics on the listening RPC socket 0.0.0.0:43877 every 8 connection(s)
W20260927 06:59:51.415774 13270 negotiation.cc:337] Failed RPC negotiation. Trace:
0927 06:59:51.415604 (+     0us) reactor.cc:625] Submitting negotiation task for server connection from 127.0.0.1:60652 (local address 127.0.0.1:43877)
0927 06:59:51.415644 (+    40us) server_negotiation.cc:206] Beginning negotiation
0927 06:59:51.415645 (+     1us) server_negotiation.cc:399] Waiting for connection header
0927 06:59:51.415719 (+    74us) negotiation.cc:327] Negotiation complete: Network error: Server connection negotiation failed: server connection from 127.0.0.1:60652: BlockingRecv error: recv got EOF from 127.0.0.1:60652 (error 108)
Metrics: {"server-negotiator.queue_time_us":13}
[       OK ] Parameters/TestRpc.RpcPendingConnectionsMetric/SSL_UnixSocket (17 ms)
[ RUN      ] Parameters/TestRpc.TestRpcContextClientDeadline/SSL_UnixSocket
I20260927 06:59:51.445183 13290 acceptor_pool.cc:254] collecting diagnostics on the listening RPC socket unix:/tmp/dist-test-tasktg1VHa/test-tmp/rpc-test-8ee9c5dc87824ef482b9601f1076c044.sock every 8 connection(s)
I20260927 06:59:51.445230 13291 acceptor_pool.cc:254] collecting diagnostics on the listening RPC socket unix:/tmp/dist-test-tasktg1VHa/test-tmp/rpc-test-8ee9c5dc87824ef482b9601f1076c044.sock every 8 connection(s)
[       OK ] Parameters/TestRpc.TestRpcContextClientDeadline/SSL_UnixSocket (49 ms)
[ RUN      ] Parameters/TestRpc.TestApplicationFeatureFlagUnsupportedServer/SSL_UnixSocket
I20260927 06:59:51.488503 13315 acceptor_pool.cc:254] collecting diagnostics on the listening RPC socket unix:/tmp/dist-test-tasktg1VHa/test-tmp/rpc-test-59c71755e06e40cfbb80175e8d214cae.sock every 8 connection(s)
I20260927 06:59:51.488545 13316 acceptor_pool.cc:254] collecting diagnostics on the listening RPC socket unix:/tmp/dist-test-tasktg1VHa/test-tmp/rpc-test-59c71755e06e40cfbb80175e8d214cae.sock every 8 connection(s)
[       OK ] Parameters/TestRpc.TestApplicationFeatureFlagUnsupportedServer/SSL_UnixSocket (32 ms)
[ RUN      ] Parameters/TestRpc.TestCancellationAsync/SSL_UnixSocket
I20260927 06:59:51.533089 13340 acceptor_pool.cc:254] collecting diagnostics on the listening RPC socket unix:/tmp/dist-test-tasktg1VHa/test-tmp/rpc-test-376fb750ed984b538b9934e4dc3dd7eb.sock every 8 connection(s)
I20260927 06:59:51.533129 13341 acceptor_pool.cc:254] collecting diagnostics on the listening RPC socket unix:/tmp/dist-test-tasktg1VHa/test-tmp/rpc-test-376fb750ed984b538b9934e4dc3dd7eb.sock every 8 connection(s)
I20260927 06:59:51.533245 12908 rpc-test.cc:1716] Connecting to unix:/tmp/dist-test-tasktg1VHa/test-tmp/rpc-test-376fb750ed984b538b9934e4dc3dd7eb.sock
I20260927 06:59:51.549587 12908 test_util.cc:268] Using random seed: 2130225807
I20260927 06:59:51.563810 13344 rpc-test-base.h:240] got call: sleep_micros: 500 pattern: 4294967295 num_repetitions: 2097152 sidecar_idx: 0
I20260927 06:59:51.574350 13344 rpc-test-base.h:240] got call: sleep_micros: 500 pattern: 4294967295 num_repetitions: 2097152 sidecar_idx: 0
I20260927 06:59:51.584923 13344 rpc-test-base.h:240] got call: sleep_micros: 500 pattern: 4294967295 num_repetitions: 2097152 sidecar_idx: 0
I20260927 06:59:51.595405 13344 rpc-test-base.h:240] got call: sleep_micros: 500 pattern: 4294967295 num_repetitions: 2097152 sidecar_idx: 0
I20260927 06:59:51.605957 13344 rpc-test-base.h:240] got call: sleep_micros: 500 pattern: 4294967295 num_repetitions: 2097152 sidecar_idx: 0
I20260927 06:59:51.616263 13344 rpc-test-base.h:240] got call: sleep_micros: 500 pattern: 4294967295 num_repetitions: 2097152 sidecar_idx: 0
I20260927 06:59:51.626817 13344 rpc-test-base.h:240] got call: sleep_micros: 500 pattern: 4294967295 num_repetitions: 2097152 sidecar_idx: 0
I20260927 06:59:51.637142 13344 rpc-test-base.h:240] got call: sleep_micros: 500 pattern: 4294967295 num_repetitions: 2097152 sidecar_idx: 0
W20260927 06:59:51.638823 13337 connection.cc:196] Error closing socket: Network error: TlsSocket::Close: Broken pipe
W20260927 06:59:51.640553 13337 connection.cc:441] server connection from unix:<unnamed> torn down before Call kudu.rpc.GenericCalculatorService.SleepWithSidecar from unix:<unnamed> (request call id 9) could send its response
[       OK ] Parameters/TestRpc.TestCancellationAsync/SSL_UnixSocket (131 ms)
[ RUN      ] Parameters/TestRpc.TestPerformanceBySocketType/SSL_UnixSocket
I20260927 06:59:51.659817 13365 acceptor_pool.cc:254] collecting diagnostics on the listening RPC socket unix:/tmp/dist-test-tasktg1VHa/test-tmp/rpc-test-cc654b96a0e24865869c4e21540a8f7b.sock every 8 connection(s)
I20260927 06:59:51.659860 13366 acceptor_pool.cc:254] collecting diagnostics on the listening RPC socket unix:/tmp/dist-test-tasktg1VHa/test-tmp/rpc-test-cc654b96a0e24865869c4e21540a8f7b.sock every 8 connection(s)
I20260927 06:59:51.659998 12908 rpc-test.cc:1846] Connecting to unix:/tmp/dist-test-tasktg1VHa/test-tmp/rpc-test-cc654b96a0e24865869c4e21540a8f7b.sock
I20260927 06:59:52.970387 12908 rpc-test.cc:1859] Sending 1024MB via ssl-enabled unix socket: real 1.305s	user 1.470s	sys 0.851s
I20260927 06:59:54.215853 12908 rpc-test.cc:1859] Sending 1024MB via ssl-enabled unix socket: real 1.245s	user 1.421s	sys 0.793s
I20260927 06:59:55.507511 12908 rpc-test.cc:1859] Sending 1024MB via ssl-enabled unix socket: real 1.292s	user 1.513s	sys 0.781s
I20260927 06:59:56.753805 12908 rpc-test.cc:1859] Sending 1024MB via ssl-enabled unix socket: real 1.246s	user 1.341s	sys 0.877s
I20260927 06:59:57.997980 12908 rpc-test.cc:1859] Sending 1024MB via ssl-enabled unix socket: real 1.244s	user 1.497s	sys 0.722s
W20260927 06:59:57.998590 13362 connection.cc:196] Error closing socket: Network error: TlsSocket::Close: Broken pipe
[       OK ] Parameters/TestRpc.TestPerformanceBySocketType/SSL_UnixSocket (6358 ms)
[----------] 20 tests from Parameters/TestRpc (25458 ms total)

[----------] 1 test from Parameters/TestRpcSocketTxRxQueue
[ RUN      ] Parameters/TestRpcSocketTxRxQueue.AcceptorRxQueueSizeMetric/0
I20260927 06:59:58.004616 13390 acceptor_pool.cc:254] collecting diagnostics on the listening RPC socket 0.0.0.0:42983 every 1 connection(s)
I20260927 06:59:58.004673 13391 acceptor_pool.cc:254] collecting diagnostics on the listening RPC socket 0.0.0.0:42983 every 1 connection(s)
W20260927 06:59:58.005154 13386 negotiation.cc:337] Failed RPC negotiation. Trace:
0927 06:59:58.005022 (+     0us) reactor.cc:625] Submitting negotiation task for server connection from 127.0.0.1:60948 (local address 127.0.0.1:42983)
0927 06:59:58.005068 (+    46us) server_negotiation.cc:206] Beginning negotiation
0927 06:59:58.005070 (+     2us) server_negotiation.cc:399] Waiting for connection header
0927 06:59:58.005125 (+    55us) negotiation.cc:327] Negotiation complete: Network error: Server connection negotiation failed: server connection from 127.0.0.1:60948: BlockingRecv error: recv got EOF from 127.0.0.1:60948 (error 108)
Metrics: {"server-negotiator.queue_time_us":16}
[       OK ] Parameters/TestRpcSocketTxRxQueue.AcceptorRxQueueSizeMetric/0 (7 ms)
[----------] 1 test from Parameters/TestRpcSocketTxRxQueue (7 ms total)

[----------] Global test environment tear-down
[==========] 21 tests from 2 test suites ran. (25466 ms total)
[  PASSED  ] 20 tests.
[  FAILED  ] 1 test, listed below:
[  FAILED  ] Parameters/TestRpc.TestCallWithChainCertAndChainCA/SSL_UnixSocket, where GetParam() = (true, true)

 1 FAILED TEST