Diagnosed failure

Parameters/TestRpc.TestCallWithChainCertAndChainCA/SSL_UnixSocket: /data0/somelongdirectorytoavoidrpathissues/src/kudu/src/kudu/rpc/rpc-test.cc:270: Failure
Failed
Bad status: Runtime error: could not verify certificate chain (error with cert: subject=CN = localhost, ST = sadfjas, C = AS, emailAddress = sdflkdsajf, O = lskdfjlsad, OU = sldfkja, issuer=C = AS, ST = ASDfkjdhf, L = lskdjf, O = saldfja, OU = skdjf, CN = localhost, emailAddress = sadjflkadsj): : certificate has expired
Google Test trace:
/data0/somelongdirectorytoavoidrpathissues/src/kudu/src/kudu/rpc/rpc-test.cc:267: Connecting to unix:/tmp/dist-test-taskql3Tci/test-tmp/rpc-test-db6ff19501914a0885e1e5e039caed2f.sock
I20260925 21:59:43.351878 21433 test_util.cc:175] -----------------------------------------------
I20260925 21:59:43.352042 21433 test_util.cc:176] Had fatal failures, leaving test files at /tmp/dist-test-taskql3Tci/test-tmp/rpc-test.6.Parameters_TestRpc.TestCallWithChainCertAndChainCA_SSL_UnixSocket.1790373581854835-21433-0

Full log

Note: This is test shard 7 of 8.
[==========] Running 21 tests from 2 test suites.
[----------] Global test environment set-up.
[----------] 20 tests from Parameters/TestRpc
[ RUN      ] Parameters/TestRpc.TestMessengerCreateDestroy/SSL_UnixSocket
WARNING: Logging before InitGoogleLogging() is written to STDERR
I20260925 21:59:41.973568 21433 rpc-test.cc:169] started messenger TestCreateDestroy
[       OK ] Parameters/TestRpc.TestMessengerCreateDestroy/SSL_UnixSocket (1292 ms)
[ RUN      ] Parameters/TestRpc.TestNegotiationDeadlock/SSL_UnixSocket
I20260925 21:59:43.239894 21455 acceptor_pool.cc:254] collecting diagnostics on the listening RPC socket unix:/tmp/dist-test-taskql3Tci/test-tmp/rpc-test-3350dc6864ad4d0d9cd31e3ea1a21a0f.sock every 8 connection(s)
I20260925 21:59:43.241518 21456 acceptor_pool.cc:254] collecting diagnostics on the listening RPC socket unix:/tmp/dist-test-taskql3Tci/test-tmp/rpc-test-3350dc6864ad4d0d9cd31e3ea1a21a0f.sock every 8 connection(s)
[       OK ] Parameters/TestRpc.TestNegotiationDeadlock/SSL_UnixSocket (94 ms)
[ RUN      ] Parameters/TestRpc.TestCallWithChainCertAndChainCA/SSL_UnixSocket
I20260925 21:59:43.321051 21471 acceptor_pool.cc:254] collecting diagnostics on the listening RPC socket unix:/tmp/dist-test-taskql3Tci/test-tmp/rpc-test-db6ff19501914a0885e1e5e039caed2f.sock every 8 connection(s)
I20260925 21:59:43.323180 21472 acceptor_pool.cc:254] collecting diagnostics on the listening RPC socket unix:/tmp/dist-test-taskql3Tci/test-tmp/rpc-test-db6ff19501914a0885e1e5e039caed2f.sock every 8 connection(s)
/data0/somelongdirectorytoavoidrpathissues/src/kudu/src/kudu/rpc/rpc-test.cc:270: Failure
Failed
Bad status: Runtime error: could not verify certificate chain (error with cert: subject=CN = localhost, ST = sadfjas, C = AS, emailAddress = sdflkdsajf, O = lskdfjlsad, OU = sldfkja, issuer=C = AS, ST = ASDfkjdhf, L = lskdjf, O = saldfja, OU = skdjf, CN = localhost, emailAddress = sadjflkadsj): : certificate has expired
Google Test trace:
/data0/somelongdirectorytoavoidrpathissues/src/kudu/src/kudu/rpc/rpc-test.cc:267: Connecting to unix:/tmp/dist-test-taskql3Tci/test-tmp/rpc-test-db6ff19501914a0885e1e5e039caed2f.sock
I20260925 21:59:43.351878 21433 test_util.cc:175] -----------------------------------------------
I20260925 21:59:43.352042 21433 test_util.cc:176] Had fatal failures, leaving test files at /tmp/dist-test-taskql3Tci/test-tmp/rpc-test.6.Parameters_TestRpc.TestCallWithChainCertAndChainCA_SSL_UnixSocket.1790373581854835-21433-0
[  FAILED  ] Parameters/TestRpc.TestCallWithChainCertAndChainCA/SSL_UnixSocket, where GetParam() = (true, true) (56 ms)
[ RUN      ] Parameters/TestRpc.TestCallWithPasswordProtectedKey/SSL_UnixSocket
I20260925 21:59:43.377126 21496 acceptor_pool.cc:254] collecting diagnostics on the listening RPC socket unix:/tmp/dist-test-taskql3Tci/test-tmp/rpc-test-0153cd1cd5fa44c98fb1f534aae46809.sock every 8 connection(s)
I20260925 21:59:43.377897 21497 acceptor_pool.cc:254] collecting diagnostics on the listening RPC socket unix:/tmp/dist-test-taskql3Tci/test-tmp/rpc-test-0153cd1cd5fa44c98fb1f534aae46809.sock every 8 connection(s)
W20260925 21:59:43.420735 21493 connection.cc:196] Error closing socket: Network error: TlsSocket::Close: Broken pipe
[       OK ] Parameters/TestRpc.TestCallWithPasswordProtectedKey/SSL_UnixSocket (74 ms)
[ RUN      ] Parameters/TestRpc.TestCallToBadServer/SSL_UnixSocket
I20260925 21:59:43.461303 21433 rpc-test.cc:394] Status: Network error: Client connection negotiation failed: client connection to 0.0.0.0:0: connect: Connection refused (error 111)
I20260925 21:59:43.462738 21433 rpc-test.cc:394] Status: Network error: Client connection negotiation failed: client connection to 0.0.0.0:0: connect: Connection refused (error 111)
I20260925 21:59:43.464015 21433 rpc-test.cc:394] Status: Network error: Client connection negotiation failed: client connection to 0.0.0.0:0: connect: Connection refused (error 111)
I20260925 21:59:43.465262 21433 rpc-test.cc:394] Status: Network error: Client connection negotiation failed: client connection to 0.0.0.0:0: connect: Connection refused (error 111)
I20260925 21:59:43.466539 21433 rpc-test.cc:394] Status: Network error: Client connection negotiation failed: client connection to 0.0.0.0:0: connect: Connection refused (error 111)
[       OK ] Parameters/TestRpc.TestCallToBadServer/SSL_UnixSocket (42 ms)
[ RUN      ] Parameters/TestRpc.TestWrongService/SSL_UnixSocket
I20260925 21:59:43.489136 21531 acceptor_pool.cc:254] collecting diagnostics on the listening RPC socket unix:/tmp/dist-test-taskql3Tci/test-tmp/rpc-test-f866eae7912a43a1b62a69bd63642fbe.sock every 8 connection(s)
I20260925 21:59:43.490059 21532 acceptor_pool.cc:254] collecting diagnostics on the listening RPC socket unix:/tmp/dist-test-taskql3Tci/test-tmp/rpc-test-f866eae7912a43a1b62a69bd63642fbe.sock every 8 connection(s)
I20260925 21:59:43.520962 21528 messenger.cc:345] service WrongServiceName not registered on TestServer
[       OK ] Parameters/TestRpc.TestWrongService/SSL_UnixSocket (59 ms)
[ RUN      ] Parameters/TestRpc.TestConnectionKeepalive/SSL_UnixSocket
I20260925 21:59:43.558081 21554 acceptor_pool.cc:254] collecting diagnostics on the listening RPC socket unix:/tmp/dist-test-taskql3Tci/test-tmp/rpc-test-15822cb620434cbe9cca9cf4f0f07dd4.sock every 8 connection(s)
I20260925 21:59:43.558845 21555 acceptor_pool.cc:254] collecting diagnostics on the listening RPC socket unix:/tmp/dist-test-taskql3Tci/test-tmp/rpc-test-15822cb620434cbe9cca9cf4f0f07dd4.sock every 8 connection(s)
I20260925 21:59:43.562493 21433 rpc-test.cc:488] Connecting to unix:/tmp/dist-test-taskql3Tci/test-tmp/rpc-test-15822cb620434cbe9cca9cf4f0f07dd4.sock
W20260925 21:59:44.032402 21567 connection.cc:196] Error closing socket: Network error: TlsSocket::Close: Broken pipe
[       OK ] Parameters/TestRpc.TestConnectionKeepalive/SSL_UnixSocket (1072 ms)
[ RUN      ] Parameters/TestRpc.TestClientConnectionMetrics/SSL_UnixSocket
I20260925 21:59:44.626278 21579 acceptor_pool.cc:254] collecting diagnostics on the listening RPC socket unix:/tmp/dist-test-taskql3Tci/test-tmp/rpc-test-5cdd63150b7747058367f5d9c43c71ad.sock every 8 connection(s)
I20260925 21:59:44.627013 21580 acceptor_pool.cc:254] collecting diagnostics on the listening RPC socket unix:/tmp/dist-test-taskql3Tci/test-tmp/rpc-test-5cdd63150b7747058367f5d9c43c71ad.sock every 8 connection(s)
I20260925 21:59:44.630160 21433 rpc-test.cc:569] Connecting to unix:/tmp/dist-test-taskql3Tci/test-tmp/rpc-test-5cdd63150b7747058367f5d9c43c71ad.sock
W20260925 22:02:01.713084 21576 connection.cc:196] Error closing socket: Network error: TlsSocket::Close: Broken pipe
[       OK ] Parameters/TestRpc.TestClientConnectionMetrics/SSL_UnixSocket (137119 ms)
[ RUN      ] Parameters/TestRpc.TestCredentialsPolicy/SSL_UnixSocket
I20260925 22:02:01.758257 21615 acceptor_pool.cc:254] collecting diagnostics on the listening RPC socket unix:/tmp/dist-test-taskql3Tci/test-tmp/rpc-test-68213abd96ce4e689fd8d68b2f330ef7.sock every 8 connection(s)
I20260925 22:02:01.759111 21616 acceptor_pool.cc:254] collecting diagnostics on the listening RPC socket unix:/tmp/dist-test-taskql3Tci/test-tmp/rpc-test-68213abd96ce4e689fd8d68b2f330ef7.sock every 8 connection(s)
I20260925 22:02:01.762286 21433 rpc-test.cc:700] Connecting to unix:/tmp/dist-test-taskql3Tci/test-tmp/rpc-test-68213abd96ce4e689fd8d68b2f330ef7.sock
W20260925 22:02:01.792358 21614 connection.cc:196] Error closing socket: Network error: TlsSocket::Close: Broken pipe
W20260925 22:02:01.806396 21614 connection.cc:196] Error closing socket: Network error: TlsSocket::Close: Broken pipe
[       OK ] Parameters/TestRpc.TestCredentialsPolicy/SSL_UnixSocket (93 ms)
[ RUN      ] Parameters/TestRpc.TestCallLongerThanKeepalive/SSL_UnixSocket
I20260925 22:02:01.832985 21640 acceptor_pool.cc:254] collecting diagnostics on the listening RPC socket unix:/tmp/dist-test-taskql3Tci/test-tmp/rpc-test-167f26ed7b0f47cc99e6aa8847f9f788.sock every 8 connection(s)
I20260925 22:02:01.833668 21641 acceptor_pool.cc:254] collecting diagnostics on the listening RPC socket unix:/tmp/dist-test-taskql3Tci/test-tmp/rpc-test-167f26ed7b0f47cc99e6aa8847f9f788.sock every 8 connection(s)
I20260925 22:02:01.860563 21644 rpc-test-base.h:222] got call: sleep_micros: 3000000 deferred: true
I20260925 22:02:04.864972 21644 rpcz_store.cc:275] Call kudu.rpc.GenericCalculatorService.Sleep from unix:<unnamed> (request call id 0) took 3004 ms. Trace:
I20260925 22:02:04.865442 21644 rpcz_store.cc:276] 0925 22:02:01.860390 (+     0us) service_pool.cc:170] Inserting onto call queue
0925 22:02:01.860495 (+   105us) service_pool.cc:227] Handling call
0925 22:02:04.864809 (+3004314us) inbound_call.cc:173] Queueing success response
Metrics: {}
W20260925 22:02:04.870154 21637 connection.cc:196] Error closing socket: Network error: TlsSocket::Close: Broken pipe
[       OK ] Parameters/TestRpc.TestCallLongerThanKeepalive/SSL_UnixSocket (3066 ms)
[ RUN      ] Parameters/TestRpc.TestRpcSidecar/SSL_UnixSocket
I20260925 22:02:04.912362 21666 acceptor_pool.cc:254] collecting diagnostics on the listening RPC socket unix:/tmp/dist-test-taskql3Tci/test-tmp/rpc-test-94383ebc77a44b32bd44b90795ae1ddd.sock every 8 connection(s)
I20260925 22:02:04.913225 21667 acceptor_pool.cc:254] collecting diagnostics on the listening RPC socket unix:/tmp/dist-test-taskql3Tci/test-tmp/rpc-test-94383ebc77a44b32bd44b90795ae1ddd.sock every 8 connection(s)
W20260925 22:02:05.451766 21663 connection.cc:196] Error closing socket: Network error: TlsSocket::Close: Broken pipe
[       OK ] Parameters/TestRpc.TestRpcSidecar/SSL_UnixSocket (575 ms)
[ RUN      ] Parameters/TestRpc.TestRpcSidecarLimits/SSL_UnixSocket
I20260925 22:02:22.861279 21693 acceptor_pool.cc:254] collecting diagnostics on the listening RPC socket unix:/tmp/dist-test-taskql3Tci/test-tmp/rpc-test-b10b81641d3f474a9066979e8d9005da.sock every 8 connection(s)
I20260925 22:02:22.862111 21694 acceptor_pool.cc:254] collecting diagnostics on the listening RPC socket unix:/tmp/dist-test-taskql3Tci/test-tmp/rpc-test-b10b81641d3f474a9066979e8d9005da.sock every 8 connection(s)
W20260925 22:02:22.885110 21433 serialization.cc:72] Serialized kudu.rpc_test.PushStringsRequestPB (2147483654 bytes) is larger than the maximum configured RPC message size (52428800 bytes). Sending anyway, but peer may reject the data.
W20260925 22:02:22.895867 21690 connection.cc:535] server connection from unix:<unnamed> recv error: Network error: RPC frame had a length of 2147483714, but we only support messages up to 52428800 bytes long.
W20260925 22:02:22.896268 21690 connection.cc:158] shutting down server connection from unix:<unnamed> with pending inbound data: 4/2147483714 bytes received; last active 0 ns ago: status Network error: RPC frame had a length of 2147483714, but we only support messages up to 52428800 bytes long.
W20260925 22:02:22.897370 21706 connection.cc:196] Error closing socket: Network error: TlsSocket::Close: Broken pipe
[       OK ] Parameters/TestRpc.TestRpcSidecarLimits/SSL_UnixSocket (18057 ms)
[ RUN      ] Parameters/TestRpc.TestCallTimeoutDoesntAffectNegotiation/SSL_UnixSocket
I20260925 22:02:23.536365 21718 acceptor_pool.cc:254] collecting diagnostics on the listening RPC socket unix:/tmp/dist-test-taskql3Tci/test-tmp/rpc-test-84bdffe6b640438fab6780d1786193f6.sock every 8 connection(s)
I20260925 22:02:23.536954 21719 acceptor_pool.cc:254] collecting diagnostics on the listening RPC socket unix:/tmp/dist-test-taskql3Tci/test-tmp/rpc-test-84bdffe6b640438fab6780d1786193f6.sock every 8 connection(s)
W20260925 22:02:23.569023 21714 negotiation.cc:266] Injecting 500ms delay in negotiation
I20260925 22:02:23.619637 21433 rpc-test-base.h:595] status: Timed out: connection negotiation to unix:/tmp/dist-test-taskql3Tci/test-tmp/rpc-test-84bdffe6b640438fab6780d1786193f6.sock for RPC Sleep timed out after 0.050s (ON_OUTBOUND_QUEUE), seconds elapsed: 0.0515434
[       OK ] Parameters/TestRpc.TestCallTimeoutDoesntAffectNegotiation/SSL_UnixSocket (570 ms)
[ RUN      ] Parameters/TestRpc.TestRpcHandlerLatencyMetric/SSL_UnixSocket
I20260925 22:02:24.107177 21743 acceptor_pool.cc:254] collecting diagnostics on the listening RPC socket unix:/tmp/dist-test-taskql3Tci/test-tmp/rpc-test-3e40c66bdaf746a7894fc5f5c854747d.sock every 8 connection(s)
I20260925 22:02:24.107909 21744 acceptor_pool.cc:254] collecting diagnostics on the listening RPC socket unix:/tmp/dist-test-taskql3Tci/test-tmp/rpc-test-3e40c66bdaf746a7894fc5f5c854747d.sock every 8 connection(s)
I20260925 22:02:24.179802 21433 rpc-test.cc:1236] Sleep() min lat: 21929
I20260925 22:02:24.179994 21433 rpc-test.cc:1237] Sleep() mean lat: 21929
I20260925 22:02:24.180122 21433 rpc-test.cc:1238] Sleep() max lat: 21929
I20260925 22:02:24.180234 21433 rpc-test.cc:1239] Sleep() #calls: 1
[       OK ] Parameters/TestRpc.TestRpcHandlerLatencyMetric/SSL_UnixSocket (101 ms)
[ RUN      ] Parameters/TestRpc.TimedOutOnResponseMetricServiceQueue/SSL_UnixSocket
I20260925 22:02:24.201746 21769 acceptor_pool.cc:254] collecting diagnostics on the listening RPC socket unix:/tmp/dist-test-taskql3Tci/test-tmp/rpc-test-7aeaad65022c4fe2b5c6f46d921f9e41.sock every 8 connection(s)
I20260925 22:02:24.202512 21770 acceptor_pool.cc:254] collecting diagnostics on the listening RPC socket unix:/tmp/dist-test-taskql3Tci/test-tmp/rpc-test-7aeaad65022c4fe2b5c6f46d921f9e41.sock every 8 connection(s)
W20260925 22:02:24.289136 21771 rpcz_store.cc:267] Call kudu.rpc_test.CalculatorService.Sleep from unix:<unnamed> (request call id 2) took 20 ms (client timeout 20 ms). Trace:
W20260925 22:02:24.289499 21771 rpcz_store.cc:269] 0925 22:02:24.268653 (+     0us) service_pool.cc:170] Inserting onto call queue
0925 22:02:24.288999 (+ 20346us) service_pool.cc:214] Skipping call since client already timed out
0925 22:02:24.289089 (+    90us) inbound_call.cc:173] Queueing failure response
Metrics: {}
W20260925 22:02:24.292263 21766 connection.cc:196] Error closing socket: Network error: TlsSocket::Close: Broken pipe
[       OK ] Parameters/TestRpc.TimedOutOnResponseMetricServiceQueue/SSL_UnixSocket (108 ms)
[ RUN      ] Parameters/TestRpc.RpcPendingConnectionsMetric/SSL_UnixSocket
I20260925 22:02:24.305985 21792 acceptor_pool.cc:254] collecting diagnostics on the listening RPC socket 0.0.0.0:33105 every 8 connection(s)
I20260925 22:02:24.306691 21793 acceptor_pool.cc:254] collecting diagnostics on the listening RPC socket 0.0.0.0:33105 every 8 connection(s)
W20260925 22:02:24.311542 21788 negotiation.cc:337] Failed RPC negotiation. Trace:
0925 22:02:24.310381 (+     0us) reactor.cc:625] Submitting negotiation task for server connection from 127.0.0.1:39066 (local address 127.0.0.1:33105)
0925 22:02:24.310760 (+   379us) server_negotiation.cc:206] Beginning negotiation
0925 22:02:24.310777 (+    17us) server_negotiation.cc:399] Waiting for connection header
0925 22:02:24.311007 (+   230us) negotiation.cc:327] Negotiation complete: Network error: Server connection negotiation failed: server connection from 127.0.0.1:39066: BlockingRecv error: recv got EOF from 127.0.0.1:39066 (error 108)
Metrics: {"server-negotiator.queue_time_us":88}
[       OK ] Parameters/TestRpc.RpcPendingConnectionsMetric/SSL_UnixSocket (29 ms)
[ RUN      ] Parameters/TestRpc.TestRpcContextClientDeadline/SSL_UnixSocket
I20260925 22:02:24.342839 21808 acceptor_pool.cc:254] collecting diagnostics on the listening RPC socket unix:/tmp/dist-test-taskql3Tci/test-tmp/rpc-test-898ac84ef74640468dd45b0813f470cc.sock every 8 connection(s)
I20260925 22:02:24.343823 21809 acceptor_pool.cc:254] collecting diagnostics on the listening RPC socket unix:/tmp/dist-test-taskql3Tci/test-tmp/rpc-test-898ac84ef74640468dd45b0813f470cc.sock every 8 connection(s)
W20260925 22:02:24.401548 21805 connection.cc:196] Error closing socket: Network error: TlsSocket::Close: Broken pipe
[       OK ] Parameters/TestRpc.TestRpcContextClientDeadline/SSL_UnixSocket (80 ms)
[ RUN      ] Parameters/TestRpc.TestApplicationFeatureFlagUnsupportedServer/SSL_UnixSocket
I20260925 22:02:24.428882 21833 acceptor_pool.cc:254] collecting diagnostics on the listening RPC socket unix:/tmp/dist-test-taskql3Tci/test-tmp/rpc-test-ab36592268904b47b42353afc2d81973.sock every 8 connection(s)
I20260925 22:02:24.429593 21834 acceptor_pool.cc:254] collecting diagnostics on the listening RPC socket unix:/tmp/dist-test-taskql3Tci/test-tmp/rpc-test-ab36592268904b47b42353afc2d81973.sock every 8 connection(s)
[       OK ] Parameters/TestRpc.TestApplicationFeatureFlagUnsupportedServer/SSL_UnixSocket (59 ms)
[ RUN      ] Parameters/TestRpc.TestCancellationAsync/SSL_UnixSocket
I20260925 22:02:24.484162 21858 acceptor_pool.cc:254] collecting diagnostics on the listening RPC socket unix:/tmp/dist-test-taskql3Tci/test-tmp/rpc-test-75622a3f46084092ba94c0bc097cfb42.sock every 8 connection(s)
I20260925 22:02:24.484884 21859 acceptor_pool.cc:254] collecting diagnostics on the listening RPC socket unix:/tmp/dist-test-taskql3Tci/test-tmp/rpc-test-75622a3f46084092ba94c0bc097cfb42.sock every 8 connection(s)
I20260925 22:02:24.487926 21433 rpc-test.cc:1716] Connecting to unix:/tmp/dist-test-taskql3Tci/test-tmp/rpc-test-75622a3f46084092ba94c0bc097cfb42.sock
I20260925 22:02:24.509073 21433 test_util.cc:268] Using random seed: -552697732
I20260925 22:02:24.737854 21862 rpc-test-base.h:240] got call: sleep_micros: 500 pattern: 4294967295 num_repetitions: 2097152 sidecar_idx: 0
I20260925 22:02:24.960155 21862 rpc-test-base.h:240] got call: sleep_micros: 500 pattern: 4294967295 num_repetitions: 2097152 sidecar_idx: 0
I20260925 22:02:25.143990 21861 rpc-test-base.h:240] got call: sleep_micros: 500 pattern: 4294967295 num_repetitions: 2097152 sidecar_idx: 0
I20260925 22:02:25.389240 21861 rpc-test-base.h:240] got call: sleep_micros: 500 pattern: 4294967295 num_repetitions: 2097152 sidecar_idx: 0
I20260925 22:02:25.591604 21862 rpc-test-base.h:240] got call: sleep_micros: 500 pattern: 4294967295 num_repetitions: 2097152 sidecar_idx: 0
I20260925 22:02:25.812143 21861 rpc-test-base.h:240] got call: sleep_micros: 500 pattern: 4294967295 num_repetitions: 2097152 sidecar_idx: 0
I20260925 22:02:26.033038 21861 rpc-test-base.h:240] got call: sleep_micros: 500 pattern: 4294967295 num_repetitions: 2097152 sidecar_idx: 0
I20260925 22:02:26.255972 21861 rpc-test-base.h:240] got call: sleep_micros: 500 pattern: 4294967295 num_repetitions: 2097152 sidecar_idx: 0
I20260925 22:02:26.442804 21862 rpc-test-base.h:240] got call: sleep_micros: 500 pattern: 4294967295 num_repetitions: 2097152 sidecar_idx: 0
W20260925 22:02:26.467023 21855 connection.cc:196] Error closing socket: Network error: TlsSocket::Close: Broken pipe
W20260925 22:02:26.479328 21855 connection.cc:441] server connection from unix:<unnamed> torn down before Call kudu.rpc.GenericCalculatorService.SleepWithSidecar from unix:<unnamed> (request call id 8) could send its response
W20260925 22:02:26.582248 21855 connection.cc:441] server connection from unix:<unnamed> torn down before Call kudu.rpc.GenericCalculatorService.SleepWithSidecar from unix:<unnamed> (request call id 9) could send its response
[       OK ] Parameters/TestRpc.TestCancellationAsync/SSL_UnixSocket (2126 ms)
[ RUN      ] Parameters/TestRpc.TestPerformanceBySocketType/SSL_UnixSocket
I20260925 22:02:26.680595 21883 acceptor_pool.cc:254] collecting diagnostics on the listening RPC socket unix:/tmp/dist-test-taskql3Tci/test-tmp/rpc-test-043acdeadf224e568901d1fb3016a8c3.sock every 8 connection(s)
I20260925 22:02:26.681332 21884 acceptor_pool.cc:254] collecting diagnostics on the listening RPC socket unix:/tmp/dist-test-taskql3Tci/test-tmp/rpc-test-043acdeadf224e568901d1fb3016a8c3.sock every 8 connection(s)
I20260925 22:02:26.684468 21433 rpc-test.cc:1846] Connecting to unix:/tmp/dist-test-taskql3Tci/test-tmp/rpc-test-043acdeadf224e568901d1fb3016a8c3.sock
I20260925 22:02:48.562135 21433 rpc-test.cc:1859] Sending 1024MB via ssl-enabled unix socket: real 21.855s	user 19.613s	sys 13.098s
I20260925 22:03:10.409057 21433 rpc-test.cc:1859] Sending 1024MB via ssl-enabled unix socket: real 21.846s	user 19.347s	sys 13.324s
I20260925 22:03:31.824813 21433 rpc-test.cc:1859] Sending 1024MB via ssl-enabled unix socket: real 21.415s	user 18.729s	sys 13.166s
I20260925 22:03:53.879897 21433 rpc-test.cc:1859] Sending 1024MB via ssl-enabled unix socket: real 22.055s	user 19.826s	sys 13.347s
I20260925 22:04:15.670301 21433 rpc-test.cc:1859] Sending 1024MB via ssl-enabled unix socket: real 21.790s	user 19.356s	sys 13.295s
W20260925 22:04:15.677111 21880 connection.cc:196] Error closing socket: Network error: TlsSocket::Close: Broken pipe
[       OK ] Parameters/TestRpc.TestPerformanceBySocketType/SSL_UnixSocket (109096 ms)
[----------] 20 tests from Parameters/TestRpc (273782 ms total)

[----------] 1 test from Parameters/TestRpcSocketTxRxQueue
[ RUN      ] Parameters/TestRpcSocketTxRxQueue.AcceptorRxQueueSizeMetric/0
I20260925 22:04:15.705801 21919 acceptor_pool.cc:254] collecting diagnostics on the listening RPC socket 0.0.0.0:38011 every 1 connection(s)
I20260925 22:04:15.706727 21920 acceptor_pool.cc:254] collecting diagnostics on the listening RPC socket 0.0.0.0:38011 every 1 connection(s)
W20260925 22:04:15.711938 21915 negotiation.cc:337] Failed RPC negotiation. Trace:
0925 22:04:15.710595 (+     0us) reactor.cc:625] Submitting negotiation task for server connection from 127.0.0.1:52974 (local address 127.0.0.1:38011)
0925 22:04:15.711068 (+   473us) server_negotiation.cc:206] Beginning negotiation
0925 22:04:15.711093 (+    25us) server_negotiation.cc:399] Waiting for connection header
0925 22:04:15.711309 (+   216us) negotiation.cc:327] Negotiation complete: Network error: Server connection negotiation failed: server connection from 127.0.0.1:52974: BlockingRecv error: recv got EOF from 127.0.0.1:52974 (error 108)
Metrics: {"server-negotiator.queue_time_us":136}
[       OK ] Parameters/TestRpcSocketTxRxQueue.AcceptorRxQueueSizeMetric/0 (29 ms)
[----------] 1 test from Parameters/TestRpcSocketTxRxQueue (30 ms total)

[----------] Global test environment tear-down
[==========] 21 tests from 2 test suites ran. (273813 ms total)
[  PASSED  ] 20 tests.
[  FAILED  ] 1 test, listed below:
[  FAILED  ] Parameters/TestRpc.TestCallWithChainCertAndChainCA/SSL_UnixSocket, where GetParam() = (true, true)

 1 FAILED TEST