Parameters/TestRpc.TestCallWithChainCertAndRootCA/SSL_UnixSocket: /data0/somelongdirectorytoavoidrpathissues/src/kudu/src/kudu/rpc/rpc-test.cc:303: Failure
Failed
Bad status: Runtime error: could not verify certificate chain (error with cert: subject=CN = localhost, ST = sadfjas, C = AS, emailAddress = sdflkdsajf, O = lskdfjlsad, OU = sldfkja, issuer=C = AS, ST = ASDfkjdhf, L = lskdjf, O = saldfja, OU = skdjf, CN = localhost, emailAddress = sadjflkadsj): : certificate has expired
Google Test trace:
/data0/somelongdirectorytoavoidrpathissues/src/kudu/src/kudu/rpc/rpc-test.cc:300: Connecting to unix:/tmp/dist-test-taskjoUi8O/test-tmp/rpc-test-7e785682245c4490bdde636a32008f9f.sock
I20260924 00:21:58.477463 3237 test_util.cc:175] -----------------------------------------------
I20260924 00:21:58.477679 3237 test_util.cc:176] Had fatal failures, leaving test files at /tmp/dist-test-taskjoUi8O/test-tmp/rpc-test.2.Parameters_TestRpc.TestCallWithChainCertAndRootCA_SSL_UnixSocket.1790209314941970-3237-0
Note: This is test shard 3 of 8.
[==========] Running 21 tests from 2 test suites.
[----------] Global test environment set-up.
[----------] 1 test from TestRpc
[ RUN ] TestRpc.TestNegotiationTimeout
WARNING: Logging before InitGoogleLogging() is written to STDERR
I20260924 00:21:55.135562 3237 rpc-test-base.h:595] status: Timed out: connection negotiation to 0.0.0.0:44035 for RPC Sleep timed out after 0.100s (ON_OUTBOUND_QUEUE), seconds elapsed: 0.101473
W20260924 00:21:58.160272 3247 negotiation.cc:337] Failed RPC negotiation. Trace:
0924 00:21:55.035304 (+ 0us) reactor.cc:625] Submitting negotiation task for client connection to 0.0.0.0:44035 (local address 127.0.0.1:52020)
0924 00:21:55.036167 (+ 863us) negotiation.cc:107] Waiting for socket to connect
0924 00:21:55.036258 (+ 91us) client_negotiation.cc:174] Beginning negotiation
0924 00:21:55.048909 (+ 12651us) client_negotiation.cc:252] Sending NEGOTIATE NegotiatePB request
0924 00:21:58.159058 (+3110149us) negotiation.cc:327] Negotiation complete: Timed out: Client connection negotiation failed: client connection to 0.0.0.0:44035: received 0 of 4 requested bytes
Metrics: {"client-negotiator.queue_time_us":309}
[ OK ] TestRpc.TestNegotiationTimeout (3166 ms)
[----------] 1 test from TestRpc (3166 ms total)
[----------] 20 tests from Parameters/TestRpc
[ RUN ] Parameters/TestRpc.TestAcceptorPoolStartStop/SSL_UnixSocket
I20260924 00:21:58.208031 3263 acceptor_pool.cc:254] collecting diagnostics on the listening RPC socket unix:/tmp/dist-test-taskjoUi8O/test-tmp/rpc-test-daf0b77882ff4b919ff5ee7c98661ef2.sock every 8 connection(s)
I20260924 00:21:58.209803 3264 acceptor_pool.cc:254] collecting diagnostics on the listening RPC socket unix:/tmp/dist-test-taskjoUi8O/test-tmp/rpc-test-daf0b77882ff4b919ff5ee7c98661ef2.sock every 8 connection(s)
I20260924 00:21:58.247152 3274 acceptor_pool.cc:254] collecting diagnostics on the listening RPC socket unix:/tmp/dist-test-taskjoUi8O/test-tmp/rpc-test-daf0b77882ff4b919ff5ee7c98661ef2.sock every 8 connection(s)
I20260924 00:21:58.248394 3275 acceptor_pool.cc:254] collecting diagnostics on the listening RPC socket unix:/tmp/dist-test-taskjoUi8O/test-tmp/rpc-test-daf0b77882ff4b919ff5ee7c98661ef2.sock every 8 connection(s)
I20260924 00:21:58.271883 3285 acceptor_pool.cc:254] collecting diagnostics on the listening RPC socket unix:/tmp/dist-test-taskjoUi8O/test-tmp/rpc-test-daf0b77882ff4b919ff5ee7c98661ef2.sock every 8 connection(s)
I20260924 00:21:58.272537 3286 acceptor_pool.cc:254] collecting diagnostics on the listening RPC socket unix:/tmp/dist-test-taskjoUi8O/test-tmp/rpc-test-daf0b77882ff4b919ff5ee7c98661ef2.sock every 8 connection(s)
I20260924 00:21:58.292783 3296 acceptor_pool.cc:254] collecting diagnostics on the listening RPC socket unix:/tmp/dist-test-taskjoUi8O/test-tmp/rpc-test-daf0b77882ff4b919ff5ee7c98661ef2.sock every 8 connection(s)
I20260924 00:21:58.293572 3297 acceptor_pool.cc:254] collecting diagnostics on the listening RPC socket unix:/tmp/dist-test-taskjoUi8O/test-tmp/rpc-test-daf0b77882ff4b919ff5ee7c98661ef2.sock every 8 connection(s)
I20260924 00:21:58.313980 3307 acceptor_pool.cc:254] collecting diagnostics on the listening RPC socket unix:/tmp/dist-test-taskjoUi8O/test-tmp/rpc-test-daf0b77882ff4b919ff5ee7c98661ef2.sock every 8 connection(s)
I20260924 00:21:58.314703 3308 acceptor_pool.cc:254] collecting diagnostics on the listening RPC socket unix:/tmp/dist-test-taskjoUi8O/test-tmp/rpc-test-daf0b77882ff4b919ff5ee7c98661ef2.sock every 8 connection(s)
[ OK ] Parameters/TestRpc.TestAcceptorPoolStartStop/SSL_UnixSocket (154 ms)
[ RUN ] Parameters/TestRpc.TestCall/SSL_UnixSocket
I20260924 00:21:58.345438 3320 acceptor_pool.cc:254] collecting diagnostics on the listening RPC socket unix:/tmp/dist-test-taskjoUi8O/test-tmp/rpc-test-0e17ee533b4e4fa095092da5074211d0.sock every 8 connection(s)
I20260924 00:21:58.347375 3321 acceptor_pool.cc:254] collecting diagnostics on the listening RPC socket unix:/tmp/dist-test-taskjoUi8O/test-tmp/rpc-test-0e17ee533b4e4fa095092da5074211d0.sock every 8 connection(s)
I20260924 00:21:58.352293 3237 rpc-test.cc:234] Connecting to unix:/tmp/dist-test-taskjoUi8O/test-tmp/rpc-test-0e17ee533b4e4fa095092da5074211d0.sock
[ OK ] Parameters/TestRpc.TestCall/SSL_UnixSocket (110 ms)
[ RUN ] Parameters/TestRpc.TestCallWithChainCertAndRootCA/SSL_UnixSocket
I20260924 00:21:58.454497 3345 acceptor_pool.cc:254] collecting diagnostics on the listening RPC socket unix:/tmp/dist-test-taskjoUi8O/test-tmp/rpc-test-7e785682245c4490bdde636a32008f9f.sock every 8 connection(s)
I20260924 00:21:58.455286 3346 acceptor_pool.cc:254] collecting diagnostics on the listening RPC socket unix:/tmp/dist-test-taskjoUi8O/test-tmp/rpc-test-7e785682245c4490bdde636a32008f9f.sock every 8 connection(s)
/data0/somelongdirectorytoavoidrpathissues/src/kudu/src/kudu/rpc/rpc-test.cc:303: Failure
Failed
Bad status: Runtime error: could not verify certificate chain (error with cert: subject=CN = localhost, ST = sadfjas, C = AS, emailAddress = sdflkdsajf, O = lskdfjlsad, OU = sldfkja, issuer=C = AS, ST = ASDfkjdhf, L = lskdjf, O = saldfja, OU = skdjf, CN = localhost, emailAddress = sadjflkadsj): : certificate has expired
Google Test trace:
/data0/somelongdirectorytoavoidrpathissues/src/kudu/src/kudu/rpc/rpc-test.cc:300: Connecting to unix:/tmp/dist-test-taskjoUi8O/test-tmp/rpc-test-7e785682245c4490bdde636a32008f9f.sock
I20260924 00:21:58.477463 3237 test_util.cc:175] -----------------------------------------------
I20260924 00:21:58.477679 3237 test_util.cc:176] Had fatal failures, leaving test files at /tmp/dist-test-taskjoUi8O/test-tmp/rpc-test.2.Parameters_TestRpc.TestCallWithChainCertAndRootCA_SSL_UnixSocket.1790209314941970-3237-0
[ FAILED ] Parameters/TestRpc.TestCallWithChainCertAndRootCA/SSL_UnixSocket, where GetParam() = (true, true) (48 ms)
[ RUN ] Parameters/TestRpc.TestCallWithBadPasswordProtectedKey/SSL_UnixSocket
[ OK ] Parameters/TestRpc.TestCallWithBadPasswordProtectedKey/SSL_UnixSocket (34 ms)
[ RUN ] Parameters/TestRpc.TestInvalidMethodCall/SSL_UnixSocket
I20260924 00:21:58.531845 3382 acceptor_pool.cc:254] collecting diagnostics on the listening RPC socket unix:/tmp/dist-test-taskjoUi8O/test-tmp/rpc-test-ecef8a4304c74013afeba56e124ea1e2.sock every 8 connection(s)
I20260924 00:21:58.532670 3383 acceptor_pool.cc:254] collecting diagnostics on the listening RPC socket unix:/tmp/dist-test-taskjoUi8O/test-tmp/rpc-test-ecef8a4304c74013afeba56e124ea1e2.sock every 8 connection(s)
I20260924 00:21:58.536476 3237 rpc-test.cc:406] Connecting to unix:/tmp/dist-test-taskjoUi8O/test-tmp/rpc-test-ecef8a4304c74013afeba56e124ea1e2.sock
[ OK ] Parameters/TestRpc.TestInvalidMethodCall/SSL_UnixSocket (64 ms)
[ RUN ] Parameters/TestRpc.TestHighFDs/SSL_UnixSocket
I20260924 00:21:58.815374 3407 acceptor_pool.cc:254] collecting diagnostics on the listening RPC socket unix:/tmp/dist-test-taskjoUi8O/test-tmp/rpc-test-0652fe2be0c34cf288c0283b189763ac.sock every 8 connection(s)
I20260924 00:21:58.816154 3408 acceptor_pool.cc:254] collecting diagnostics on the listening RPC socket unix:/tmp/dist-test-taskjoUi8O/test-tmp/rpc-test-0652fe2be0c34cf288c0283b189763ac.sock every 8 connection(s)
W20260924 00:21:58.864588 3404 connection.cc:196] Error closing socket: Network error: TlsSocket::Close: Broken pipe
[ OK ] Parameters/TestRpc.TestHighFDs/SSL_UnixSocket (300 ms)
[ RUN ] Parameters/TestRpc.TestConnectionAlwaysKeepalive/SSL_UnixSocket
I20260924 00:21:58.913419 3430 acceptor_pool.cc:254] collecting diagnostics on the listening RPC socket unix:/tmp/dist-test-taskjoUi8O/test-tmp/rpc-test-9dfdf97200504afb90a61c5a312633af.sock every 8 connection(s)
I20260924 00:21:58.914142 3431 acceptor_pool.cc:254] collecting diagnostics on the listening RPC socket unix:/tmp/dist-test-taskjoUi8O/test-tmp/rpc-test-9dfdf97200504afb90a61c5a312633af.sock every 8 connection(s)
I20260924 00:21:58.917685 3237 rpc-test.cc:532] Connecting to unix:/tmp/dist-test-taskjoUi8O/test-tmp/rpc-test-9dfdf97200504afb90a61c5a312633af.sock
W20260924 00:22:01.959120 3429 connection.cc:196] Error closing socket: Network error: TlsSocket::Close: Broken pipe
[ OK ] Parameters/TestRpc.TestConnectionAlwaysKeepalive/SSL_UnixSocket (3087 ms)
[ RUN ] Parameters/TestRpc.TestReopenOutboundConnections/SSL_UnixSocket
I20260924 00:22:01.999957 3453 acceptor_pool.cc:254] collecting diagnostics on the listening RPC socket unix:/tmp/dist-test-taskjoUi8O/test-tmp/rpc-test-6b8924aeae1d46c18e472c2d00f62ed1.sock every 8 connection(s)
I20260924 00:22:02.000726 3454 acceptor_pool.cc:254] collecting diagnostics on the listening RPC socket unix:/tmp/dist-test-taskjoUi8O/test-tmp/rpc-test-6b8924aeae1d46c18e472c2d00f62ed1.sock every 8 connection(s)
I20260924 00:22:02.004316 3237 rpc-test.cc:658] Connecting to unix:/tmp/dist-test-taskjoUi8O/test-tmp/rpc-test-6b8924aeae1d46c18e472c2d00f62ed1.sock
W20260924 00:22:02.037043 3452 connection.cc:196] Error closing socket: Network error: TlsSocket::Close: Broken pipe
W20260924 00:22:02.047278 3452 connection.cc:196] Error closing socket: Network error: TlsSocket::Close: Broken pipe
W20260924 00:22:02.057811 3452 connection.cc:196] Error closing socket: Network error: TlsSocket::Close: Broken pipe
W20260924 00:22:02.068434 3452 connection.cc:196] Error closing socket: Network error: TlsSocket::Close: Broken pipe
W20260924 00:22:02.080181 3452 connection.cc:196] Error closing socket: Network error: TlsSocket::Close: Broken pipe
W20260924 00:22:02.091813 3452 connection.cc:196] Error closing socket: Network error: TlsSocket::Close: Broken pipe
W20260924 00:22:02.103421 3452 connection.cc:196] Error closing socket: Network error: TlsSocket::Close: Broken pipe
W20260924 00:22:02.115427 3452 connection.cc:196] Error closing socket: Network error: TlsSocket::Close: Broken pipe
W20260924 00:22:02.127629 3452 connection.cc:196] Error closing socket: Network error: TlsSocket::Close: Broken pipe
W20260924 00:22:02.139140 3452 connection.cc:196] Error closing socket: Network error: TlsSocket::Close: Broken pipe
W20260924 00:22:02.150776 3452 connection.cc:196] Error closing socket: Network error: TlsSocket::Close: Broken pipe
W20260924 00:22:02.161103 3452 connection.cc:196] Error closing socket: Network error: TlsSocket::Close: Broken pipe
W20260924 00:22:02.171756 3452 connection.cc:196] Error closing socket: Network error: TlsSocket::Close: Broken pipe
W20260924 00:22:02.182768 3452 connection.cc:196] Error closing socket: Network error: TlsSocket::Close: Broken pipe
W20260924 00:22:02.182859 3453 acceptor_pool.cc:285] unable to collect diagnostics on RPC socket unix:/tmp/dist-test-taskjoUi8O/test-tmp/rpc-test-6b8924aeae1d46c18e472c2d00f62ed1.sock: Not implemented: netlink diagnostics is currently supported only on IPv4 TCP sockets
W20260924 00:22:02.193231 3452 connection.cc:196] Error closing socket: Network error: TlsSocket::Close: Broken pipe
W20260924 00:22:02.204296 3452 connection.cc:196] Error closing socket: Network error: TlsSocket::Close: Broken pipe
W20260924 00:22:02.215590 3452 connection.cc:196] Error closing socket: Network error: TlsSocket::Close: Broken pipe
W20260924 00:22:02.227219 3452 connection.cc:196] Error closing socket: Network error: TlsSocket::Close: Broken pipe
W20260924 00:22:02.237744 3452 connection.cc:196] Error closing socket: Network error: TlsSocket::Close: Broken pipe
W20260924 00:22:02.248454 3452 connection.cc:196] Error closing socket: Network error: TlsSocket::Close: Broken pipe
W20260924 00:22:02.260120 3452 connection.cc:196] Error closing socket: Network error: TlsSocket::Close: Broken pipe
W20260924 00:22:02.271682 3452 connection.cc:196] Error closing socket: Network error: TlsSocket::Close: Broken pipe
W20260924 00:22:02.283391 3452 connection.cc:196] Error closing socket: Network error: TlsSocket::Close: Broken pipe
W20260924 00:22:02.295306 3452 connection.cc:196] Error closing socket: Network error: TlsSocket::Close: Broken pipe
W20260924 00:22:02.306843 3452 connection.cc:196] Error closing socket: Network error: TlsSocket::Close: Broken pipe
W20260924 00:22:02.318411 3452 connection.cc:196] Error closing socket: Network error: TlsSocket::Close: Broken pipe
W20260924 00:22:02.329854 3452 connection.cc:196] Error closing socket: Network error: TlsSocket::Close: Broken pipe
W20260924 00:22:02.340220 3452 connection.cc:196] Error closing socket: Network error: TlsSocket::Close: Broken pipe
W20260924 00:22:02.350620 3452 connection.cc:196] Error closing socket: Network error: TlsSocket::Close: Broken pipe
W20260924 00:22:02.361114 3452 connection.cc:196] Error closing socket: Network error: TlsSocket::Close: Broken pipe
W20260924 00:22:02.371701 3452 connection.cc:196] Error closing socket: Network error: TlsSocket::Close: Broken pipe
W20260924 00:22:02.384114 3452 connection.cc:196] Error closing socket: Network error: TlsSocket::Close: Broken pipe
[ OK ] Parameters/TestRpc.TestReopenOutboundConnections/SSL_UnixSocket (425 ms)
[ RUN ] Parameters/TestRpc.TestConnectionNetworkPlane/SSL_UnixSocket
I20260924 00:22:02.411289 3476 acceptor_pool.cc:254] collecting diagnostics on the listening RPC socket unix:/tmp/dist-test-taskjoUi8O/test-tmp/rpc-test-00a81eb42c1b4469b83033077c6d24de.sock every 8 connection(s)
I20260924 00:22:02.412251 3477 acceptor_pool.cc:254] collecting diagnostics on the listening RPC socket unix:/tmp/dist-test-taskjoUi8O/test-tmp/rpc-test-00a81eb42c1b4469b83033077c6d24de.sock every 8 connection(s)
I20260924 00:22:02.415925 3237 rpc-test.cc:772] Connecting to unix:/tmp/dist-test-taskjoUi8O/test-tmp/rpc-test-00a81eb42c1b4469b83033077c6d24de.sock
W20260924 00:22:02.476158 3475 connection.cc:196] Error closing socket: Network error: TlsSocket::Close: Broken pipe
[ OK ] Parameters/TestRpc.TestConnectionNetworkPlane/SSL_UnixSocket (91 ms)
[ RUN ] Parameters/TestRpc.TestTCPKeepalive/SSL_UnixSocket
I20260924 00:22:02.502796 3501 acceptor_pool.cc:254] collecting diagnostics on the listening RPC socket unix:/tmp/dist-test-taskjoUi8O/test-tmp/rpc-test-b62a79e6ae6c456787d9cf07bfa0c303.sock every 8 connection(s)
I20260924 00:22:02.503474 3502 acceptor_pool.cc:254] collecting diagnostics on the listening RPC socket unix:/tmp/dist-test-taskjoUi8O/test-tmp/rpc-test-b62a79e6ae6c456787d9cf07bfa0c303.sock every 8 connection(s)
I20260924 00:22:02.548943 3505 rpc-test-base.h:222] got call: sleep_micros: 8000000 deferred: true
I20260924 00:22:10.553650 3505 rpcz_store.cc:275] Call kudu.rpc.GenericCalculatorService.Sleep from unix:<unnamed> (request call id 0) took 8004 ms. Trace:
I20260924 00:22:10.554078 3505 rpcz_store.cc:276] 0924 00:22:02.548735 (+ 0us) service_pool.cc:170] Inserting onto call queue
0924 00:22:02.548868 (+ 133us) service_pool.cc:227] Handling call
0924 00:22:10.553478 (+8004610us) inbound_call.cc:173] Queueing success response
Metrics: {}
[ OK ] Parameters/TestRpc.TestTCPKeepalive/SSL_UnixSocket (8088 ms)
[ RUN ] Parameters/TestRpc.TestMaxSmallSidecars/SSL_UnixSocket
I20260924 00:22:10.599123 3527 acceptor_pool.cc:254] collecting diagnostics on the listening RPC socket unix:/tmp/dist-test-taskjoUi8O/test-tmp/rpc-test-685d116713c34d1384be452344418a3d.sock every 8 connection(s)
I20260924 00:22:10.600145 3528 acceptor_pool.cc:254] collecting diagnostics on the listening RPC socket unix:/tmp/dist-test-taskjoUi8O/test-tmp/rpc-test-685d116713c34d1384be452344418a3d.sock every 8 connection(s)
W20260924 00:22:10.770735 3524 connection.cc:196] Error closing socket: Network error: TlsSocket::Close: Broken pipe
[ OK ] Parameters/TestRpc.TestMaxSmallSidecars/SSL_UnixSocket (207 ms)
[ RUN ] Parameters/TestRpc.TestCallTimeout/SSL_UnixSocket
I20260924 00:22:10.821111 3552 acceptor_pool.cc:254] collecting diagnostics on the listening RPC socket unix:/tmp/dist-test-taskjoUi8O/test-tmp/rpc-test-020fca0b9edc45c29e5cf81620bc0804.sock every 8 connection(s)
I20260924 00:22:10.821914 3553 acceptor_pool.cc:254] collecting diagnostics on the listening RPC socket unix:/tmp/dist-test-taskjoUi8O/test-tmp/rpc-test-020fca0b9edc45c29e5cf81620bc0804.sock every 8 connection(s)
I20260924 00:22:10.855204 3237 rpc-test-base.h:595] status: Timed out: connection negotiation to unix:/tmp/dist-test-taskjoUi8O/test-tmp/rpc-test-020fca0b9edc45c29e5cf81620bc0804.sock for RPC Sleep timed out after 0.000s (ON_OUTBOUND_QUEUE), seconds elapsed: 0.00249478
I20260924 00:22:10.863304 3556 rpc-test-base.h:222] got call: sleep_micros: 700000
I20260924 00:22:11.056069 3237 rpc-test-base.h:595] status: Timed out: Sleep RPC to unix:/tmp/dist-test-taskjoUi8O/test-tmp/rpc-test-020fca0b9edc45c29e5cf81620bc0804.sock timed out after 0.200s (SENT), seconds elapsed: 0.200511
I20260924 00:22:11.057464 3555 rpc-test-base.h:222] got call: sleep_micros: 2000000
W20260924 00:22:11.564056 3556 rpcz_store.cc:267] Call kudu.rpc.GenericCalculatorService.Sleep from unix:<unnamed> (request call id 1) took 700 ms (client timeout 200 ms). Trace:
W20260924 00:22:11.564478 3556 rpcz_store.cc:269] 0924 00:22:10.863130 (+ 0us) service_pool.cc:170] Inserting onto call queue
0924 00:22:10.863251 (+ 121us) service_pool.cc:227] Handling call
0924 00:22:11.563976 (+700725us) inbound_call.cc:173] Queueing success response
Metrics: {}
I20260924 00:22:12.558328 3237 rpc-test-base.h:595] status: Timed out: Sleep RPC to unix:/tmp/dist-test-taskjoUi8O/test-tmp/rpc-test-020fca0b9edc45c29e5cf81620bc0804.sock timed out after 1.500s (SENT), seconds elapsed: 1.50193
W20260924 00:22:13.058043 3555 rpcz_store.cc:267] Call kudu.rpc.GenericCalculatorService.Sleep from unix:<unnamed> (request call id 2) took 2000 ms (client timeout 1500 ms). Trace:
W20260924 00:22:13.058475 3555 rpcz_store.cc:269] 0924 00:22:11.057197 (+ 0us) service_pool.cc:170] Inserting onto call queue
0924 00:22:11.057305 (+ 108us) service_pool.cc:227] Handling call
0924 00:22:13.057970 (+2000665us) inbound_call.cc:173] Queueing success response
Metrics: {}
W20260924 00:22:13.059141 3549 connection.cc:441] server connection from unix:<unnamed> torn down before Call kudu.rpc.GenericCalculatorService.Sleep from unix:<unnamed> (request call id 2) could send its response
[ OK ] Parameters/TestRpc.TestCallTimeout/SSL_UnixSocket (2288 ms)
[ RUN ] Parameters/TestRpc.TestServerShutsDown/SSL_UnixSocket
I20260924 00:22:13.066989 3237 rpc-test.cc:1125] Connecting to 0.0.0.0:46299
W20260924 00:22:13.076814 3569 negotiation.cc:337] Failed RPC negotiation. Trace:
0924 00:22:13.075102 (+ 0us) reactor.cc:625] Submitting negotiation task for client connection to 0.0.0.0:46299 (local address 127.0.0.1:52578)
0924 00:22:13.075666 (+ 564us) negotiation.cc:107] Waiting for socket to connect
0924 00:22:13.075705 (+ 39us) client_negotiation.cc:174] Beginning negotiation
0924 00:22:13.075988 (+ 283us) client_negotiation.cc:252] Sending NEGOTIATE NegotiatePB request
0924 00:22:13.076237 (+ 249us) negotiation.cc:327] Negotiation complete: Network error: Client connection negotiation failed: client connection to 0.0.0.0:46299: BlockingWrite error: write error: Broken pipe (error 32)
Metrics: {"client-negotiator.queue_time_us":138}
[ OK ] Parameters/TestRpc.TestServerShutsDown/SSL_UnixSocket (14 ms)
[ RUN ] Parameters/TestRpc.TimedOutOnResponseMetric/SSL_UnixSocket
I20260924 00:22:13.114952 3586 acceptor_pool.cc:254] collecting diagnostics on the listening RPC socket unix:/tmp/dist-test-taskjoUi8O/test-tmp/rpc-test-0ee380098a514e07add9387681837281.sock every 8 connection(s)
I20260924 00:22:13.115590 3587 acceptor_pool.cc:254] collecting diagnostics on the listening RPC socket unix:/tmp/dist-test-taskjoUi8O/test-tmp/rpc-test-0ee380098a514e07add9387681837281.sock every 8 connection(s)
W20260924 00:22:13.356276 3590 rpcz_store.cc:267] Call kudu.rpc_test.CalculatorService.Sleep from unix:<unnamed> (request call id 3) took 50 ms (client timeout 25 ms). Trace:
W20260924 00:22:13.356671 3590 rpcz_store.cc:269] 0924 00:22:13.305491 (+ 0us) service_pool.cc:170] Inserting onto call queue
0924 00:22:13.305623 (+ 132us) service_pool.cc:227] Handling call
0924 00:22:13.356162 (+ 50539us) inbound_call.cc:173] Queueing success response
Related trace 'test_child':
Metrics: {"test_sleep_us":50000,"child_traces":[["test_child",{"related_trace_metric":1}]]}
W20260924 00:22:13.416503 3590 rpcz_store.cc:267] Call kudu.rpc_test.CalculatorService.Sleep from unix:<unnamed> (request call id 4) took 50 ms (client timeout 50 ms). Trace:
W20260924 00:22:13.416826 3590 rpcz_store.cc:269] 0924 00:22:13.365752 (+ 0us) service_pool.cc:170] Inserting onto call queue
0924 00:22:13.365941 (+ 189us) service_pool.cc:227] Handling call
0924 00:22:13.416431 (+ 50490us) inbound_call.cc:173] Queueing success response
Related trace 'test_child':
Metrics: {"test_sleep_us":50000,"child_traces":[["test_child",{"related_trace_metric":1}]]}
W20260924 00:22:13.420200 3583 connection.cc:196] Error closing socket: Network error: TlsSocket::Close: Broken pipe
[ OK ] Parameters/TestRpc.TimedOutOnResponseMetric/SSL_UnixSocket (346 ms)
[ RUN ] Parameters/TestRpc.AcceptorDispatchingTimesMetric/SSL_UnixSocket
I20260924 00:22:13.437436 3611 acceptor_pool.cc:254] collecting diagnostics on the listening RPC socket 0.0.0.0:46203 every 8 connection(s)
I20260924 00:22:13.438282 3612 acceptor_pool.cc:254] collecting diagnostics on the listening RPC socket 0.0.0.0:46203 every 8 connection(s)
W20260924 00:22:13.443222 3607 negotiation.cc:337] Failed RPC negotiation. Trace:
0924 00:22:13.442000 (+ 0us) reactor.cc:625] Submitting negotiation task for server connection from 127.0.0.1:34060 (local address 127.0.0.1:46203)
0924 00:22:13.442489 (+ 489us) server_negotiation.cc:206] Beginning negotiation
0924 00:22:13.442508 (+ 19us) server_negotiation.cc:399] Waiting for connection header
0924 00:22:13.442732 (+ 224us) negotiation.cc:327] Negotiation complete: Network error: Server connection negotiation failed: server connection from 127.0.0.1:34060: BlockingRecv error: recv got EOF from 127.0.0.1:34060 (error 108)
Metrics: {"server-negotiator.queue_time_us":122}
[ OK ] Parameters/TestRpc.AcceptorDispatchingTimesMetric/SSL_UnixSocket (23 ms)
[ RUN ] Parameters/TestRpc.TestRpcCallbackDestroysMessenger/SSL_UnixSocket
[ OK ] Parameters/TestRpc.TestRpcCallbackDestroysMessenger/SSL_UnixSocket (37 ms)
[ RUN ] Parameters/TestRpc.TestApplicationFeatureFlag/SSL_UnixSocket
I20260924 00:22:13.527819 3636 acceptor_pool.cc:254] collecting diagnostics on the listening RPC socket unix:/tmp/dist-test-taskjoUi8O/test-tmp/rpc-test-22f4c33632564da8b9a7ff91bb25ed91.sock every 8 connection(s)
I20260924 00:22:13.528606 3637 acceptor_pool.cc:254] collecting diagnostics on the listening RPC socket unix:/tmp/dist-test-taskjoUi8O/test-tmp/rpc-test-22f4c33632564da8b9a7ff91bb25ed91.sock every 8 connection(s)
W20260924 00:22:13.567080 3633 messenger.cc:357] Unable to handle RPC call: Not implemented: call requires unsupported application feature flags: 99
W20260924 00:22:13.570158 3633 connection.cc:196] Error closing socket: Network error: TlsSocket::Close: Broken pipe
[ OK ] Parameters/TestRpc.TestApplicationFeatureFlag/SSL_UnixSocket (88 ms)
[ RUN ] Parameters/TestRpc.TestCancellation/SSL_UnixSocket
I20260924 00:22:13.600066 3661 acceptor_pool.cc:254] collecting diagnostics on the listening RPC socket unix:/tmp/dist-test-taskjoUi8O/test-tmp/rpc-test-40f76778946f4361b09aefcdb5701f4e.sock every 8 connection(s)
I20260924 00:22:13.600783 3662 acceptor_pool.cc:254] collecting diagnostics on the listening RPC socket unix:/tmp/dist-test-taskjoUi8O/test-tmp/rpc-test-40f76778946f4361b09aefcdb5701f4e.sock every 8 connection(s)
I20260924 00:22:13.603960 3237 rpc-test.cc:1648] Connecting to unix:/tmp/dist-test-taskjoUi8O/test-tmp/rpc-test-40f76778946f4361b09aefcdb5701f4e.sock
I20260924 00:22:13.725343 3237 rpc-test-base.h:595] status: Aborted: Sleep RPC to unix:/tmp/dist-test-taskjoUi8O/test-tmp/rpc-test-40f76778946f4361b09aefcdb5701f4e.sock is cancelled in state READY, seconds elapsed: 0.000596343
I20260924 00:22:13.915843 3237 rpc-test-base.h:595] status: Aborted: Sleep RPC to unix:/tmp/dist-test-taskjoUi8O/test-tmp/rpc-test-40f76778946f4361b09aefcdb5701f4e.sock is cancelled in state SENT, seconds elapsed: 0.00114104
I20260924 00:22:13.916108 3664 rpc-test-base.h:222] got call: sleep_micros: 510000
I20260924 00:22:14.120198 3237 rpc-test-base.h:595] status: Aborted: Sleep RPC to unix:/tmp/dist-test-taskjoUi8O/test-tmp/rpc-test-40f76778946f4361b09aefcdb5701f4e.sock is cancelled in state SENT, seconds elapsed: 0.000877293
I20260924 00:22:14.120720 3663 rpc-test-base.h:222] got call: sleep_micros: 510000
I20260924 00:22:14.310314 3237 rpc-test-base.h:595] status: Aborted: Sleep RPC to unix:/tmp/dist-test-taskjoUi8O/test-tmp/rpc-test-40f76778946f4361b09aefcdb5701f4e.sock is cancelled in state SENT, seconds elapsed: 0.000802015
W20260924 00:22:14.322919 3665 rpcz_store.cc:267] Call kudu.rpc.GenericCalculatorService.Sleep from unix:<unnamed> (request call id 11) took 12 ms (client timeout 10 ms). Trace:
W20260924 00:22:14.323264 3665 rpcz_store.cc:269] 0924 00:22:14.310626 (+ 0us) service_pool.cc:170] Inserting onto call queue
0924 00:22:14.322575 (+ 11949us) service_pool.cc:214] Skipping call since client already timed out
0924 00:22:14.322697 (+ 122us) inbound_call.cc:173] Queueing failure response
Metrics: {}
I20260924 00:22:14.323810 3665 rpc-test-base.h:222] got call: sleep_micros: 1500000
W20260924 00:22:14.426754 3664 rpcz_store.cc:267] Call kudu.rpc.GenericCalculatorService.Sleep from unix:<unnamed> (request call id 3) took 510 ms (client timeout 10 ms). Trace:
W20260924 00:22:14.427098 3664 rpcz_store.cc:269] 0924 00:22:13.915910 (+ 0us) service_pool.cc:170] Inserting onto call queue
0924 00:22:13.916042 (+ 132us) service_pool.cc:227] Handling call
0924 00:22:14.426679 (+510637us) inbound_call.cc:173] Queueing success response
Metrics: {}
W20260924 00:22:14.631358 3663 rpcz_store.cc:267] Call kudu.rpc.GenericCalculatorService.Sleep from unix:<unnamed> (request call id 7) took 511 ms (client timeout 10 ms). Trace:
W20260924 00:22:14.631669 3663 rpcz_store.cc:269] 0924 00:22:14.120523 (+ 0us) service_pool.cc:170] Inserting onto call queue
0924 00:22:14.120658 (+ 135us) service_pool.cc:227] Handling call
0924 00:22:14.631266 (+510608us) inbound_call.cc:173] Queueing success response
Metrics: {}
I20260924 00:22:15.312274 3237 rpc-test-base.h:595] status: Timed out: Sleep RPC to unix:/tmp/dist-test-taskjoUi8O/test-tmp/rpc-test-40f76778946f4361b09aefcdb5701f4e.sock timed out after 1.000s (SENT), seconds elapsed: 1.00145
I20260924 00:22:15.314934 3663 rpc-test-base.h:222] got call: sleep_micros: 1500000
W20260924 00:22:15.824712 3665 rpcz_store.cc:267] Call kudu.rpc.GenericCalculatorService.Sleep from unix:<unnamed> (request call id 12) took 1513 ms (client timeout 1000 ms). Trace:
W20260924 00:22:15.825104 3665 rpcz_store.cc:269] 0924 00:22:14.311493 (+ 0us) service_pool.cc:170] Inserting onto call queue
0924 00:22:14.323760 (+ 12267us) service_pool.cc:227] Handling call
0924 00:22:15.824430 (+1500670us) inbound_call.cc:173] Queueing success response
Metrics: {}
I20260924 00:22:16.315212 3237 rpc-test-base.h:595] status: Timed out: Sleep RPC to unix:/tmp/dist-test-taskjoUi8O/test-tmp/rpc-test-40f76778946f4361b09aefcdb5701f4e.sock timed out after 1.000s (SENT), seconds elapsed: 1.00231
W20260924 00:22:16.317067 3658 messenger.cc:357] Unable to handle RPC call: Not implemented: call requires unsupported application feature flags: 99, 1
W20260924 00:22:16.318936 3658 messenger.cc:357] Unable to handle RPC call: Not implemented: call requires unsupported application feature flags: 99, 1
W20260924 00:22:16.555259 3658 connection.cc:196] Error closing socket: Network error: TlsSocket::Close: Broken pipe
W20260924 00:22:16.815680 3663 rpcz_store.cc:267] Call kudu.rpc.GenericCalculatorService.Sleep from unix:<unnamed> (request call id 13) took 1501 ms (client timeout 1000 ms). Trace:
W20260924 00:22:16.815992 3663 rpcz_store.cc:269] 0924 00:22:15.314593 (+ 0us) service_pool.cc:170] Inserting onto call queue
0924 00:22:15.314785 (+ 192us) service_pool.cc:227] Handling call
0924 00:22:16.815622 (+1500837us) inbound_call.cc:173] Queueing success response
Metrics: {}
W20260924 00:22:16.816565 3658 connection.cc:441] server connection from unix:<unnamed> torn down before Call kudu.rpc.GenericCalculatorService.Sleep from unix:<unnamed> (request call id 13) could send its response
[ OK ] Parameters/TestRpc.TestCancellation/SSL_UnixSocket (3249 ms)
[ RUN ] Parameters/TestRpc.TestCancellationMultiThreads/SSL_UnixSocket
I20260924 00:22:16.854161 3687 acceptor_pool.cc:254] collecting diagnostics on the listening RPC socket unix:/tmp/dist-test-taskjoUi8O/test-tmp/rpc-test-59f836253caf4f939a9192a53d8c19c1.sock every 8 connection(s)
I20260924 00:22:16.855022 3688 acceptor_pool.cc:254] collecting diagnostics on the listening RPC socket unix:/tmp/dist-test-taskjoUi8O/test-tmp/rpc-test-59f836253caf4f939a9192a53d8c19c1.sock every 8 connection(s)
I20260924 00:22:16.858214 3237 rpc-test.cc:1808] Connecting to unix:/tmp/dist-test-taskjoUi8O/test-tmp/rpc-test-59f836253caf4f939a9192a53d8c19c1.sock
I20260924 00:22:16.996820 3701 test_util.cc:268] Using random seed: -1751452855
I20260924 00:22:16.998078 3702 test_util.cc:268] Using random seed: -1751451492
I20260924 00:22:16.999869 3703 test_util.cc:268] Using random seed: -1751449919
I20260924 00:22:17.001556 3704 test_util.cc:268] Using random seed: -1751448025
I20260924 00:22:17.003571 3705 test_util.cc:268] Using random seed: -1751446114
I20260924 00:22:17.005000 3706 test_util.cc:268] Using random seed: -1751444675
I20260924 00:22:17.006724 3707 test_util.cc:268] Using random seed: -1751442939
I20260924 00:22:17.008440 3708 test_util.cc:268] Using random seed: -1751441290
I20260924 00:22:17.009927 3709 test_util.cc:268] Using random seed: -1751439762
I20260924 00:22:17.011480 3710 test_util.cc:268] Using random seed: -1751438238
I20260924 00:22:17.013681 3711 test_util.cc:268] Using random seed: -1751436102
I20260924 00:22:17.015291 3712 test_util.cc:268] Using random seed: -1751434456
I20260924 00:22:17.016916 3713 test_util.cc:268] Using random seed: -1751432831
I20260924 00:22:17.018981 3714 test_util.cc:268] Using random seed: -1751430761
I20260924 00:22:17.020787 3715 test_util.cc:268] Using random seed: -1751429038
I20260924 00:22:17.022701 3716 test_util.cc:268] Using random seed: -1751427070
I20260924 00:22:17.024554 3717 test_util.cc:268] Using random seed: -1751425208
I20260924 00:22:17.026440 3718 test_util.cc:268] Using random seed: -1751423345
I20260924 00:22:17.028322 3719 test_util.cc:268] Using random seed: -1751421467
I20260924 00:22:17.031245 3720 test_util.cc:268] Using random seed: -1751418516
I20260924 00:22:17.033888 3721 test_util.cc:268] Using random seed: -1751416094
I20260924 00:22:17.036027 3722 test_util.cc:268] Using random seed: -1751413704
I20260924 00:22:17.038512 3723 test_util.cc:268] Using random seed: -1751411323
I20260924 00:22:17.040611 3724 test_util.cc:268] Using random seed: -1751409164
I20260924 00:22:17.042860 3725 test_util.cc:268] Using random seed: -1751407007
I20260924 00:22:17.045292 3726 test_util.cc:268] Using random seed: -1751404434
I20260924 00:22:17.051503 3727 test_util.cc:268] Using random seed: -1751398217
I20260924 00:22:17.053530 3728 test_util.cc:268] Using random seed: -1751396363
I20260924 00:22:17.055506 3729 test_util.cc:268] Using random seed: -1751394242
I20260924 00:22:17.057498 3730 test_util.cc:268] Using random seed: -1751392283
W20260924 00:22:38.472903 3684 connection.cc:196] Error closing socket: Network error: TlsSocket::Close: Broken pipe
[ OK ] Parameters/TestRpc.TestCancellationMultiThreads/SSL_UnixSocket (21666 ms)
[ RUN ] Parameters/TestRpc.TestCallId/SSL_UnixSocket
I20260924 00:22:38.530642 3744 acceptor_pool.cc:254] collecting diagnostics on the listening RPC socket unix:/tmp/dist-test-taskjoUi8O/test-tmp/rpc-test-7a7b755fafe34e558501f94ca7781f37.sock every 8 connection(s)
I20260924 00:22:38.531639 3745 acceptor_pool.cc:254] collecting diagnostics on the listening RPC socket unix:/tmp/dist-test-taskjoUi8O/test-tmp/rpc-test-7a7b755fafe34e558501f94ca7781f37.sock every 8 connection(s)
W20260924 00:22:38.589967 3741 connection.cc:196] Error closing socket: Network error: TlsSocket::Close: Broken pipe
[ OK ] Parameters/TestRpc.TestCallId/SSL_UnixSocket (107 ms)
[----------] 20 tests from Parameters/TestRpc (40435 ms total)
[----------] Global test environment tear-down
[==========] 21 tests from 2 test suites ran. (43602 ms total)
[ PASSED ] 20 tests.
[ FAILED ] 1 test, listed below:
[ FAILED ] Parameters/TestRpc.TestCallWithChainCertAndRootCA/SSL_UnixSocket, where GetParam() = (true, true)
1 FAILED TEST
I20260924 00:22:38.618134 3237 logging.cc:424] LogThrottler /data0/somelongdirectorytoavoidrpathissues/src/kudu/src/kudu/rpc/acceptor_pool.cc:285: suppressed but not reported on 3 messages since previous log ~36 seconds ago