Diagnosed failure

Parameters/TestRpc.TestCallWithChainCertAndChainCA/SSL_TCP: /data0/somelongdirectorytoavoidrpathissues/src/kudu/src/kudu/rpc/rpc-test.cc:270: Failure
Failed
Bad status: Runtime error: could not verify certificate chain (error with cert: subject=CN = localhost, ST = sadfjas, C = AS, emailAddress = sdflkdsajf, O = lskdfjlsad, OU = sldfkja, issuer=C = AS, ST = ASDfkjdhf, L = lskdjf, O = saldfja, OU = skdjf, CN = localhost, emailAddress = sadjflkadsj): : certificate has expired
Google Test trace:
/data0/somelongdirectorytoavoidrpathissues/src/kudu/src/kudu/rpc/rpc-test.cc:267: Connecting to 0.0.0.0:32793
I20260929 20:18:29.023322 21257 test_util.cc:175] -----------------------------------------------
I20260929 20:18:29.023416 21257 test_util.cc:176] Had fatal failures, leaving test files at /tmp/dist-test-taskG_BKv2/test-tmp/rpc-test.5.Parameters_TestRpc.TestCallWithChainCertAndChainCA_SSL_TCP.1790713108904425-21257-0

Full log

Note: This is test shard 6 of 8.
[==========] Running 21 tests from 2 test suites.
[----------] Global test environment set-up.
[----------] 20 tests from Parameters/TestRpc
[ RUN      ] Parameters/TestRpc.TestMessengerCreateDestroy/SSL_TCP
WARNING: Logging before InitGoogleLogging() is written to STDERR
I20260929 20:18:28.949266 21257 rpc-test.cc:169] started messenger TestCreateDestroy
[       OK ] Parameters/TestRpc.TestMessengerCreateDestroy/SSL_TCP (27 ms)
[ RUN      ] Parameters/TestRpc.TestNegotiationDeadlock/SSL_TCP
I20260929 20:18:28.976254 21277 acceptor_pool.cc:254] collecting diagnostics on the listening RPC socket 0.0.0.0:46509 every 8 connection(s)
I20260929 20:18:28.976438 21278 acceptor_pool.cc:254] collecting diagnostics on the listening RPC socket 0.0.0.0:46509 every 8 connection(s)
[       OK ] Parameters/TestRpc.TestNegotiationDeadlock/SSL_TCP (43 ms)
[ RUN      ] Parameters/TestRpc.TestCallWithChainCertAndChainCA/SSL_TCP
I20260929 20:18:29.011374 21293 acceptor_pool.cc:254] collecting diagnostics on the listening RPC socket 0.0.0.0:32793 every 8 connection(s)
I20260929 20:18:29.011718 21294 acceptor_pool.cc:254] collecting diagnostics on the listening RPC socket 0.0.0.0:32793 every 8 connection(s)
/data0/somelongdirectorytoavoidrpathissues/src/kudu/src/kudu/rpc/rpc-test.cc:270: Failure
Failed
Bad status: Runtime error: could not verify certificate chain (error with cert: subject=CN = localhost, ST = sadfjas, C = AS, emailAddress = sdflkdsajf, O = lskdfjlsad, OU = sldfkja, issuer=C = AS, ST = ASDfkjdhf, L = lskdjf, O = saldfja, OU = skdjf, CN = localhost, emailAddress = sadjflkadsj): : certificate has expired
Google Test trace:
/data0/somelongdirectorytoavoidrpathissues/src/kudu/src/kudu/rpc/rpc-test.cc:267: Connecting to 0.0.0.0:32793
I20260929 20:18:29.023322 21257 test_util.cc:175] -----------------------------------------------
I20260929 20:18:29.023416 21257 test_util.cc:176] Had fatal failures, leaving test files at /tmp/dist-test-taskG_BKv2/test-tmp/rpc-test.5.Parameters_TestRpc.TestCallWithChainCertAndChainCA_SSL_TCP.1790713108904425-21257-0
[  FAILED  ] Parameters/TestRpc.TestCallWithChainCertAndChainCA/SSL_TCP, where GetParam() = (true, false) (27 ms)
[ RUN      ] Parameters/TestRpc.TestCallWithPasswordProtectedKey/SSL_TCP
I20260929 20:18:29.041328 21318 acceptor_pool.cc:254] collecting diagnostics on the listening RPC socket 0.0.0.0:33133 every 8 connection(s)
I20260929 20:18:29.041563 21319 acceptor_pool.cc:254] collecting diagnostics on the listening RPC socket 0.0.0.0:33133 every 8 connection(s)
[       OK ] Parameters/TestRpc.TestCallWithPasswordProtectedKey/SSL_TCP (60 ms)
[ RUN      ] Parameters/TestRpc.TestCallToBadServer/SSL_TCP
I20260929 20:18:29.104429 21257 rpc-test.cc:394] Status: Network error: Client connection negotiation failed: client connection to 0.0.0.0:0: connect: Connection refused (error 111)
I20260929 20:18:29.105144 21257 rpc-test.cc:394] Status: Network error: Client connection negotiation failed: client connection to 0.0.0.0:0: connect: Connection refused (error 111)
I20260929 20:18:29.105762 21257 rpc-test.cc:394] Status: Network error: Client connection negotiation failed: client connection to 0.0.0.0:0: connect: Connection refused (error 111)
I20260929 20:18:29.106335 21257 rpc-test.cc:394] Status: Network error: Client connection negotiation failed: client connection to 0.0.0.0:0: connect: Connection refused (error 111)
I20260929 20:18:29.106914 21257 rpc-test.cc:394] Status: Network error: Client connection negotiation failed: client connection to 0.0.0.0:0: connect: Connection refused (error 111)
[       OK ] Parameters/TestRpc.TestCallToBadServer/SSL_TCP (24 ms)
[ RUN      ] Parameters/TestRpc.TestWrongService/SSL_TCP
I20260929 20:18:29.123888 21353 acceptor_pool.cc:254] collecting diagnostics on the listening RPC socket 0.0.0.0:37689 every 8 connection(s)
I20260929 20:18:29.124153 21354 acceptor_pool.cc:254] collecting diagnostics on the listening RPC socket 0.0.0.0:37689 every 8 connection(s)
I20260929 20:18:29.151239 21350 messenger.cc:345] service WrongServiceName not registered on TestServer
[       OK ] Parameters/TestRpc.TestWrongService/SSL_TCP (46 ms)
[ RUN      ] Parameters/TestRpc.TestConnectionKeepalive/SSL_TCP
I20260929 20:18:29.177320 21376 acceptor_pool.cc:254] collecting diagnostics on the listening RPC socket 0.0.0.0:38411 every 8 connection(s)
I20260929 20:18:29.177618 21377 acceptor_pool.cc:254] collecting diagnostics on the listening RPC socket 0.0.0.0:38411 every 8 connection(s)
I20260929 20:18:29.178695 21257 rpc-test.cc:488] Connecting to 0.0.0.0:38411
[       OK ] Parameters/TestRpc.TestConnectionKeepalive/SSL_TCP (1082 ms)
[ RUN      ] Parameters/TestRpc.TestClientConnectionMetrics/SSL_TCP
I20260929 20:18:30.264588 21401 acceptor_pool.cc:254] collecting diagnostics on the listening RPC socket 0.0.0.0:46051 every 8 connection(s)
I20260929 20:18:30.264833 21402 acceptor_pool.cc:254] collecting diagnostics on the listening RPC socket 0.0.0.0:46051 every 8 connection(s)
I20260929 20:18:30.265818 21257 rpc-test.cc:569] Connecting to 0.0.0.0:46051
[       OK ] Parameters/TestRpc.TestClientConnectionMetrics/SSL_TCP (19946 ms)
[ RUN      ] Parameters/TestRpc.TestCredentialsPolicy/SSL_TCP
I20260929 20:18:50.209216 21424 acceptor_pool.cc:254] collecting diagnostics on the listening RPC socket 0.0.0.0:43969 every 8 connection(s)
I20260929 20:18:50.209461 21425 acceptor_pool.cc:254] collecting diagnostics on the listening RPC socket 0.0.0.0:43969 every 8 connection(s)
I20260929 20:18:50.210505 21257 rpc-test.cc:700] Connecting to 0.0.0.0:43969
[       OK ] Parameters/TestRpc.TestCredentialsPolicy/SSL_TCP (82 ms)
[ RUN      ] Parameters/TestRpc.TestCallLongerThanKeepalive/SSL_TCP
I20260929 20:18:50.289733 21449 acceptor_pool.cc:254] collecting diagnostics on the listening RPC socket 0.0.0.0:39905 every 8 connection(s)
I20260929 20:18:50.289970 21450 acceptor_pool.cc:254] collecting diagnostics on the listening RPC socket 0.0.0.0:39905 every 8 connection(s)
I20260929 20:18:50.312369 21453 rpc-test-base.h:222] got call: sleep_micros: 3000000 deferred: true
I20260929 20:18:53.314142 21453 rpcz_store.cc:275] Call kudu.rpc.GenericCalculatorService.Sleep from 127.0.0.1:33228 (request call id 0) took 3001 ms. Trace:
I20260929 20:18:53.314316 21453 rpcz_store.cc:276] 0929 20:18:50.312261 (+     0us) service_pool.cc:170] Inserting onto call queue
0929 20:18:50.312322 (+    61us) service_pool.cc:227] Handling call
0929 20:18:53.314091 (+3001769us) inbound_call.cc:173] Queueing success response
Metrics: {}
[       OK ] Parameters/TestRpc.TestCallLongerThanKeepalive/SSL_TCP (3052 ms)
[ RUN      ] Parameters/TestRpc.TestRpcSidecar/SSL_TCP
I20260929 20:18:53.357263 21474 acceptor_pool.cc:254] collecting diagnostics on the listening RPC socket 0.0.0.0:35575 every 8 connection(s)
I20260929 20:18:53.357514 21475 acceptor_pool.cc:254] collecting diagnostics on the listening RPC socket 0.0.0.0:35575 every 8 connection(s)
[       OK ] Parameters/TestRpc.TestRpcSidecar/SSL_TCP (136 ms)
[ RUN      ] Parameters/TestRpc.TestRpcSidecarLimits/SSL_TCP
I20260929 20:18:55.775290 21499 acceptor_pool.cc:254] collecting diagnostics on the listening RPC socket 0.0.0.0:43607 every 8 connection(s)
I20260929 20:18:55.775563 21500 acceptor_pool.cc:254] collecting diagnostics on the listening RPC socket 0.0.0.0:43607 every 8 connection(s)
W20260929 20:18:55.802253 21257 serialization.cc:72] Serialized kudu.rpc_test.PushStringsRequestPB (2147483654 bytes) is larger than the maximum configured RPC message size (52428800 bytes). Sending anyway, but peer may reject the data.
W20260929 20:18:55.808719 21497 connection.cc:535] server connection from 127.0.0.1:39466 recv error: Network error: RPC frame had a length of 2147483714, but we only support messages up to 52428800 bytes long.
W20260929 20:18:55.808866 21497 connection.cc:158] shutting down server connection from 127.0.0.1:39466 with pending inbound data: 4/2147483714 bytes received; last active 0 ns ago: status Network error: RPC frame had a length of 2147483714, but we only support messages up to 52428800 bytes long.
W20260929 20:18:55.809363 21512 connection.cc:196] Error closing socket: Network error: TlsSocket::Close: Connection reset by peer
I20260929 20:18:55.841152 21524 acceptor_pool.cc:254] collecting diagnostics on the listening RPC socket 0.0.0.0:44351 every 8 connection(s)
I20260929 20:18:55.841328 21525 acceptor_pool.cc:254] collecting diagnostics on the listening RPC socket 0.0.0.0:44351 every 8 connection(s)
W20260929 20:19:01.669351 21523 connection.cc:577] server connection from 127.0.0.1:56832: received bad data: 'Corruption: Invalid packet: message had a length of 2147483710, but we only support messages up to 2147483647 bytes
'
[       OK ] Parameters/TestRpc.TestRpcSidecarLimits/SSL_TCP (8693 ms)
[ RUN      ] Parameters/TestRpc.TestCallTimeoutDoesntAffectNegotiation/SSL_TCP
I20260929 20:19:02.189185 21549 acceptor_pool.cc:254] collecting diagnostics on the listening RPC socket 0.0.0.0:37155 every 8 connection(s)
I20260929 20:19:02.189484 21550 acceptor_pool.cc:254] collecting diagnostics on the listening RPC socket 0.0.0.0:37155 every 8 connection(s)
W20260929 20:19:02.212327 21545 negotiation.cc:266] Injecting 500ms delay in negotiation
I20260929 20:19:02.262895 21257 rpc-test-base.h:595] status: Timed out: connection negotiation to 0.0.0.0:37155 for RPC Sleep timed out after 0.050s (ON_OUTBOUND_QUEUE), seconds elapsed: 0.051124
[       OK ] Parameters/TestRpc.TestCallTimeoutDoesntAffectNegotiation/SSL_TCP (572 ms)
[ RUN      ] Parameters/TestRpc.TestRpcHandlerLatencyMetric/SSL_TCP
I20260929 20:19:02.747731 21574 acceptor_pool.cc:254] collecting diagnostics on the listening RPC socket 0.0.0.0:46723 every 8 connection(s)
I20260929 20:19:02.747891 21575 acceptor_pool.cc:254] collecting diagnostics on the listening RPC socket 0.0.0.0:46723 every 8 connection(s)
I20260929 20:19:02.787134 21257 rpc-test.cc:1236] Sleep() min lat: 20746
I20260929 20:19:02.787233 21257 rpc-test.cc:1237] Sleep() mean lat: 20746
I20260929 20:19:02.787290 21257 rpc-test.cc:1238] Sleep() max lat: 20746
I20260929 20:19:02.787330 21257 rpc-test.cc:1239] Sleep() #calls: 1
[       OK ] Parameters/TestRpc.TestRpcHandlerLatencyMetric/SSL_TCP (68 ms)
[ RUN      ] Parameters/TestRpc.TimedOutOnResponseMetricServiceQueue/SSL_TCP
I20260929 20:19:02.809489 21600 acceptor_pool.cc:254] collecting diagnostics on the listening RPC socket 0.0.0.0:43049 every 8 connection(s)
I20260929 20:19:02.809697 21601 acceptor_pool.cc:254] collecting diagnostics on the listening RPC socket 0.0.0.0:43049 every 8 connection(s)
W20260929 20:19:02.873886 21602 rpcz_store.cc:267] Call kudu.rpc_test.CalculatorService.Sleep from 127.0.0.1:53238 (request call id 2) took 20 ms (client timeout 20 ms). Trace:
W20260929 20:19:02.874054 21602 rpcz_store.cc:269] 0929 20:19:02.853287 (+     0us) service_pool.cc:170] Inserting onto call queue
0929 20:19:02.873784 (+ 20497us) service_pool.cc:214] Skipping call since client already timed out
0929 20:19:02.873844 (+    60us) inbound_call.cc:173] Queueing failure response
Metrics: {}
[       OK ] Parameters/TestRpc.TimedOutOnResponseMetricServiceQueue/SSL_TCP (86 ms)
[ RUN      ] Parameters/TestRpc.RpcPendingConnectionsMetric/SSL_TCP
I20260929 20:19:02.883119 21623 acceptor_pool.cc:254] collecting diagnostics on the listening RPC socket 0.0.0.0:43315 every 8 connection(s)
I20260929 20:19:02.883342 21624 acceptor_pool.cc:254] collecting diagnostics on the listening RPC socket 0.0.0.0:43315 every 8 connection(s)
W20260929 20:19:02.885345 21619 negotiation.cc:337] Failed RPC negotiation. Trace:
0929 20:19:02.884727 (+     0us) reactor.cc:625] Submitting negotiation task for server connection from 127.0.0.1:41626 (local address 127.0.0.1:43315)
0929 20:19:02.884875 (+   148us) server_negotiation.cc:206] Beginning negotiation
0929 20:19:02.884879 (+     4us) server_negotiation.cc:399] Waiting for connection header
0929 20:19:02.885024 (+   145us) negotiation.cc:327] Negotiation complete: Network error: Server connection negotiation failed: server connection from 127.0.0.1:41626: BlockingRecv error: recv got EOF from 127.0.0.1:41626 (error 108)
Metrics: {"server-negotiator.queue_time_us":45}
[       OK ] Parameters/TestRpc.RpcPendingConnectionsMetric/SSL_TCP (19 ms)
[ RUN      ] Parameters/TestRpc.TestRpcContextClientDeadline/SSL_TCP
I20260929 20:19:02.924360 21639 acceptor_pool.cc:254] collecting diagnostics on the listening RPC socket 0.0.0.0:41093 every 8 connection(s)
I20260929 20:19:02.924556 21640 acceptor_pool.cc:254] collecting diagnostics on the listening RPC socket 0.0.0.0:41093 every 8 connection(s)
[       OK ] Parameters/TestRpc.TestRpcContextClientDeadline/SSL_TCP (72 ms)
[ RUN      ] Parameters/TestRpc.TestApplicationFeatureFlagUnsupportedServer/SSL_TCP
I20260929 20:19:02.982491 21664 acceptor_pool.cc:254] collecting diagnostics on the listening RPC socket 0.0.0.0:43529 every 8 connection(s)
I20260929 20:19:02.982728 21665 acceptor_pool.cc:254] collecting diagnostics on the listening RPC socket 0.0.0.0:43529 every 8 connection(s)
[       OK ] Parameters/TestRpc.TestApplicationFeatureFlagUnsupportedServer/SSL_TCP (32 ms)
[ RUN      ] Parameters/TestRpc.TestCancellationAsync/SSL_TCP
I20260929 20:19:03.036259 21689 acceptor_pool.cc:254] collecting diagnostics on the listening RPC socket 0.0.0.0:42131 every 8 connection(s)
I20260929 20:19:03.036522 21690 acceptor_pool.cc:254] collecting diagnostics on the listening RPC socket 0.0.0.0:42131 every 8 connection(s)
I20260929 20:19:03.037436 21257 rpc-test.cc:1716] Connecting to 0.0.0.0:42131
I20260929 20:19:03.070338 21257 test_util.cc:268] Using random seed: -456552862
I20260929 20:19:03.106442 21693 rpc-test-base.h:240] got call: sleep_micros: 500 pattern: 4294967295 num_repetitions: 2097152 sidecar_idx: 0
I20260929 20:19:03.132335 21692 rpc-test-base.h:240] got call: sleep_micros: 500 pattern: 4294967295 num_repetitions: 2097152 sidecar_idx: 0
I20260929 20:19:03.165518 21691 rpc-test-base.h:240] got call: sleep_micros: 500 pattern: 4294967295 num_repetitions: 2097152 sidecar_idx: 0
I20260929 20:19:03.200181 21692 rpc-test-base.h:240] got call: sleep_micros: 500 pattern: 4294967295 num_repetitions: 2097152 sidecar_idx: 0
I20260929 20:19:03.224403 21691 rpc-test-base.h:240] got call: sleep_micros: 500 pattern: 4294967295 num_repetitions: 2097152 sidecar_idx: 0
I20260929 20:19:03.249584 21692 rpc-test-base.h:240] got call: sleep_micros: 500 pattern: 4294967295 num_repetitions: 2097152 sidecar_idx: 0
W20260929 20:19:03.274392 21687 connection.cc:196] Error closing socket: Network error: TlsSocket::Close: Broken pipe
W20260929 20:19:03.280356 21687 connection.cc:441] server connection from 127.0.0.1:48010 torn down before Call kudu.rpc.GenericCalculatorService.SleepWithSidecar from 127.0.0.1:48010 (request call id 7) could send its response
W20260929 20:19:03.283715 21687 connection.cc:441] server connection from 127.0.0.1:48010 torn down before Call kudu.rpc.GenericCalculatorService.SleepWithSidecar from 127.0.0.1:48010 (request call id 8) could send its response
[       OK ] Parameters/TestRpc.TestCancellationAsync/SSL_TCP (283 ms)
[ RUN      ] Parameters/TestRpc.TestPerformanceBySocketType/SSL_TCP
I20260929 20:19:03.304420 21714 acceptor_pool.cc:254] collecting diagnostics on the listening RPC socket 0.0.0.0:41865 every 8 connection(s)
I20260929 20:19:03.304632 21715 acceptor_pool.cc:254] collecting diagnostics on the listening RPC socket 0.0.0.0:41865 every 8 connection(s)
I20260929 20:19:03.305552 21257 rpc-test.cc:1846] Connecting to 0.0.0.0:41865
I20260929 20:19:06.229498 21257 rpc-test.cc:1859] Sending 1024MB via ssl-enabled tcp socket: real 2.915s	user 2.713s	sys 2.103s
I20260929 20:19:09.162554 21257 rpc-test.cc:1859] Sending 1024MB via ssl-enabled tcp socket: real 2.933s	user 2.598s	sys 2.218s
I20260929 20:19:12.126361 21257 rpc-test.cc:1859] Sending 1024MB via ssl-enabled tcp socket: real 2.964s	user 2.704s	sys 2.165s
I20260929 20:19:15.004705 21257 rpc-test.cc:1859] Sending 1024MB via ssl-enabled tcp socket: real 2.878s	user 2.598s	sys 2.126s
I20260929 20:19:17.969245 21257 rpc-test.cc:1859] Sending 1024MB via ssl-enabled tcp socket: real 2.964s	user 2.798s	sys 2.097s
[       OK ] Parameters/TestRpc.TestPerformanceBySocketType/SSL_TCP (14690 ms)
[----------] 20 tests from Parameters/TestRpc (49053 ms total)

[----------] 1 test from Parameters/TestRpcSocketTxRxQueue
[ RUN      ] Parameters/TestRpcSocketTxRxQueue.OverCapacity/0
W20260929 20:19:18.275820 21758 negotiation.cc:337] Failed RPC negotiation. Trace:
0929 20:19:17.990088 (+     0us) reactor.cc:625] Submitting negotiation task for client connection to 0.0.0.0:38891 (local address 127.0.0.1:55358)
0929 20:19:17.990297 (+   209us) negotiation.cc:107] Waiting for socket to connect
0929 20:19:17.990314 (+    17us) client_negotiation.cc:174] Beginning negotiation
0929 20:19:17.990420 (+   106us) client_negotiation.cc:252] Sending NEGOTIATE NegotiatePB request
0929 20:19:18.275057 (+284637us) negotiation.cc:327] Negotiation complete: Network error: Client connection negotiation failed: client connection to 0.0.0.0:38891: BlockingRecv error: recv error from unknown peer: Transport endpoint is not connected (error 107)
Metrics: {"client-negotiator.queue_time_us":77}
W20260929 20:19:18.276263 21731 negotiation.cc:337] Failed RPC negotiation. Trace:
0929 20:19:17.981390 (+     0us) reactor.cc:625] Submitting negotiation task for client connection to 0.0.0.0:38891 (local address 127.0.0.1:55326)
0929 20:19:17.981598 (+   208us) negotiation.cc:107] Waiting for socket to connect
0929 20:19:17.981625 (+    27us) client_negotiation.cc:174] Beginning negotiation
0929 20:19:17.981758 (+   133us) client_negotiation.cc:252] Sending NEGOTIATE NegotiatePB request
0929 20:19:18.274995 (+293237us) negotiation.cc:327] Negotiation complete: Network error: Client connection negotiation failed: client connection to 0.0.0.0:38891: BlockingRecv error: recv error from unknown peer: Transport endpoint is not connected (error 107)
Metrics: {"client-negotiator.queue_time_us":65}
W20260929 20:19:18.276880 21740 negotiation.cc:337] Failed RPC negotiation. Trace:
0929 20:19:17.984451 (+     0us) reactor.cc:625] Submitting negotiation task for client connection to 0.0.0.0:38891 (local address 127.0.0.1:55338)
0929 20:19:17.984615 (+   164us) negotiation.cc:107] Waiting for socket to connect
0929 20:19:17.984633 (+    18us) client_negotiation.cc:174] Beginning negotiation
0929 20:19:17.984728 (+    95us) client_negotiation.cc:252] Sending NEGOTIATE NegotiatePB request
0929 20:19:18.274995 (+290267us) negotiation.cc:327] Negotiation complete: Network error: Client connection negotiation failed: client connection to 0.0.0.0:38891: BlockingRecv error: recv error from unknown peer: Transport endpoint is not connected (error 107)
Metrics: {"client-negotiator.queue_time_us":52}
W20260929 20:19:18.277064 21749 negotiation.cc:337] Failed RPC negotiation. Trace:
0929 20:19:17.987423 (+     0us) reactor.cc:625] Submitting negotiation task for client connection to 0.0.0.0:38891 (local address 127.0.0.1:55352)
0929 20:19:17.987594 (+   171us) negotiation.cc:107] Waiting for socket to connect
0929 20:19:17.987610 (+    16us) client_negotiation.cc:174] Beginning negotiation
0929 20:19:17.987742 (+   132us) client_negotiation.cc:252] Sending NEGOTIATE NegotiatePB request
0929 20:19:18.275020 (+287278us) negotiation.cc:327] Negotiation complete: Network error: Client connection negotiation failed: client connection to 0.0.0.0:38891: BlockingRecv error: recv error from unknown peer: Transport endpoint is not connected (error 107)
Metrics: {"client-negotiator.queue_time_us":34}
W20260929 20:19:18.277308 21767 negotiation.cc:337] Failed RPC negotiation. Trace:
0929 20:19:17.993001 (+     0us) reactor.cc:625] Submitting negotiation task for client connection to 0.0.0.0:38891 (local address 127.0.0.1:55360)
0929 20:19:17.993210 (+   209us) negotiation.cc:107] Waiting for socket to connect
0929 20:19:17.993228 (+    18us) client_negotiation.cc:174] Beginning negotiation
0929 20:19:17.993330 (+   102us) client_negotiation.cc:252] Sending NEGOTIATE NegotiatePB request
0929 20:19:18.275668 (+282338us) negotiation.cc:327] Negotiation complete: Network error: Client connection negotiation failed: client connection to 0.0.0.0:38891: BlockingRecv error: recv error from unknown peer: Transport endpoint is not connected (error 107)
Metrics: {"client-negotiator.queue_time_us":79}
W20260929 20:19:18.281857 21776 negotiation.cc:337] Failed RPC negotiation. Trace:
0929 20:19:17.996104 (+     0us) reactor.cc:625] Submitting negotiation task for client connection to 0.0.0.0:38891 (local address 127.0.0.1:55376)
0929 20:19:17.996288 (+   184us) negotiation.cc:107] Waiting for socket to connect
0929 20:19:17.996305 (+    17us) client_negotiation.cc:174] Beginning negotiation
0929 20:19:17.996434 (+   129us) client_negotiation.cc:252] Sending NEGOTIATE NegotiatePB request
0929 20:19:18.275812 (+279378us) negotiation.cc:327] Negotiation complete: Network error: Client connection negotiation failed: client connection to 0.0.0.0:38891: BlockingRecv error: recv error from unknown peer: Transport endpoint is not connected (error 107)
Metrics: {"client-negotiator.queue_time_us":54}
[       OK ] Parameters/TestRpcSocketTxRxQueue.OverCapacity/0 (1076 ms)
[----------] 1 test from Parameters/TestRpcSocketTxRxQueue (1076 ms total)

[----------] Global test environment tear-down
[==========] 21 tests from 2 test suites ran. (50129 ms total)
[  PASSED  ] 20 tests.
[  FAILED  ] 1 test, listed below:
[  FAILED  ] Parameters/TestRpc.TestCallWithChainCertAndChainCA/SSL_TCP, where GetParam() = (true, false)

 1 FAILED TEST