Diagnosed failure

Parameters/TestRpc.TestCallWithChainCertAndChainCA/SSL_UnixSocket: /data0/somelongdirectorytoavoidrpathissues/src/kudu/src/kudu/rpc/rpc-test.cc:270: Failure
Failed
Bad status: Runtime error: could not verify certificate chain (error with cert: subject=CN = localhost, ST = sadfjas, C = AS, emailAddress = sdflkdsajf, O = lskdfjlsad, OU = sldfkja, issuer=C = AS, ST = ASDfkjdhf, L = lskdjf, O = saldfja, OU = skdjf, CN = localhost, emailAddress = sadjflkadsj): : certificate has expired
Google Test trace:
/data0/somelongdirectorytoavoidrpathissues/src/kudu/src/kudu/rpc/rpc-test.cc:267: Connecting to unix:/tmp/dist-test-taskmyUcF7/test-tmp/rpc-test-629de80720e4466cbc32ff8d169c851e.sock
I20260929 06:28:31.812077  2820 test_util.cc:175] -----------------------------------------------
I20260929 06:28:31.812116  2820 test_util.cc:176] Had fatal failures, leaving test files at /tmp/dist-test-taskmyUcF7/test-tmp/rpc-test.6.Parameters_TestRpc.TestCallWithChainCertAndChainCA_SSL_UnixSocket.1790663311770130-2820-0

Full log

Note: This is test shard 7 of 8.
[==========] Running 21 tests from 2 test suites.
[----------] Global test environment set-up.
[----------] 20 tests from Parameters/TestRpc
[ RUN      ] Parameters/TestRpc.TestMessengerCreateDestroy/SSL_UnixSocket
WARNING: Logging before InitGoogleLogging() is written to STDERR
I20260929 06:28:31.783918  2820 rpc-test.cc:169] started messenger TestCreateDestroy
[       OK ] Parameters/TestRpc.TestMessengerCreateDestroy/SSL_UnixSocket (12 ms)
[ RUN      ] Parameters/TestRpc.TestNegotiationDeadlock/SSL_UnixSocket
I20260929 06:28:31.793741  2840 acceptor_pool.cc:254] collecting diagnostics on the listening RPC socket unix:/tmp/dist-test-taskmyUcF7/test-tmp/rpc-test-b00c0e07bcb54c339447b6eaa68d532e.sock every 8 connection(s)
I20260929 06:28:31.793776  2841 acceptor_pool.cc:254] collecting diagnostics on the listening RPC socket unix:/tmp/dist-test-taskmyUcF7/test-tmp/rpc-test-b00c0e07bcb54c339447b6eaa68d532e.sock every 8 connection(s)
[       OK ] Parameters/TestRpc.TestNegotiationDeadlock/SSL_UnixSocket (14 ms)
[ RUN      ] Parameters/TestRpc.TestCallWithChainCertAndChainCA/SSL_UnixSocket
I20260929 06:28:31.808807  2856 acceptor_pool.cc:254] collecting diagnostics on the listening RPC socket unix:/tmp/dist-test-taskmyUcF7/test-tmp/rpc-test-629de80720e4466cbc32ff8d169c851e.sock every 8 connection(s)
I20260929 06:28:31.808856  2857 acceptor_pool.cc:254] collecting diagnostics on the listening RPC socket unix:/tmp/dist-test-taskmyUcF7/test-tmp/rpc-test-629de80720e4466cbc32ff8d169c851e.sock every 8 connection(s)
/data0/somelongdirectorytoavoidrpathissues/src/kudu/src/kudu/rpc/rpc-test.cc:270: Failure
Failed
Bad status: Runtime error: could not verify certificate chain (error with cert: subject=CN = localhost, ST = sadfjas, C = AS, emailAddress = sdflkdsajf, O = lskdfjlsad, OU = sldfkja, issuer=C = AS, ST = ASDfkjdhf, L = lskdjf, O = saldfja, OU = skdjf, CN = localhost, emailAddress = sadjflkadsj): : certificate has expired
Google Test trace:
/data0/somelongdirectorytoavoidrpathissues/src/kudu/src/kudu/rpc/rpc-test.cc:267: Connecting to unix:/tmp/dist-test-taskmyUcF7/test-tmp/rpc-test-629de80720e4466cbc32ff8d169c851e.sock
I20260929 06:28:31.812077  2820 test_util.cc:175] -----------------------------------------------
I20260929 06:28:31.812116  2820 test_util.cc:176] Had fatal failures, leaving test files at /tmp/dist-test-taskmyUcF7/test-tmp/rpc-test.6.Parameters_TestRpc.TestCallWithChainCertAndChainCA_SSL_UnixSocket.1790663311770130-2820-0
[  FAILED  ] Parameters/TestRpc.TestCallWithChainCertAndChainCA/SSL_UnixSocket, where GetParam() = (true, true) (12 ms)
[ RUN      ] Parameters/TestRpc.TestCallWithPasswordProtectedKey/SSL_UnixSocket
I20260929 06:28:31.831089  2881 acceptor_pool.cc:254] collecting diagnostics on the listening RPC socket unix:/tmp/dist-test-taskmyUcF7/test-tmp/rpc-test-86b31a1792324ad1a3242238a71a1a8b.sock every 8 connection(s)
I20260929 06:28:31.831090  2882 acceptor_pool.cc:254] collecting diagnostics on the listening RPC socket unix:/tmp/dist-test-taskmyUcF7/test-tmp/rpc-test-86b31a1792324ad1a3242238a71a1a8b.sock every 8 connection(s)
W20260929 06:28:31.841028  2878 connection.cc:196] Error closing socket: Network error: TlsSocket::Close: Broken pipe
[       OK ] Parameters/TestRpc.TestCallWithPasswordProtectedKey/SSL_UnixSocket (29 ms)
[ RUN      ] Parameters/TestRpc.TestCallToBadServer/SSL_UnixSocket
I20260929 06:28:31.854223  2820 rpc-test.cc:394] Status: Network error: Client connection negotiation failed: client connection to 0.0.0.0:0: connect: Connection refused (error 111)
I20260929 06:28:31.854418  2820 rpc-test.cc:394] Status: Network error: Client connection negotiation failed: client connection to 0.0.0.0:0: connect: Connection refused (error 111)
I20260929 06:28:31.854558  2820 rpc-test.cc:394] Status: Network error: Client connection negotiation failed: client connection to 0.0.0.0:0: connect: Connection refused (error 111)
I20260929 06:28:31.854705  2820 rpc-test.cc:394] Status: Network error: Client connection negotiation failed: client connection to 0.0.0.0:0: connect: Connection refused (error 111)
I20260929 06:28:31.854841  2820 rpc-test.cc:394] Status: Network error: Client connection negotiation failed: client connection to 0.0.0.0:0: connect: Connection refused (error 111)
[       OK ] Parameters/TestRpc.TestCallToBadServer/SSL_UnixSocket (13 ms)
[ RUN      ] Parameters/TestRpc.TestWrongService/SSL_UnixSocket
I20260929 06:28:31.892163  2916 acceptor_pool.cc:254] collecting diagnostics on the listening RPC socket unix:/tmp/dist-test-taskmyUcF7/test-tmp/rpc-test-9c8c319fb82e4082a2de706d33f8148c.sock every 8 connection(s)
I20260929 06:28:31.892174  2917 acceptor_pool.cc:254] collecting diagnostics on the listening RPC socket unix:/tmp/dist-test-taskmyUcF7/test-tmp/rpc-test-9c8c319fb82e4082a2de706d33f8148c.sock every 8 connection(s)
I20260929 06:28:31.925097  2913 messenger.cc:345] service WrongServiceName not registered on TestServer
W20260929 06:28:31.925746  2913 connection.cc:196] Error closing socket: Network error: TlsSocket::Close: Broken pipe
[       OK ] Parameters/TestRpc.TestWrongService/SSL_UnixSocket (71 ms)
[ RUN      ] Parameters/TestRpc.TestConnectionKeepalive/SSL_UnixSocket
I20260929 06:28:31.941133  2939 acceptor_pool.cc:254] collecting diagnostics on the listening RPC socket unix:/tmp/dist-test-taskmyUcF7/test-tmp/rpc-test-e9aafedd1ecc4b94b399993da0a4dc4d.sock every 8 connection(s)
I20260929 06:28:31.941191  2940 acceptor_pool.cc:254] collecting diagnostics on the listening RPC socket unix:/tmp/dist-test-taskmyUcF7/test-tmp/rpc-test-e9aafedd1ecc4b94b399993da0a4dc4d.sock every 8 connection(s)
I20260929 06:28:31.941318  2820 rpc-test.cc:488] Connecting to unix:/tmp/dist-test-taskmyUcF7/test-tmp/rpc-test-e9aafedd1ecc4b94b399993da0a4dc4d.sock
W20260929 06:28:32.428169  2952 connection.cc:196] Error closing socket: Network error: TlsSocket::Close: Broken pipe
[       OK ] Parameters/TestRpc.TestConnectionKeepalive/SSL_UnixSocket (1032 ms)
[ RUN      ] Parameters/TestRpc.TestClientConnectionMetrics/SSL_UnixSocket
I20260929 06:28:32.977589  2964 acceptor_pool.cc:254] collecting diagnostics on the listening RPC socket unix:/tmp/dist-test-taskmyUcF7/test-tmp/rpc-test-8d09c87540374c77a9c520a80aff26ee.sock every 8 connection(s)
I20260929 06:28:32.977633  2965 acceptor_pool.cc:254] collecting diagnostics on the listening RPC socket unix:/tmp/dist-test-taskmyUcF7/test-tmp/rpc-test-8d09c87540374c77a9c520a80aff26ee.sock every 8 connection(s)
I20260929 06:28:32.977770  2820 rpc-test.cc:569] Connecting to unix:/tmp/dist-test-taskmyUcF7/test-tmp/rpc-test-8d09c87540374c77a9c520a80aff26ee.sock
W20260929 06:28:40.835804  2961 connection.cc:196] Error closing socket: Network error: TlsSocket::Close: Broken pipe
[       OK ] Parameters/TestRpc.TestClientConnectionMetrics/SSL_UnixSocket (7877 ms)
[ RUN      ] Parameters/TestRpc.TestCredentialsPolicy/SSL_UnixSocket
I20260929 06:28:40.850376  2987 acceptor_pool.cc:254] collecting diagnostics on the listening RPC socket unix:/tmp/dist-test-taskmyUcF7/test-tmp/rpc-test-8635877e531f4426aa8863066efb4483.sock every 8 connection(s)
I20260929 06:28:40.850430  2988 acceptor_pool.cc:254] collecting diagnostics on the listening RPC socket unix:/tmp/dist-test-taskmyUcF7/test-tmp/rpc-test-8635877e531f4426aa8863066efb4483.sock every 8 connection(s)
I20260929 06:28:40.850565  2820 rpc-test.cc:700] Connecting to unix:/tmp/dist-test-taskmyUcF7/test-tmp/rpc-test-8635877e531f4426aa8863066efb4483.sock
W20260929 06:28:40.866827  2986 connection.cc:196] Error closing socket: Network error: TlsSocket::Close: Broken pipe
W20260929 06:28:40.869988  2986 connection.cc:196] Error closing socket: Network error: TlsSocket::Close: Broken pipe
[       OK ] Parameters/TestRpc.TestCredentialsPolicy/SSL_UnixSocket (34 ms)
[ RUN      ] Parameters/TestRpc.TestCallLongerThanKeepalive/SSL_UnixSocket
I20260929 06:28:40.888572  3012 acceptor_pool.cc:254] collecting diagnostics on the listening RPC socket unix:/tmp/dist-test-taskmyUcF7/test-tmp/rpc-test-c70f444af8714881abded87fdc7391ba.sock every 8 connection(s)
I20260929 06:28:40.888623  3013 acceptor_pool.cc:254] collecting diagnostics on the listening RPC socket unix:/tmp/dist-test-taskmyUcF7/test-tmp/rpc-test-c70f444af8714881abded87fdc7391ba.sock every 8 connection(s)
I20260929 06:28:40.895563  3016 rpc-test-base.h:222] got call: sleep_micros: 3000000 deferred: true
I20260929 06:28:43.896166  3016 rpcz_store.cc:275] Call kudu.rpc.GenericCalculatorService.Sleep from unix:<unnamed> (request call id 0) took 3000 ms. Trace:
I20260929 06:28:43.896258  3016 rpcz_store.cc:276] 0929 06:28:40.895522 (+     0us) service_pool.cc:170] Inserting onto call queue
0929 06:28:40.895549 (+    27us) service_pool.cc:227] Handling call
0929 06:28:43.896150 (+3000601us) inbound_call.cc:173] Queueing success response
Metrics: {}
[       OK ] Parameters/TestRpc.TestCallLongerThanKeepalive/SSL_UnixSocket (3027 ms)
[ RUN      ] Parameters/TestRpc.TestRpcSidecar/SSL_UnixSocket
I20260929 06:28:43.916966  3037 acceptor_pool.cc:254] collecting diagnostics on the listening RPC socket unix:/tmp/dist-test-taskmyUcF7/test-tmp/rpc-test-bd756c16427d47ea946830534c2274b5.sock every 8 connection(s)
I20260929 06:28:43.917008  3038 acceptor_pool.cc:254] collecting diagnostics on the listening RPC socket unix:/tmp/dist-test-taskmyUcF7/test-tmp/rpc-test-bd756c16427d47ea946830534c2274b5.sock every 8 connection(s)
W20260929 06:28:43.962781  3034 connection.cc:196] Error closing socket: Network error: TlsSocket::Close: Broken pipe
[       OK ] Parameters/TestRpc.TestRpcSidecar/SSL_UnixSocket (65 ms)
[ RUN      ] Parameters/TestRpc.TestRpcSidecarLimits/SSL_UnixSocket
I20260929 06:28:45.557416  3062 acceptor_pool.cc:254] collecting diagnostics on the listening RPC socket unix:/tmp/dist-test-taskmyUcF7/test-tmp/rpc-test-e987c0d6030a42608f37afb7d768c8b2.sock every 8 connection(s)
I20260929 06:28:45.557483  3063 acceptor_pool.cc:254] collecting diagnostics on the listening RPC socket unix:/tmp/dist-test-taskmyUcF7/test-tmp/rpc-test-e987c0d6030a42608f37afb7d768c8b2.sock every 8 connection(s)
W20260929 06:28:45.568344  2820 serialization.cc:72] Serialized kudu.rpc_test.PushStringsRequestPB (2147483654 bytes) is larger than the maximum configured RPC message size (52428800 bytes). Sending anyway, but peer may reject the data.
W20260929 06:28:45.570984  3059 connection.cc:535] server connection from unix:<unnamed> recv error: Network error: RPC frame had a length of 2147483714, but we only support messages up to 52428800 bytes long.
W20260929 06:28:45.571058  3059 connection.cc:158] shutting down server connection from unix:<unnamed> with pending inbound data: 4/2147483714 bytes received; last active 0 ns ago: status Network error: RPC frame had a length of 2147483714, but we only support messages up to 52428800 bytes long.
W20260929 06:28:45.571228  3075 connection.cc:196] Error closing socket: Network error: TlsSocket::Close: Broken pipe
I20260929 06:28:45.581533  3087 acceptor_pool.cc:254] collecting diagnostics on the listening RPC socket unix:/tmp/dist-test-taskmyUcF7/test-tmp/rpc-test-e987c0d6030a42608f37afb7d768c8b2.sock every 8 connection(s)
I20260929 06:28:45.581552  3088 acceptor_pool.cc:254] collecting diagnostics on the listening RPC socket unix:/tmp/dist-test-taskmyUcF7/test-tmp/rpc-test-e987c0d6030a42608f37afb7d768c8b2.sock every 8 connection(s)
W20260929 06:28:49.659103  3084 connection.cc:577] server connection from unix:<unnamed>: received bad data: 'Corruption: Invalid packet: message had a length of 2147483710, but we only support messages up to 2147483647 bytes
'
W20260929 06:28:49.659372  3100 connection.cc:196] Error closing socket: Network error: TlsSocket::Close: Broken pipe
[       OK ] Parameters/TestRpc.TestRpcSidecarLimits/SSL_UnixSocket (5697 ms)
[ RUN      ] Parameters/TestRpc.TestCallTimeoutDoesntAffectNegotiation/SSL_UnixSocket
I20260929 06:28:49.670758  3112 acceptor_pool.cc:254] collecting diagnostics on the listening RPC socket unix:/tmp/dist-test-taskmyUcF7/test-tmp/rpc-test-09ace02cf7704e5591991d19f1fac808.sock every 8 connection(s)
I20260929 06:28:49.670799  3113 acceptor_pool.cc:254] collecting diagnostics on the listening RPC socket unix:/tmp/dist-test-taskmyUcF7/test-tmp/rpc-test-09ace02cf7704e5591991d19f1fac808.sock every 8 connection(s)
W20260929 06:28:49.689172  3108 negotiation.cc:266] Injecting 500ms delay in negotiation
I20260929 06:28:49.739379  2820 rpc-test-base.h:595] status: Timed out: connection negotiation to unix:/tmp/dist-test-taskmyUcF7/test-tmp/rpc-test-09ace02cf7704e5591991d19f1fac808.sock for RPC Sleep timed out after 0.050s (ON_OUTBOUND_QUEUE), seconds elapsed: 0.050488
[       OK ] Parameters/TestRpc.TestCallTimeoutDoesntAffectNegotiation/SSL_UnixSocket (532 ms)
[ RUN      ] Parameters/TestRpc.TestRpcHandlerLatencyMetric/SSL_UnixSocket
I20260929 06:28:50.207677  3137 acceptor_pool.cc:254] collecting diagnostics on the listening RPC socket unix:/tmp/dist-test-taskmyUcF7/test-tmp/rpc-test-165e740e1f4f493f8fe355dfccb3ffad.sock every 8 connection(s)
I20260929 06:28:50.207715  3138 acceptor_pool.cc:254] collecting diagnostics on the listening RPC socket unix:/tmp/dist-test-taskmyUcF7/test-tmp/rpc-test-165e740e1f4f493f8fe355dfccb3ffad.sock every 8 connection(s)
I20260929 06:28:50.234884  2820 rpc-test.cc:1236] Sleep() min lat: 20216
I20260929 06:28:50.234954  2820 rpc-test.cc:1237] Sleep() mean lat: 20216
I20260929 06:28:50.234979  2820 rpc-test.cc:1238] Sleep() max lat: 20216
I20260929 06:28:50.235051  2820 rpc-test.cc:1239] Sleep() #calls: 1
W20260929 06:28:50.235666  3134 connection.cc:196] Error closing socket: Network error: TlsSocket::Close: Broken pipe
[       OK ] Parameters/TestRpc.TestRpcHandlerLatencyMetric/SSL_UnixSocket (42 ms)
[ RUN      ] Parameters/TestRpc.TimedOutOnResponseMetricServiceQueue/SSL_UnixSocket
I20260929 06:28:50.246986  3163 acceptor_pool.cc:254] collecting diagnostics on the listening RPC socket unix:/tmp/dist-test-taskmyUcF7/test-tmp/rpc-test-e2c6cf4677814740abcdfc96838c5de5.sock every 8 connection(s)
I20260929 06:28:50.247057  3164 acceptor_pool.cc:254] collecting diagnostics on the listening RPC socket unix:/tmp/dist-test-taskmyUcF7/test-tmp/rpc-test-e2c6cf4677814740abcdfc96838c5de5.sock every 8 connection(s)
W20260929 06:28:50.300160  3165 rpcz_store.cc:267] Call kudu.rpc_test.CalculatorService.Sleep from unix:<unnamed> (request call id 2) took 20 ms (client timeout 20 ms). Trace:
W20260929 06:28:50.300261  3165 rpcz_store.cc:269] 0929 06:28:50.279939 (+     0us) service_pool.cc:170] Inserting onto call queue
0929 06:28:50.300138 (+ 20199us) service_pool.cc:214] Skipping call since client already timed out
0929 06:28:50.300148 (+    10us) inbound_call.cc:173] Queueing failure response
Metrics: {}
W20260929 06:28:50.300783  3160 connection.cc:196] Error closing socket: Network error: TlsSocket::Close: Broken pipe
[       OK ] Parameters/TestRpc.TimedOutOnResponseMetricServiceQueue/SSL_UnixSocket (64 ms)
[ RUN      ] Parameters/TestRpc.RpcPendingConnectionsMetric/SSL_UnixSocket
I20260929 06:28:50.303074  3186 acceptor_pool.cc:254] collecting diagnostics on the listening RPC socket 0.0.0.0:34187 every 8 connection(s)
I20260929 06:28:50.303146  3187 acceptor_pool.cc:254] collecting diagnostics on the listening RPC socket 0.0.0.0:34187 every 8 connection(s)
W20260929 06:28:50.311869  3182 negotiation.cc:337] Failed RPC negotiation. Trace:
0929 06:28:50.311651 (+     0us) reactor.cc:625] Submitting negotiation task for server connection from 127.0.0.1:38696 (local address 127.0.0.1:34187)
0929 06:28:50.311702 (+    51us) server_negotiation.cc:206] Beginning negotiation
0929 06:28:50.311704 (+     2us) server_negotiation.cc:399] Waiting for connection header
0929 06:28:50.311796 (+    92us) negotiation.cc:327] Negotiation complete: Network error: Server connection negotiation failed: server connection from 127.0.0.1:38696: BlockingRecv error: recv got EOF from 127.0.0.1:38696 (error 108)
Metrics: {"server-negotiator.queue_time_us":17}
[       OK ] Parameters/TestRpc.RpcPendingConnectionsMetric/SSL_UnixSocket (21 ms)
[ RUN      ] Parameters/TestRpc.TestRpcContextClientDeadline/SSL_UnixSocket
I20260929 06:28:50.344338  3202 acceptor_pool.cc:254] collecting diagnostics on the listening RPC socket unix:/tmp/dist-test-taskmyUcF7/test-tmp/rpc-test-26fca9d0aff44ef8995db185c77f7f73.sock every 8 connection(s)
I20260929 06:28:50.344398  3203 acceptor_pool.cc:254] collecting diagnostics on the listening RPC socket unix:/tmp/dist-test-taskmyUcF7/test-tmp/rpc-test-26fca9d0aff44ef8995db185c77f7f73.sock every 8 connection(s)
W20260929 06:28:50.391907  3199 connection.cc:196] Error closing socket: Network error: TlsSocket::Close: Broken pipe
[       OK ] Parameters/TestRpc.TestRpcContextClientDeadline/SSL_UnixSocket (70 ms)
[ RUN      ] Parameters/TestRpc.TestApplicationFeatureFlagUnsupportedServer/SSL_UnixSocket
I20260929 06:28:50.411505  3227 acceptor_pool.cc:254] collecting diagnostics on the listening RPC socket unix:/tmp/dist-test-taskmyUcF7/test-tmp/rpc-test-933ed5efbeb848fd9b7dcdb74227fecd.sock every 8 connection(s)
I20260929 06:28:50.411576  3228 acceptor_pool.cc:254] collecting diagnostics on the listening RPC socket unix:/tmp/dist-test-taskmyUcF7/test-tmp/rpc-test-933ed5efbeb848fd9b7dcdb74227fecd.sock every 8 connection(s)
[       OK ] Parameters/TestRpc.TestApplicationFeatureFlagUnsupportedServer/SSL_UnixSocket (67 ms)
[ RUN      ] Parameters/TestRpc.TestCancellationAsync/SSL_UnixSocket
I20260929 06:28:50.468974  3252 acceptor_pool.cc:254] collecting diagnostics on the listening RPC socket unix:/tmp/dist-test-taskmyUcF7/test-tmp/rpc-test-3f8aed55206d4c5891025327437e24fa.sock every 8 connection(s)
I20260929 06:28:50.469019  3253 acceptor_pool.cc:254] collecting diagnostics on the listening RPC socket unix:/tmp/dist-test-taskmyUcF7/test-tmp/rpc-test-3f8aed55206d4c5891025327437e24fa.sock every 8 connection(s)
I20260929 06:28:50.469133  2820 rpc-test.cc:1716] Connecting to unix:/tmp/dist-test-taskmyUcF7/test-tmp/rpc-test-3f8aed55206d4c5891025327437e24fa.sock
I20260929 06:28:50.478065  2820 test_util.cc:268] Using random seed: 1270462445
I20260929 06:28:50.493292  3255 rpc-test-base.h:240] got call: sleep_micros: 500 pattern: 4294967295 num_repetitions: 2097152 sidecar_idx: 0
I20260929 06:28:50.504925  3255 rpc-test-base.h:240] got call: sleep_micros: 500 pattern: 4294967295 num_repetitions: 2097152 sidecar_idx: 0
I20260929 06:28:50.516829  3255 rpc-test-base.h:240] got call: sleep_micros: 500 pattern: 4294967295 num_repetitions: 2097152 sidecar_idx: 0
I20260929 06:28:50.529590  3255 rpc-test-base.h:240] got call: sleep_micros: 500 pattern: 4294967295 num_repetitions: 2097152 sidecar_idx: 0
I20260929 06:28:50.541676  3255 rpc-test-base.h:240] got call: sleep_micros: 500 pattern: 4294967295 num_repetitions: 2097152 sidecar_idx: 0
I20260929 06:28:50.553105  3255 rpc-test-base.h:240] got call: sleep_micros: 500 pattern: 4294967295 num_repetitions: 2097152 sidecar_idx: 0
I20260929 06:28:50.564863  3255 rpc-test-base.h:240] got call: sleep_micros: 500 pattern: 4294967295 num_repetitions: 2097152 sidecar_idx: 0
I20260929 06:28:50.576213  3255 rpc-test-base.h:240] got call: sleep_micros: 500 pattern: 4294967295 num_repetitions: 2097152 sidecar_idx: 0
W20260929 06:28:50.577317  3249 connection.cc:196] Error closing socket: Network error: TlsSocket::Close: Broken pipe
W20260929 06:28:50.579046  3249 connection.cc:441] server connection from unix:<unnamed> torn down before Call kudu.rpc.GenericCalculatorService.SleepWithSidecar from unix:<unnamed> (request call id 9) could send its response
[       OK ] Parameters/TestRpc.TestCancellationAsync/SSL_UnixSocket (119 ms)
[ RUN      ] Parameters/TestRpc.TestPerformanceBySocketType/SSL_UnixSocket
I20260929 06:28:50.592160  3277 acceptor_pool.cc:254] collecting diagnostics on the listening RPC socket unix:/tmp/dist-test-taskmyUcF7/test-tmp/rpc-test-db0ab76868444d2fa08bcedc85e0050c.sock every 8 connection(s)
I20260929 06:28:50.592218  3278 acceptor_pool.cc:254] collecting diagnostics on the listening RPC socket unix:/tmp/dist-test-taskmyUcF7/test-tmp/rpc-test-db0ab76868444d2fa08bcedc85e0050c.sock every 8 connection(s)
I20260929 06:28:50.592361  2820 rpc-test.cc:1846] Connecting to unix:/tmp/dist-test-taskmyUcF7/test-tmp/rpc-test-db0ab76868444d2fa08bcedc85e0050c.sock
I20260929 06:28:51.680641  2820 rpc-test.cc:1859] Sending 1024MB via ssl-enabled unix socket: real 1.067s	user 1.205s	sys 0.740s
I20260929 06:28:52.734524  2820 rpc-test.cc:1859] Sending 1024MB via ssl-enabled unix socket: real 1.054s	user 1.196s	sys 0.736s
I20260929 06:28:53.791345  2820 rpc-test.cc:1859] Sending 1024MB via ssl-enabled unix socket: real 1.057s	user 1.192s	sys 0.742s
I20260929 06:28:54.839468  2820 rpc-test.cc:1859] Sending 1024MB via ssl-enabled unix socket: real 1.048s	user 1.220s	sys 0.689s
I20260929 06:28:55.932050  2820 rpc-test.cc:1859] Sending 1024MB via ssl-enabled unix socket: real 1.092s	user 1.244s	sys 0.746s
W20260929 06:28:55.932678  3274 connection.cc:196] Error closing socket: Network error: TlsSocket::Close: Broken pipe
[       OK ] Parameters/TestRpc.TestPerformanceBySocketType/SSL_UnixSocket (5353 ms)
[----------] 20 tests from Parameters/TestRpc (24161 ms total)

[----------] 1 test from Parameters/TestRpcSocketTxRxQueue
[ RUN      ] Parameters/TestRpcSocketTxRxQueue.AcceptorRxQueueSizeMetric/0
I20260929 06:28:55.938912  3302 acceptor_pool.cc:254] collecting diagnostics on the listening RPC socket 0.0.0.0:38835 every 1 connection(s)
I20260929 06:28:55.938979  3303 acceptor_pool.cc:254] collecting diagnostics on the listening RPC socket 0.0.0.0:38835 every 1 connection(s)
W20260929 06:28:55.939436  3298 negotiation.cc:337] Failed RPC negotiation. Trace:
0929 06:28:55.939307 (+     0us) reactor.cc:625] Submitting negotiation task for server connection from 127.0.0.1:57012 (local address 127.0.0.1:38835)
0929 06:28:55.939347 (+    40us) server_negotiation.cc:206] Beginning negotiation
0929 06:28:55.939349 (+     2us) server_negotiation.cc:399] Waiting for connection header
0929 06:28:55.939410 (+    61us) negotiation.cc:327] Negotiation complete: Network error: Server connection negotiation failed: server connection from 127.0.0.1:57012: BlockingRecv error: recv got EOF from 127.0.0.1:57012 (error 108)
Metrics: {"server-negotiator.queue_time_us":13}
[       OK ] Parameters/TestRpcSocketTxRxQueue.AcceptorRxQueueSizeMetric/0 (7 ms)
[----------] 1 test from Parameters/TestRpcSocketTxRxQueue (7 ms total)

[----------] Global test environment tear-down
[==========] 21 tests from 2 test suites ran. (24168 ms total)
[  PASSED  ] 20 tests.
[  FAILED  ] 1 test, listed below:
[  FAILED  ] Parameters/TestRpc.TestCallWithChainCertAndChainCA/SSL_UnixSocket, where GetParam() = (true, true)

 1 FAILED TEST