Diagnosed failure
Parameters/TestRpc.TestCallWithChainCertAndChainCA/SSL_UnixSocket: /data0/somelongdirectorytoavoidrpathissues/src/kudu/src/kudu/rpc/rpc-test.cc:270: Failure
Failed
Bad status: Runtime error: could not verify certificate chain (error with cert: subject=CN = localhost, ST = sadfjas, C = AS, emailAddress = sdflkdsajf, O = lskdfjlsad, OU = sldfkja, issuer=C = AS, ST = ASDfkjdhf, L = lskdjf, O = saldfja, OU = skdjf, CN = localhost, emailAddress = sadjflkadsj): : certificate has expired
Google Test trace:
/data0/somelongdirectorytoavoidrpathissues/src/kudu/src/kudu/rpc/rpc-test.cc:267: Connecting to unix:/tmp/dist-test-taskzvHxFP/test-tmp/rpc-test-a760f101c2b542d6a1a4543f4f88a6ba.sock
I20260927 21:39:56.814632 2008 test_util.cc:175] -----------------------------------------------
I20260927 21:39:56.814702 2008 test_util.cc:176] Had fatal failures, leaving test files at /tmp/dist-test-taskzvHxFP/test-tmp/rpc-test.6.Parameters_TestRpc.TestCallWithChainCertAndChainCA_SSL_UnixSocket.1790545196744794-2008-0
Full log
Note: This is test shard 7 of 8.
[==========] Running 21 tests from 2 test suites.
[----------] Global test environment set-up.
[----------] 20 tests from Parameters/TestRpc
[ RUN ] Parameters/TestRpc.TestMessengerCreateDestroy/SSL_UnixSocket
WARNING: Logging before InitGoogleLogging() is written to STDERR
I20260927 21:39:56.772713 2008 rpc-test.cc:169] started messenger TestCreateDestroy
[ OK ] Parameters/TestRpc.TestMessengerCreateDestroy/SSL_UnixSocket (25 ms)
[ RUN ] Parameters/TestRpc.TestNegotiationDeadlock/SSL_UnixSocket
I20260927 21:39:56.787531 2028 acceptor_pool.cc:254] collecting diagnostics on the listening RPC socket unix:/tmp/dist-test-taskzvHxFP/test-tmp/rpc-test-0110c3e23ea74ea78a9606c2876cd169.sock every 8 connection(s)
I20260927 21:39:56.787531 2029 acceptor_pool.cc:254] collecting diagnostics on the listening RPC socket unix:/tmp/dist-test-taskzvHxFP/test-tmp/rpc-test-0110c3e23ea74ea78a9606c2876cd169.sock every 8 connection(s)
[ OK ] Parameters/TestRpc.TestNegotiationDeadlock/SSL_UnixSocket (20 ms)
[ RUN ] Parameters/TestRpc.TestCallWithChainCertAndChainCA/SSL_UnixSocket
I20260927 21:39:56.809520 2044 acceptor_pool.cc:254] collecting diagnostics on the listening RPC socket unix:/tmp/dist-test-taskzvHxFP/test-tmp/rpc-test-a760f101c2b542d6a1a4543f4f88a6ba.sock every 8 connection(s)
I20260927 21:39:56.809576 2045 acceptor_pool.cc:254] collecting diagnostics on the listening RPC socket unix:/tmp/dist-test-taskzvHxFP/test-tmp/rpc-test-a760f101c2b542d6a1a4543f4f88a6ba.sock every 8 connection(s)
/data0/somelongdirectorytoavoidrpathissues/src/kudu/src/kudu/rpc/rpc-test.cc:270: Failure
Failed
Bad status: Runtime error: could not verify certificate chain (error with cert: subject=CN = localhost, ST = sadfjas, C = AS, emailAddress = sdflkdsajf, O = lskdfjlsad, OU = sldfkja, issuer=C = AS, ST = ASDfkjdhf, L = lskdjf, O = saldfja, OU = skdjf, CN = localhost, emailAddress = sadjflkadsj): : certificate has expired
Google Test trace:
/data0/somelongdirectorytoavoidrpathissues/src/kudu/src/kudu/rpc/rpc-test.cc:267: Connecting to unix:/tmp/dist-test-taskzvHxFP/test-tmp/rpc-test-a760f101c2b542d6a1a4543f4f88a6ba.sock
I20260927 21:39:56.814632 2008 test_util.cc:175] -----------------------------------------------
I20260927 21:39:56.814702 2008 test_util.cc:176] Had fatal failures, leaving test files at /tmp/dist-test-taskzvHxFP/test-tmp/rpc-test.6.Parameters_TestRpc.TestCallWithChainCertAndChainCA_SSL_UnixSocket.1790545196744794-2008-0
[ FAILED ] Parameters/TestRpc.TestCallWithChainCertAndChainCA/SSL_UnixSocket, where GetParam() = (true, true) (20 ms)
[ RUN ] Parameters/TestRpc.TestCallWithPasswordProtectedKey/SSL_UnixSocket
I20260927 21:39:56.821668 2069 acceptor_pool.cc:254] collecting diagnostics on the listening RPC socket unix:/tmp/dist-test-taskzvHxFP/test-tmp/rpc-test-2ed92d8a23ec4138a5abfaa4b1e0e0a3.sock every 8 connection(s)
I20260927 21:39:56.821696 2070 acceptor_pool.cc:254] collecting diagnostics on the listening RPC socket unix:/tmp/dist-test-taskzvHxFP/test-tmp/rpc-test-2ed92d8a23ec4138a5abfaa4b1e0e0a3.sock every 8 connection(s)
W20260927 21:39:56.833386 2066 connection.cc:196] Error closing socket: Network error: TlsSocket::Close: Broken pipe
[ OK ] Parameters/TestRpc.TestCallWithPasswordProtectedKey/SSL_UnixSocket (19 ms)
[ RUN ] Parameters/TestRpc.TestCallToBadServer/SSL_UnixSocket
I20260927 21:39:56.838948 2008 rpc-test.cc:394] Status: Network error: Client connection negotiation failed: client connection to 0.0.0.0:0: connect: Connection refused (error 111)
I20260927 21:39:56.839252 2008 rpc-test.cc:394] Status: Network error: Client connection negotiation failed: client connection to 0.0.0.0:0: connect: Connection refused (error 111)
I20260927 21:39:56.839526 2008 rpc-test.cc:394] Status: Network error: Client connection negotiation failed: client connection to 0.0.0.0:0: connect: Connection refused (error 111)
I20260927 21:39:56.839775 2008 rpc-test.cc:394] Status: Network error: Client connection negotiation failed: client connection to 0.0.0.0:0: connect: Connection refused (error 111)
I20260927 21:39:56.839965 2008 rpc-test.cc:394] Status: Network error: Client connection negotiation failed: client connection to 0.0.0.0:0: connect: Connection refused (error 111)
[ OK ] Parameters/TestRpc.TestCallToBadServer/SSL_UnixSocket (6 ms)
[ RUN ] Parameters/TestRpc.TestWrongService/SSL_UnixSocket
I20260927 21:39:56.850771 2104 acceptor_pool.cc:254] collecting diagnostics on the listening RPC socket unix:/tmp/dist-test-taskzvHxFP/test-tmp/rpc-test-07f9e7944ab24246b3d51de3d0274397.sock every 8 connection(s)
I20260927 21:39:56.850828 2105 acceptor_pool.cc:254] collecting diagnostics on the listening RPC socket unix:/tmp/dist-test-taskzvHxFP/test-tmp/rpc-test-07f9e7944ab24246b3d51de3d0274397.sock every 8 connection(s)
I20260927 21:39:56.863885 2101 messenger.cc:345] service WrongServiceName not registered on TestServer
[ OK ] Parameters/TestRpc.TestWrongService/SSL_UnixSocket (24 ms)
[ RUN ] Parameters/TestRpc.TestConnectionKeepalive/SSL_UnixSocket
I20260927 21:39:56.882262 2127 acceptor_pool.cc:254] collecting diagnostics on the listening RPC socket unix:/tmp/dist-test-taskzvHxFP/test-tmp/rpc-test-69ac6310325646e794bed280f880e414.sock every 8 connection(s)
I20260927 21:39:56.882462 2008 rpc-test.cc:488] Connecting to unix:/tmp/dist-test-taskzvHxFP/test-tmp/rpc-test-69ac6310325646e794bed280f880e414.sock
I20260927 21:39:56.882293 2128 acceptor_pool.cc:254] collecting diagnostics on the listening RPC socket unix:/tmp/dist-test-taskzvHxFP/test-tmp/rpc-test-69ac6310325646e794bed280f880e414.sock every 8 connection(s)
W20260927 21:39:57.366809 2140 connection.cc:196] Error closing socket: Network error: TlsSocket::Close: Broken pipe
[ OK ] Parameters/TestRpc.TestConnectionKeepalive/SSL_UnixSocket (1040 ms)
[ RUN ] Parameters/TestRpc.TestClientConnectionMetrics/SSL_UnixSocket
I20260927 21:39:57.922735 2152 acceptor_pool.cc:254] collecting diagnostics on the listening RPC socket unix:/tmp/dist-test-taskzvHxFP/test-tmp/rpc-test-39ba423beef546f2a8061d19965fdda6.sock every 8 connection(s)
I20260927 21:39:57.922791 2153 acceptor_pool.cc:254] collecting diagnostics on the listening RPC socket unix:/tmp/dist-test-taskzvHxFP/test-tmp/rpc-test-39ba423beef546f2a8061d19965fdda6.sock every 8 connection(s)
I20260927 21:39:57.922948 2008 rpc-test.cc:569] Connecting to unix:/tmp/dist-test-taskzvHxFP/test-tmp/rpc-test-39ba423beef546f2a8061d19965fdda6.sock
W20260927 21:40:06.420087 2149 connection.cc:196] Error closing socket: Network error: TlsSocket::Close: Broken pipe
[ OK ] Parameters/TestRpc.TestClientConnectionMetrics/SSL_UnixSocket (8514 ms)
[ RUN ] Parameters/TestRpc.TestCredentialsPolicy/SSL_UnixSocket
I20260927 21:40:06.437158 2175 acceptor_pool.cc:254] collecting diagnostics on the listening RPC socket unix:/tmp/dist-test-taskzvHxFP/test-tmp/rpc-test-96f51e929ed240049b7929bb84a292cf.sock every 8 connection(s)
I20260927 21:40:06.437300 2176 acceptor_pool.cc:254] collecting diagnostics on the listening RPC socket unix:/tmp/dist-test-taskzvHxFP/test-tmp/rpc-test-96f51e929ed240049b7929bb84a292cf.sock every 8 connection(s)
I20260927 21:40:06.437450 2008 rpc-test.cc:700] Connecting to unix:/tmp/dist-test-taskzvHxFP/test-tmp/rpc-test-96f51e929ed240049b7929bb84a292cf.sock
W20260927 21:40:06.453246 2174 connection.cc:196] Error closing socket: Network error: TlsSocket::Close: Broken pipe
[ OK ] Parameters/TestRpc.TestCredentialsPolicy/SSL_UnixSocket (37 ms)
[ RUN ] Parameters/TestRpc.TestCallLongerThanKeepalive/SSL_UnixSocket
I20260927 21:40:06.474210 2201 acceptor_pool.cc:254] collecting diagnostics on the listening RPC socket unix:/tmp/dist-test-taskzvHxFP/test-tmp/rpc-test-96b2ab826a094188b63f25752ea29036.sock every 8 connection(s)
I20260927 21:40:06.474210 2200 acceptor_pool.cc:254] collecting diagnostics on the listening RPC socket unix:/tmp/dist-test-taskzvHxFP/test-tmp/rpc-test-96b2ab826a094188b63f25752ea29036.sock every 8 connection(s)
I20260927 21:40:06.491479 2202 rpc-test-base.h:222] got call: sleep_micros: 3000000 deferred: true
I20260927 21:40:09.492296 2202 rpcz_store.cc:275] Call kudu.rpc.GenericCalculatorService.Sleep from unix:<unnamed> (request call id 0) took 3000 ms. Trace:
I20260927 21:40:09.492424 2202 rpcz_store.cc:276] 0927 21:40:06.491392 (+ 0us) service_pool.cc:170] Inserting onto call queue
0927 21:40:06.491452 (+ 60us) service_pool.cc:227] Handling call
0927 21:40:09.492280 (+3000828us) inbound_call.cc:173] Queueing success response
Metrics: {}
W20260927 21:40:09.493477 2197 connection.cc:196] Error closing socket: Network error: TlsSocket::Close: Broken pipe
[ OK ] Parameters/TestRpc.TestCallLongerThanKeepalive/SSL_UnixSocket (3035 ms)
[ RUN ] Parameters/TestRpc.TestRpcSidecar/SSL_UnixSocket
I20260927 21:40:09.502764 2225 acceptor_pool.cc:254] collecting diagnostics on the listening RPC socket unix:/tmp/dist-test-taskzvHxFP/test-tmp/rpc-test-bad539df18a94ee799de84fdc3201ae3.sock every 8 connection(s)
I20260927 21:40:09.502853 2226 acceptor_pool.cc:254] collecting diagnostics on the listening RPC socket unix:/tmp/dist-test-taskzvHxFP/test-tmp/rpc-test-bad539df18a94ee799de84fdc3201ae3.sock every 8 connection(s)
W20260927 21:40:09.539523 2222 connection.cc:196] Error closing socket: Network error: TlsSocket::Close: Broken pipe
[ OK ] Parameters/TestRpc.TestRpcSidecar/SSL_UnixSocket (46 ms)
[ RUN ] Parameters/TestRpc.TestRpcSidecarLimits/SSL_UnixSocket
I20260927 21:40:11.329583 2250 acceptor_pool.cc:254] collecting diagnostics on the listening RPC socket unix:/tmp/dist-test-taskzvHxFP/test-tmp/rpc-test-9dc648c2402648ea8ee0b95cd9c57d7c.sock every 8 connection(s)
I20260927 21:40:11.329629 2251 acceptor_pool.cc:254] collecting diagnostics on the listening RPC socket unix:/tmp/dist-test-taskzvHxFP/test-tmp/rpc-test-9dc648c2402648ea8ee0b95cd9c57d7c.sock every 8 connection(s)
W20260927 21:40:11.337705 2008 serialization.cc:72] Serialized kudu.rpc_test.PushStringsRequestPB (2147483654 bytes) is larger than the maximum configured RPC message size (52428800 bytes). Sending anyway, but peer may reject the data.
W20260927 21:40:11.341037 2247 connection.cc:535] server connection from unix:<unnamed> recv error: Network error: RPC frame had a length of 2147483714, but we only support messages up to 52428800 bytes long.
W20260927 21:40:11.341109 2247 connection.cc:158] shutting down server connection from unix:<unnamed> with pending inbound data: 4/2147483714 bytes received; last active 0 ns ago: status Network error: RPC frame had a length of 2147483714, but we only support messages up to 52428800 bytes long.
W20260927 21:40:11.341274 2263 connection.cc:698] client connection to unix:/tmp/dist-test-taskzvHxFP/test-tmp/rpc-test-9dc648c2402648ea8ee0b95cd9c57d7c.sock send error: Network error: failed to write to TLS socket: Broken pipe
W20260927 21:40:11.341399 2263 connection.cc:196] Error closing socket: Network error: TlsSocket::Close: Success
I20260927 21:40:11.365393 2276 acceptor_pool.cc:254] collecting diagnostics on the listening RPC socket unix:/tmp/dist-test-taskzvHxFP/test-tmp/rpc-test-9dc648c2402648ea8ee0b95cd9c57d7c.sock every 8 connection(s)
I20260927 21:40:11.365450 2275 acceptor_pool.cc:254] collecting diagnostics on the listening RPC socket unix:/tmp/dist-test-taskzvHxFP/test-tmp/rpc-test-9dc648c2402648ea8ee0b95cd9c57d7c.sock every 8 connection(s)
W20260927 21:40:15.891135 2272 connection.cc:577] server connection from unix:<unnamed>: received bad data: 'Corruption: Invalid packet: message had a length of 2147483710, but we only support messages up to 2147483647 bytes
'
W20260927 21:40:15.891419 2288 connection.cc:196] Error closing socket: Network error: TlsSocket::Close: Broken pipe
[ OK ] Parameters/TestRpc.TestRpcSidecarLimits/SSL_UnixSocket (6351 ms)
[ RUN ] Parameters/TestRpc.TestCallTimeoutDoesntAffectNegotiation/SSL_UnixSocket
I20260927 21:40:15.925175 2300 acceptor_pool.cc:254] collecting diagnostics on the listening RPC socket unix:/tmp/dist-test-taskzvHxFP/test-tmp/rpc-test-e6eb5b996e424968a2b13540d83b8026.sock every 8 connection(s)
I20260927 21:40:15.925206 2301 acceptor_pool.cc:254] collecting diagnostics on the listening RPC socket unix:/tmp/dist-test-taskzvHxFP/test-tmp/rpc-test-e6eb5b996e424968a2b13540d83b8026.sock every 8 connection(s)
W20260927 21:40:15.950783 2293 negotiation.cc:266] Injecting 500ms delay in negotiation
I20260927 21:40:16.000990 2008 rpc-test-base.h:595] status: Timed out: connection negotiation to unix:/tmp/dist-test-taskzvHxFP/test-tmp/rpc-test-e6eb5b996e424968a2b13540d83b8026.sock for RPC Sleep timed out after 0.050s (ON_OUTBOUND_QUEUE), seconds elapsed: 0.0505907
[ OK ] Parameters/TestRpc.TestCallTimeoutDoesntAffectNegotiation/SSL_UnixSocket (562 ms)
[ RUN ] Parameters/TestRpc.TestRpcHandlerLatencyMetric/SSL_UnixSocket
I20260927 21:40:16.462919 2325 acceptor_pool.cc:254] collecting diagnostics on the listening RPC socket unix:/tmp/dist-test-taskzvHxFP/test-tmp/rpc-test-694fe1127f83458aa515ac49801558e1.sock every 8 connection(s)
I20260927 21:40:16.463029 2326 acceptor_pool.cc:254] collecting diagnostics on the listening RPC socket unix:/tmp/dist-test-taskzvHxFP/test-tmp/rpc-test-694fe1127f83458aa515ac49801558e1.sock every 8 connection(s)
I20260927 21:40:16.496802 2008 rpc-test.cc:1236] Sleep() min lat: 20271
I20260927 21:40:16.496881 2008 rpc-test.cc:1237] Sleep() mean lat: 20271
I20260927 21:40:16.496920 2008 rpc-test.cc:1238] Sleep() max lat: 20271
I20260927 21:40:16.496934 2008 rpc-test.cc:1239] Sleep() #calls: 1
W20260927 21:40:16.497606 2322 connection.cc:196] Error closing socket: Network error: TlsSocket::Close: Broken pipe
[ OK ] Parameters/TestRpc.TestRpcHandlerLatencyMetric/SSL_UnixSocket (42 ms)
[ RUN ] Parameters/TestRpc.TimedOutOnResponseMetricServiceQueue/SSL_UnixSocket
I20260927 21:40:16.507011 2351 acceptor_pool.cc:254] collecting diagnostics on the listening RPC socket unix:/tmp/dist-test-taskzvHxFP/test-tmp/rpc-test-c028a79ecba242d49d278ffb1e828a27.sock every 8 connection(s)
I20260927 21:40:16.507047 2352 acceptor_pool.cc:254] collecting diagnostics on the listening RPC socket unix:/tmp/dist-test-taskzvHxFP/test-tmp/rpc-test-c028a79ecba242d49d278ffb1e828a27.sock every 8 connection(s)
W20260927 21:40:16.601912 2353 rpcz_store.cc:267] Call kudu.rpc_test.CalculatorService.Sleep from unix:<unnamed> (request call id 2) took 20 ms (client timeout 20 ms). Trace:
W20260927 21:40:16.601997 2353 rpcz_store.cc:269] 0927 21:40:16.581670 (+ 0us) service_pool.cc:170] Inserting onto call queue
0927 21:40:16.601878 (+ 20208us) service_pool.cc:214] Skipping call since client already timed out
0927 21:40:16.601888 (+ 10us) inbound_call.cc:173] Queueing failure response
Metrics: {}
[ OK ] Parameters/TestRpc.TimedOutOnResponseMetricServiceQueue/SSL_UnixSocket (104 ms)
[ RUN ] Parameters/TestRpc.RpcPendingConnectionsMetric/SSL_UnixSocket
I20260927 21:40:16.605275 2374 acceptor_pool.cc:254] collecting diagnostics on the listening RPC socket 0.0.0.0:44293 every 8 connection(s)
I20260927 21:40:16.605343 2375 acceptor_pool.cc:254] collecting diagnostics on the listening RPC socket 0.0.0.0:44293 every 8 connection(s)
W20260927 21:40:16.615127 2370 negotiation.cc:337] Failed RPC negotiation. Trace:
0927 21:40:16.614809 (+ 0us) reactor.cc:625] Submitting negotiation task for server connection from 127.0.0.1:46376 (local address 127.0.0.1:44293)
0927 21:40:16.614887 (+ 78us) server_negotiation.cc:206] Beginning negotiation
0927 21:40:16.614889 (+ 2us) server_negotiation.cc:399] Waiting for connection header
0927 21:40:16.615012 (+ 123us) negotiation.cc:327] Negotiation complete: Network error: Server connection negotiation failed: server connection from 127.0.0.1:46376: BlockingRecv error: recv got EOF from 127.0.0.1:46376 (error 108)
Metrics: {"server-negotiator.queue_time_us":24}
[ OK ] Parameters/TestRpc.RpcPendingConnectionsMetric/SSL_UnixSocket (22 ms)
[ RUN ] Parameters/TestRpc.TestRpcContextClientDeadline/SSL_UnixSocket
I20260927 21:40:16.651255 2390 acceptor_pool.cc:254] collecting diagnostics on the listening RPC socket unix:/tmp/dist-test-taskzvHxFP/test-tmp/rpc-test-da2b3b509ee64f0a9634a094c394c797.sock every 8 connection(s)
I20260927 21:40:16.651296 2391 acceptor_pool.cc:254] collecting diagnostics on the listening RPC socket unix:/tmp/dist-test-taskzvHxFP/test-tmp/rpc-test-da2b3b509ee64f0a9634a094c394c797.sock every 8 connection(s)
W20260927 21:40:16.710664 2387 connection.cc:196] Error closing socket: Network error: TlsSocket::Close: Broken pipe
[ OK ] Parameters/TestRpc.TestRpcContextClientDeadline/SSL_UnixSocket (85 ms)
[ RUN ] Parameters/TestRpc.TestApplicationFeatureFlagUnsupportedServer/SSL_UnixSocket
I20260927 21:40:16.725828 2415 acceptor_pool.cc:254] collecting diagnostics on the listening RPC socket unix:/tmp/dist-test-taskzvHxFP/test-tmp/rpc-test-3b670c5bd459427ab39bd50c3a4294f1.sock every 8 connection(s)
I20260927 21:40:16.725870 2416 acceptor_pool.cc:254] collecting diagnostics on the listening RPC socket unix:/tmp/dist-test-taskzvHxFP/test-tmp/rpc-test-3b670c5bd459427ab39bd50c3a4294f1.sock every 8 connection(s)
[ OK ] Parameters/TestRpc.TestApplicationFeatureFlagUnsupportedServer/SSL_UnixSocket (32 ms)
[ RUN ] Parameters/TestRpc.TestCancellationAsync/SSL_UnixSocket
I20260927 21:40:16.758625 2440 acceptor_pool.cc:254] collecting diagnostics on the listening RPC socket unix:/tmp/dist-test-taskzvHxFP/test-tmp/rpc-test-dc77a5a6aa944c0788e4d5c97b18a4b9.sock every 8 connection(s)
I20260927 21:40:16.758656 2441 acceptor_pool.cc:254] collecting diagnostics on the listening RPC socket unix:/tmp/dist-test-taskzvHxFP/test-tmp/rpc-test-dc77a5a6aa944c0788e4d5c97b18a4b9.sock every 8 connection(s)
I20260927 21:40:16.758826 2008 rpc-test.cc:1716] Connecting to unix:/tmp/dist-test-taskzvHxFP/test-tmp/rpc-test-dc77a5a6aa944c0788e4d5c97b18a4b9.sock
I20260927 21:40:16.784940 2008 test_util.cc:268] Using random seed: -879113687
I20260927 21:40:16.803038 2442 rpc-test-base.h:240] got call: sleep_micros: 500 pattern: 4294967295 num_repetitions: 2097152 sidecar_idx: 0
I20260927 21:40:16.813920 2442 rpc-test-base.h:240] got call: sleep_micros: 500 pattern: 4294967295 num_repetitions: 2097152 sidecar_idx: 0
I20260927 21:40:16.824620 2442 rpc-test-base.h:240] got call: sleep_micros: 500 pattern: 4294967295 num_repetitions: 2097152 sidecar_idx: 0
I20260927 21:40:16.835258 2442 rpc-test-base.h:240] got call: sleep_micros: 500 pattern: 4294967295 num_repetitions: 2097152 sidecar_idx: 0
I20260927 21:40:16.846004 2442 rpc-test-base.h:240] got call: sleep_micros: 500 pattern: 4294967295 num_repetitions: 2097152 sidecar_idx: 0
I20260927 21:40:16.856734 2442 rpc-test-base.h:240] got call: sleep_micros: 500 pattern: 4294967295 num_repetitions: 2097152 sidecar_idx: 0
I20260927 21:40:16.867184 2442 rpc-test-base.h:240] got call: sleep_micros: 500 pattern: 4294967295 num_repetitions: 2097152 sidecar_idx: 0
I20260927 21:40:16.877573 2442 rpc-test-base.h:240] got call: sleep_micros: 500 pattern: 4294967295 num_repetitions: 2097152 sidecar_idx: 0
W20260927 21:40:16.879259 2437 connection.cc:196] Error closing socket: Network error: TlsSocket::Close: Broken pipe
W20260927 21:40:16.880647 2437 connection.cc:441] server connection from unix:<unnamed> torn down before Call kudu.rpc.GenericCalculatorService.SleepWithSidecar from unix:<unnamed> (request call id 9) could send its response
[ OK ] Parameters/TestRpc.TestCancellationAsync/SSL_UnixSocket (137 ms)
[ RUN ] Parameters/TestRpc.TestPerformanceBySocketType/SSL_UnixSocket
I20260927 21:40:16.898197 2465 acceptor_pool.cc:254] collecting diagnostics on the listening RPC socket unix:/tmp/dist-test-taskzvHxFP/test-tmp/rpc-test-dc99b4b82559466c855468c0b45f303a.sock every 8 connection(s)
I20260927 21:40:16.898240 2466 acceptor_pool.cc:254] collecting diagnostics on the listening RPC socket unix:/tmp/dist-test-taskzvHxFP/test-tmp/rpc-test-dc99b4b82559466c855468c0b45f303a.sock every 8 connection(s)
I20260927 21:40:16.898429 2008 rpc-test.cc:1846] Connecting to unix:/tmp/dist-test-taskzvHxFP/test-tmp/rpc-test-dc99b4b82559466c855468c0b45f303a.sock
I20260927 21:40:18.227857 2008 rpc-test.cc:1859] Sending 1024MB via ssl-enabled unix socket: real 1.313s user 1.455s sys 0.879s
I20260927 21:40:19.520828 2008 rpc-test.cc:1859] Sending 1024MB via ssl-enabled unix socket: real 1.293s user 1.359s sys 0.950s
I20260927 21:40:20.788740 2008 rpc-test.cc:1859] Sending 1024MB via ssl-enabled unix socket: real 1.268s user 1.238s sys 1.044s
I20260927 21:40:22.059365 2008 rpc-test.cc:1859] Sending 1024MB via ssl-enabled unix socket: real 1.271s user 1.308s sys 0.970s
I20260927 21:40:23.298096 2008 rpc-test.cc:1859] Sending 1024MB via ssl-enabled unix socket: real 1.239s user 1.325s sys 0.897s
W20260927 21:40:23.298813 2462 connection.cc:196] Error closing socket: Network error: TlsSocket::Close: Broken pipe
[ OK ] Parameters/TestRpc.TestPerformanceBySocketType/SSL_UnixSocket (6418 ms)
[----------] 20 tests from Parameters/TestRpc (26552 ms total)
[----------] 1 test from Parameters/TestRpcSocketTxRxQueue
[ RUN ] Parameters/TestRpcSocketTxRxQueue.AcceptorRxQueueSizeMetric/0
I20260927 21:40:23.310184 2490 acceptor_pool.cc:254] collecting diagnostics on the listening RPC socket 0.0.0.0:34043 every 1 connection(s)
I20260927 21:40:23.310251 2491 acceptor_pool.cc:254] collecting diagnostics on the listening RPC socket 0.0.0.0:34043 every 1 connection(s)
W20260927 21:40:23.310910 2486 negotiation.cc:337] Failed RPC negotiation. Trace:
0927 21:40:23.310766 (+ 0us) reactor.cc:625] Submitting negotiation task for server connection from 127.0.0.1:57020 (local address 127.0.0.1:34043)
0927 21:40:23.310813 (+ 47us) server_negotiation.cc:206] Beginning negotiation
0927 21:40:23.310815 (+ 2us) server_negotiation.cc:399] Waiting for connection header
0927 21:40:23.310881 (+ 66us) negotiation.cc:327] Negotiation complete: Network error: Server connection negotiation failed: server connection from 127.0.0.1:57020: BlockingRecv error: recv got EOF from 127.0.0.1:57020 (error 108)
Metrics: {"server-negotiator.queue_time_us":16}
[ OK ] Parameters/TestRpcSocketTxRxQueue.AcceptorRxQueueSizeMetric/0 (12 ms)
[----------] 1 test from Parameters/TestRpcSocketTxRxQueue (12 ms total)
[----------] Global test environment tear-down
[==========] 21 tests from 2 test suites ran. (26565 ms total)
[ PASSED ] 20 tests.
[ FAILED ] 1 test, listed below:
[ FAILED ] Parameters/TestRpc.TestCallWithChainCertAndChainCA/SSL_UnixSocket, where GetParam() = (true, true)
1 FAILED TEST