Diagnosed failure

Parameters/TestRpc.TestCallWithChainCertAndChainCA/SSL_UnixSocket: /data0/somelongdirectorytoavoidrpathissues/src/kudu/src/kudu/rpc/rpc-test.cc:270: Failure
Failed
Bad status: Runtime error: could not verify certificate chain (error with cert: subject=CN = localhost, ST = sadfjas, C = AS, emailAddress = sdflkdsajf, O = lskdfjlsad, OU = sldfkja, issuer=C = AS, ST = ASDfkjdhf, L = lskdjf, O = saldfja, OU = skdjf, CN = localhost, emailAddress = sadjflkadsj): : certificate has expired
Google Test trace:
/data0/somelongdirectorytoavoidrpathissues/src/kudu/src/kudu/rpc/rpc-test.cc:267: Connecting to unix:/tmp/dist-test-task4TM3i9/test-tmp/rpc-test-dd8f87dd747d49fe8d67e261daf8b735.sock
I20260929 20:18:22.642529 22668 test_util.cc:175] -----------------------------------------------
I20260929 20:18:22.642652 22668 test_util.cc:176] Had fatal failures, leaving test files at /tmp/dist-test-task4TM3i9/test-tmp/rpc-test.6.Parameters_TestRpc.TestCallWithChainCertAndChainCA_SSL_UnixSocket.1790713102519753-22668-0

Full log

Note: This is test shard 7 of 8.
[==========] Running 21 tests from 2 test suites.
[----------] Global test environment set-up.
[----------] 20 tests from Parameters/TestRpc
[ RUN      ] Parameters/TestRpc.TestMessengerCreateDestroy/SSL_UnixSocket
WARNING: Logging before InitGoogleLogging() is written to STDERR
I20260929 20:18:22.565277 22668 rpc-test.cc:169] started messenger TestCreateDestroy
[       OK ] Parameters/TestRpc.TestMessengerCreateDestroy/SSL_UnixSocket (29 ms)
[ RUN      ] Parameters/TestRpc.TestNegotiationDeadlock/SSL_UnixSocket
I20260929 20:18:22.589262 22688 acceptor_pool.cc:254] collecting diagnostics on the listening RPC socket unix:/tmp/dist-test-task4TM3i9/test-tmp/rpc-test-d96cf6fe619b45aea98e69df21787b67.sock every 8 connection(s)
I20260929 20:18:22.589604 22689 acceptor_pool.cc:254] collecting diagnostics on the listening RPC socket unix:/tmp/dist-test-task4TM3i9/test-tmp/rpc-test-d96cf6fe619b45aea98e69df21787b67.sock every 8 connection(s)
[       OK ] Parameters/TestRpc.TestNegotiationDeadlock/SSL_UnixSocket (40 ms)
[ RUN      ] Parameters/TestRpc.TestCallWithChainCertAndChainCA/SSL_UnixSocket
I20260929 20:18:22.630532 22705 acceptor_pool.cc:254] collecting diagnostics on the listening RPC socket unix:/tmp/dist-test-task4TM3i9/test-tmp/rpc-test-dd8f87dd747d49fe8d67e261daf8b735.sock every 8 connection(s)
I20260929 20:18:22.630910 22706 acceptor_pool.cc:254] collecting diagnostics on the listening RPC socket unix:/tmp/dist-test-task4TM3i9/test-tmp/rpc-test-dd8f87dd747d49fe8d67e261daf8b735.sock every 8 connection(s)
/data0/somelongdirectorytoavoidrpathissues/src/kudu/src/kudu/rpc/rpc-test.cc:270: Failure
Failed
Bad status: Runtime error: could not verify certificate chain (error with cert: subject=CN = localhost, ST = sadfjas, C = AS, emailAddress = sdflkdsajf, O = lskdfjlsad, OU = sldfkja, issuer=C = AS, ST = ASDfkjdhf, L = lskdjf, O = saldfja, OU = skdjf, CN = localhost, emailAddress = sadjflkadsj): : certificate has expired
Google Test trace:
/data0/somelongdirectorytoavoidrpathissues/src/kudu/src/kudu/rpc/rpc-test.cc:267: Connecting to unix:/tmp/dist-test-task4TM3i9/test-tmp/rpc-test-dd8f87dd747d49fe8d67e261daf8b735.sock
I20260929 20:18:22.642529 22668 test_util.cc:175] -----------------------------------------------
I20260929 20:18:22.642652 22668 test_util.cc:176] Had fatal failures, leaving test files at /tmp/dist-test-task4TM3i9/test-tmp/rpc-test.6.Parameters_TestRpc.TestCallWithChainCertAndChainCA_SSL_UnixSocket.1790713102519753-22668-0
[  FAILED  ] Parameters/TestRpc.TestCallWithChainCertAndChainCA/SSL_UnixSocket, where GetParam() = (true, true) (33 ms)
[ RUN      ] Parameters/TestRpc.TestCallWithPasswordProtectedKey/SSL_UnixSocket
I20260929 20:18:22.663628 22730 acceptor_pool.cc:254] collecting diagnostics on the listening RPC socket unix:/tmp/dist-test-task4TM3i9/test-tmp/rpc-test-c8ec71dbcb5543978ba39a841fa61062.sock every 8 connection(s)
I20260929 20:18:22.663982 22731 acceptor_pool.cc:254] collecting diagnostics on the listening RPC socket unix:/tmp/dist-test-task4TM3i9/test-tmp/rpc-test-c8ec71dbcb5543978ba39a841fa61062.sock every 8 connection(s)
W20260929 20:18:22.696429 22727 connection.cc:196] Error closing socket: Network error: TlsSocket::Close: Broken pipe
[       OK ] Parameters/TestRpc.TestCallWithPasswordProtectedKey/SSL_UnixSocket (57 ms)
[ RUN      ] Parameters/TestRpc.TestCallToBadServer/SSL_UnixSocket
I20260929 20:18:22.717276 22668 rpc-test.cc:394] Status: Network error: Client connection negotiation failed: client connection to 0.0.0.0:0: connect: Connection refused (error 111)
I20260929 20:18:22.718010 22668 rpc-test.cc:394] Status: Network error: Client connection negotiation failed: client connection to 0.0.0.0:0: connect: Connection refused (error 111)
I20260929 20:18:22.718645 22668 rpc-test.cc:394] Status: Network error: Client connection negotiation failed: client connection to 0.0.0.0:0: connect: Connection refused (error 111)
I20260929 20:18:22.719205 22668 rpc-test.cc:394] Status: Network error: Client connection negotiation failed: client connection to 0.0.0.0:0: connect: Connection refused (error 111)
I20260929 20:18:22.719722 22668 rpc-test.cc:394] Status: Network error: Client connection negotiation failed: client connection to 0.0.0.0:0: connect: Connection refused (error 111)
[       OK ] Parameters/TestRpc.TestCallToBadServer/SSL_UnixSocket (21 ms)
[ RUN      ] Parameters/TestRpc.TestWrongService/SSL_UnixSocket
I20260929 20:18:22.746925 22765 acceptor_pool.cc:254] collecting diagnostics on the listening RPC socket unix:/tmp/dist-test-task4TM3i9/test-tmp/rpc-test-a1bc82fe10244b3d946b750237c21036.sock every 8 connection(s)
I20260929 20:18:22.747176 22766 acceptor_pool.cc:254] collecting diagnostics on the listening RPC socket unix:/tmp/dist-test-task4TM3i9/test-tmp/rpc-test-a1bc82fe10244b3d946b750237c21036.sock every 8 connection(s)
I20260929 20:18:22.766976 22762 messenger.cc:345] service WrongServiceName not registered on TestServer
W20260929 20:18:22.769232 22762 connection.cc:196] Error closing socket: Network error: TlsSocket::Close: Broken pipe
[       OK ] Parameters/TestRpc.TestWrongService/SSL_UnixSocket (51 ms)
[ RUN      ] Parameters/TestRpc.TestConnectionKeepalive/SSL_UnixSocket
I20260929 20:18:22.782637 22788 acceptor_pool.cc:254] collecting diagnostics on the listening RPC socket unix:/tmp/dist-test-task4TM3i9/test-tmp/rpc-test-6444fac9867a4b0396a800a75f0fee05.sock every 8 connection(s)
I20260929 20:18:22.782928 22790 acceptor_pool.cc:254] collecting diagnostics on the listening RPC socket unix:/tmp/dist-test-task4TM3i9/test-tmp/rpc-test-6444fac9867a4b0396a800a75f0fee05.sock every 8 connection(s)
I20260929 20:18:22.783869 22668 rpc-test.cc:488] Connecting to unix:/tmp/dist-test-task4TM3i9/test-tmp/rpc-test-6444fac9867a4b0396a800a75f0fee05.sock
W20260929 20:18:23.276191 22802 connection.cc:196] Error closing socket: Network error: TlsSocket::Close: Broken pipe
[       OK ] Parameters/TestRpc.TestConnectionKeepalive/SSL_UnixSocket (1046 ms)
[ RUN      ] Parameters/TestRpc.TestClientConnectionMetrics/SSL_UnixSocket
I20260929 20:18:23.827735 22814 acceptor_pool.cc:254] collecting diagnostics on the listening RPC socket unix:/tmp/dist-test-task4TM3i9/test-tmp/rpc-test-1de200b16b324d22ba811e487066fcda.sock every 8 connection(s)
I20260929 20:18:23.828052 22815 acceptor_pool.cc:254] collecting diagnostics on the listening RPC socket unix:/tmp/dist-test-task4TM3i9/test-tmp/rpc-test-1de200b16b324d22ba811e487066fcda.sock every 8 connection(s)
I20260929 20:18:23.829012 22668 rpc-test.cc:569] Connecting to unix:/tmp/dist-test-task4TM3i9/test-tmp/rpc-test-1de200b16b324d22ba811e487066fcda.sock
[       OK ] Parameters/TestRpc.TestClientConnectionMetrics/SSL_UnixSocket (21381 ms)
[ RUN      ] Parameters/TestRpc.TestCredentialsPolicy/SSL_UnixSocket
I20260929 20:18:45.221760 22837 acceptor_pool.cc:254] collecting diagnostics on the listening RPC socket unix:/tmp/dist-test-task4TM3i9/test-tmp/rpc-test-a6e19e002e094792a10645a6b73aec0f.sock every 8 connection(s)
I20260929 20:18:45.222102 22838 acceptor_pool.cc:254] collecting diagnostics on the listening RPC socket unix:/tmp/dist-test-task4TM3i9/test-tmp/rpc-test-a6e19e002e094792a10645a6b73aec0f.sock every 8 connection(s)
I20260929 20:18:45.223122 22668 rpc-test.cc:700] Connecting to unix:/tmp/dist-test-task4TM3i9/test-tmp/rpc-test-a6e19e002e094792a10645a6b73aec0f.sock
W20260929 20:18:45.250231 22836 connection.cc:196] Error closing socket: Network error: TlsSocket::Close: Broken pipe
[       OK ] Parameters/TestRpc.TestCredentialsPolicy/SSL_UnixSocket (60 ms)
[ RUN      ] Parameters/TestRpc.TestCallLongerThanKeepalive/SSL_UnixSocket
I20260929 20:18:45.277774 22862 acceptor_pool.cc:254] collecting diagnostics on the listening RPC socket unix:/tmp/dist-test-task4TM3i9/test-tmp/rpc-test-8538c13b24044ed480b9b3b1494aff4d.sock every 8 connection(s)
I20260929 20:18:45.277999 22863 acceptor_pool.cc:254] collecting diagnostics on the listening RPC socket unix:/tmp/dist-test-task4TM3i9/test-tmp/rpc-test-8538c13b24044ed480b9b3b1494aff4d.sock every 8 connection(s)
I20260929 20:18:45.309732 22866 rpc-test-base.h:222] got call: sleep_micros: 3000000 deferred: true
I20260929 20:18:48.311623 22866 rpcz_store.cc:275] Call kudu.rpc.GenericCalculatorService.Sleep from unix:<unnamed> (request call id 0) took 3002 ms. Trace:
I20260929 20:18:48.311776 22866 rpcz_store.cc:276] 0929 20:18:45.309616 (+     0us) service_pool.cc:170] Inserting onto call queue
0929 20:18:45.309685 (+    69us) service_pool.cc:227] Handling call
0929 20:18:48.311570 (+3001885us) inbound_call.cc:173] Queueing success response
Metrics: {}
[       OK ] Parameters/TestRpc.TestCallLongerThanKeepalive/SSL_UnixSocket (3056 ms)
[ RUN      ] Parameters/TestRpc.TestRpcSidecar/SSL_UnixSocket
I20260929 20:18:48.341408 22887 acceptor_pool.cc:254] collecting diagnostics on the listening RPC socket unix:/tmp/dist-test-task4TM3i9/test-tmp/rpc-test-ec10ef29f08949568c55bb2ec97ec8a5.sock every 8 connection(s)
I20260929 20:18:48.341662 22888 acceptor_pool.cc:254] collecting diagnostics on the listening RPC socket unix:/tmp/dist-test-task4TM3i9/test-tmp/rpc-test-ec10ef29f08949568c55bb2ec97ec8a5.sock every 8 connection(s)
W20260929 20:18:48.441701 22884 connection.cc:196] Error closing socket: Network error: TlsSocket::Close: Broken pipe
[       OK ] Parameters/TestRpc.TestRpcSidecar/SSL_UnixSocket (126 ms)
[ RUN      ] Parameters/TestRpc.TestRpcSidecarLimits/SSL_UnixSocket
I20260929 20:18:51.288534 22912 acceptor_pool.cc:254] collecting diagnostics on the listening RPC socket unix:/tmp/dist-test-task4TM3i9/test-tmp/rpc-test-e4eafbc5dd1a4bf7a54e0088b60a76cb.sock every 8 connection(s)
I20260929 20:18:51.288895 22913 acceptor_pool.cc:254] collecting diagnostics on the listening RPC socket unix:/tmp/dist-test-task4TM3i9/test-tmp/rpc-test-e4eafbc5dd1a4bf7a54e0088b60a76cb.sock every 8 connection(s)
W20260929 20:18:51.305706 22668 serialization.cc:72] Serialized kudu.rpc_test.PushStringsRequestPB (2147483654 bytes) is larger than the maximum configured RPC message size (52428800 bytes). Sending anyway, but peer may reject the data.
W20260929 20:18:51.311444 22909 connection.cc:535] server connection from unix:<unnamed> recv error: Network error: RPC frame had a length of 2147483714, but we only support messages up to 52428800 bytes long.
W20260929 20:18:51.311604 22909 connection.cc:158] shutting down server connection from unix:<unnamed> with pending inbound data: 4/2147483714 bytes received; last active 0 ns ago: status Network error: RPC frame had a length of 2147483714, but we only support messages up to 52428800 bytes long.
W20260929 20:18:51.312119 22925 connection.cc:196] Error closing socket: Network error: TlsSocket::Close: Broken pipe
I20260929 20:18:51.326086 22937 acceptor_pool.cc:254] collecting diagnostics on the listening RPC socket unix:/tmp/dist-test-task4TM3i9/test-tmp/rpc-test-e4eafbc5dd1a4bf7a54e0088b60a76cb.sock every 8 connection(s)
I20260929 20:18:51.326251 22938 acceptor_pool.cc:254] collecting diagnostics on the listening RPC socket unix:/tmp/dist-test-task4TM3i9/test-tmp/rpc-test-e4eafbc5dd1a4bf7a54e0088b60a76cb.sock every 8 connection(s)
W20260929 20:18:58.415633 22934 connection.cc:577] server connection from unix:<unnamed>: received bad data: 'Corruption: Invalid packet: message had a length of 2147483710, but we only support messages up to 2147483647 bytes
'
W20260929 20:18:58.416318 22950 connection.cc:196] Error closing socket: Network error: TlsSocket::Close: Broken pipe
[       OK ] Parameters/TestRpc.TestRpcSidecarLimits/SSL_UnixSocket (10462 ms)
[ RUN      ] Parameters/TestRpc.TestCallTimeoutDoesntAffectNegotiation/SSL_UnixSocket
I20260929 20:18:58.926438 22962 acceptor_pool.cc:254] collecting diagnostics on the listening RPC socket unix:/tmp/dist-test-task4TM3i9/test-tmp/rpc-test-1d2cb24290f14edc8e8ba13b01af6df3.sock every 8 connection(s)
I20260929 20:18:58.926774 22963 acceptor_pool.cc:254] collecting diagnostics on the listening RPC socket unix:/tmp/dist-test-task4TM3i9/test-tmp/rpc-test-1d2cb24290f14edc8e8ba13b01af6df3.sock every 8 connection(s)
W20260929 20:18:58.941741 22958 negotiation.cc:266] Injecting 500ms delay in negotiation
I20260929 20:18:58.992219 22668 rpc-test-base.h:595] status: Timed out: connection negotiation to unix:/tmp/dist-test-task4TM3i9/test-tmp/rpc-test-1d2cb24290f14edc8e8ba13b01af6df3.sock for RPC Sleep timed out after 0.050s (ON_OUTBOUND_QUEUE), seconds elapsed: 0.0511519
[       OK ] Parameters/TestRpc.TestCallTimeoutDoesntAffectNegotiation/SSL_UnixSocket (545 ms)
[ RUN      ] Parameters/TestRpc.TestRpcHandlerLatencyMetric/SSL_UnixSocket
I20260929 20:18:59.470372 22987 acceptor_pool.cc:254] collecting diagnostics on the listening RPC socket unix:/tmp/dist-test-task4TM3i9/test-tmp/rpc-test-199d78afa0a345c1bfc7dd271a5d40ce.sock every 8 connection(s)
I20260929 20:18:59.470661 22988 acceptor_pool.cc:254] collecting diagnostics on the listening RPC socket unix:/tmp/dist-test-task4TM3i9/test-tmp/rpc-test-199d78afa0a345c1bfc7dd271a5d40ce.sock every 8 connection(s)
I20260929 20:18:59.515473 22668 rpc-test.cc:1236] Sleep() min lat: 20635
I20260929 20:18:59.515580 22668 rpc-test.cc:1237] Sleep() mean lat: 20635
I20260929 20:18:59.515623 22668 rpc-test.cc:1238] Sleep() max lat: 20635
I20260929 20:18:59.515650 22668 rpc-test.cc:1239] Sleep() #calls: 1
W20260929 20:18:59.517156 22984 connection.cc:196] Error closing socket: Network error: TlsSocket::Close: Broken pipe
[       OK ] Parameters/TestRpc.TestRpcHandlerLatencyMetric/SSL_UnixSocket (67 ms)
[ RUN      ] Parameters/TestRpc.TimedOutOnResponseMetricServiceQueue/SSL_UnixSocket
I20260929 20:18:59.531234 23013 acceptor_pool.cc:254] collecting diagnostics on the listening RPC socket unix:/tmp/dist-test-task4TM3i9/test-tmp/rpc-test-818bfd95da1b4340b600dd26b11ccdef.sock every 8 connection(s)
I20260929 20:18:59.531461 23014 acceptor_pool.cc:254] collecting diagnostics on the listening RPC socket unix:/tmp/dist-test-task4TM3i9/test-tmp/rpc-test-818bfd95da1b4340b600dd26b11ccdef.sock every 8 connection(s)
W20260929 20:18:59.593906 23015 rpcz_store.cc:267] Call kudu.rpc_test.CalculatorService.Sleep from unix:<unnamed> (request call id 2) took 20 ms (client timeout 20 ms). Trace:
W20260929 20:18:59.594131 23015 rpcz_store.cc:269] 0929 20:18:59.573577 (+     0us) service_pool.cc:170] Inserting onto call queue
0929 20:18:59.593824 (+ 20247us) service_pool.cc:214] Skipping call since client already timed out
0929 20:18:59.593868 (+    44us) inbound_call.cc:173] Queueing failure response
Metrics: {}
W20260929 20:18:59.595603 23010 connection.cc:196] Error closing socket: Network error: TlsSocket::Close: Broken pipe
[       OK ] Parameters/TestRpc.TimedOutOnResponseMetricServiceQueue/SSL_UnixSocket (78 ms)
[ RUN      ] Parameters/TestRpc.RpcPendingConnectionsMetric/SSL_UnixSocket
I20260929 20:18:59.604105 23037 acceptor_pool.cc:254] collecting diagnostics on the listening RPC socket 0.0.0.0:41419 every 8 connection(s)
I20260929 20:18:59.604334 23038 acceptor_pool.cc:254] collecting diagnostics on the listening RPC socket 0.0.0.0:41419 every 8 connection(s)
W20260929 20:18:59.606770 23033 negotiation.cc:337] Failed RPC negotiation. Trace:
0929 20:18:59.606075 (+     0us) reactor.cc:625] Submitting negotiation task for server connection from 127.0.0.1:36676 (local address 127.0.0.1:41419)
0929 20:18:59.606238 (+   163us) server_negotiation.cc:206] Beginning negotiation
0929 20:18:59.606242 (+     4us) server_negotiation.cc:399] Waiting for connection header
0929 20:18:59.606374 (+   132us) negotiation.cc:327] Negotiation complete: Network error: Server connection negotiation failed: server connection from 127.0.0.1:36676: BlockingRecv error: recv got EOF from 127.0.0.1:36676 (error 108)
Metrics: {"server-negotiator.queue_time_us":37}
[       OK ] Parameters/TestRpc.RpcPendingConnectionsMetric/SSL_UnixSocket (20 ms)
[ RUN      ] Parameters/TestRpc.TestRpcContextClientDeadline/SSL_UnixSocket
I20260929 20:18:59.628863 23053 acceptor_pool.cc:254] collecting diagnostics on the listening RPC socket unix:/tmp/dist-test-task4TM3i9/test-tmp/rpc-test-40919f53186040a1839697f95a83f523.sock every 8 connection(s)
I20260929 20:18:59.629032 23054 acceptor_pool.cc:254] collecting diagnostics on the listening RPC socket unix:/tmp/dist-test-task4TM3i9/test-tmp/rpc-test-40919f53186040a1839697f95a83f523.sock every 8 connection(s)
W20260929 20:18:59.670799 23050 connection.cc:196] Error closing socket: Network error: TlsSocket::Close: Broken pipe
[       OK ] Parameters/TestRpc.TestRpcContextClientDeadline/SSL_UnixSocket (54 ms)
[ RUN      ] Parameters/TestRpc.TestApplicationFeatureFlagUnsupportedServer/SSL_UnixSocket
I20260929 20:18:59.688337 23078 acceptor_pool.cc:254] collecting diagnostics on the listening RPC socket unix:/tmp/dist-test-task4TM3i9/test-tmp/rpc-test-38d4d12031d642d4ac554789757865d2.sock every 8 connection(s)
I20260929 20:18:59.688586 23079 acceptor_pool.cc:254] collecting diagnostics on the listening RPC socket unix:/tmp/dist-test-task4TM3i9/test-tmp/rpc-test-38d4d12031d642d4ac554789757865d2.sock every 8 connection(s)
[       OK ] Parameters/TestRpc.TestApplicationFeatureFlagUnsupportedServer/SSL_UnixSocket (53 ms)
[ RUN      ] Parameters/TestRpc.TestCancellationAsync/SSL_UnixSocket
I20260929 20:18:59.756124 23103 acceptor_pool.cc:254] collecting diagnostics on the listening RPC socket unix:/tmp/dist-test-task4TM3i9/test-tmp/rpc-test-c2fa9a9825ec4b40a0b63cd193d2d50b.sock every 8 connection(s)
I20260929 20:18:59.756371 23104 acceptor_pool.cc:254] collecting diagnostics on the listening RPC socket unix:/tmp/dist-test-task4TM3i9/test-tmp/rpc-test-c2fa9a9825ec4b40a0b63cd193d2d50b.sock every 8 connection(s)
I20260929 20:18:59.757282 22668 rpc-test.cc:1716] Connecting to unix:/tmp/dist-test-task4TM3i9/test-tmp/rpc-test-c2fa9a9825ec4b40a0b63cd193d2d50b.sock
I20260929 20:18:59.766655 22668 test_util.cc:268] Using random seed: -459856532
I20260929 20:18:59.813328 23107 rpc-test-base.h:240] got call: sleep_micros: 500 pattern: 4294967295 num_repetitions: 2097152 sidecar_idx: 0
I20260929 20:18:59.846990 23107 rpc-test-base.h:240] got call: sleep_micros: 500 pattern: 4294967295 num_repetitions: 2097152 sidecar_idx: 0
I20260929 20:18:59.880398 23107 rpc-test-base.h:240] got call: sleep_micros: 500 pattern: 4294967295 num_repetitions: 2097152 sidecar_idx: 0
I20260929 20:18:59.914960 23107 rpc-test-base.h:240] got call: sleep_micros: 500 pattern: 4294967295 num_repetitions: 2097152 sidecar_idx: 0
I20260929 20:18:59.948623 23107 rpc-test-base.h:240] got call: sleep_micros: 500 pattern: 4294967295 num_repetitions: 2097152 sidecar_idx: 0
I20260929 20:18:59.981503 23107 rpc-test-base.h:240] got call: sleep_micros: 500 pattern: 4294967295 num_repetitions: 2097152 sidecar_idx: 0
I20260929 20:19:00.014992 23107 rpc-test-base.h:240] got call: sleep_micros: 500 pattern: 4294967295 num_repetitions: 2097152 sidecar_idx: 0
W20260929 20:19:00.017283 23100 connection.cc:196] Error closing socket: Network error: TlsSocket::Close: Broken pipe
W20260929 20:19:00.047327 23100 connection.cc:441] server connection from unix:<unnamed> torn down before Call kudu.rpc.GenericCalculatorService.SleepWithSidecar from unix:<unnamed> (request call id 9) could send its response
[       OK ] Parameters/TestRpc.TestCancellationAsync/SSL_UnixSocket (323 ms)
[ RUN      ] Parameters/TestRpc.TestPerformanceBySocketType/SSL_UnixSocket
I20260929 20:19:00.069164 23128 acceptor_pool.cc:254] collecting diagnostics on the listening RPC socket unix:/tmp/dist-test-task4TM3i9/test-tmp/rpc-test-45b962eb29f9484290fe301c8f5167f6.sock every 8 connection(s)
I20260929 20:19:00.069428 23129 acceptor_pool.cc:254] collecting diagnostics on the listening RPC socket unix:/tmp/dist-test-task4TM3i9/test-tmp/rpc-test-45b962eb29f9484290fe301c8f5167f6.sock every 8 connection(s)
I20260929 20:19:00.070282 22668 rpc-test.cc:1846] Connecting to unix:/tmp/dist-test-task4TM3i9/test-tmp/rpc-test-45b962eb29f9484290fe301c8f5167f6.sock
I20260929 20:19:03.361353 22668 rpc-test.cc:1859] Sending 1024MB via ssl-enabled unix socket: real 3.274s	user 3.173s	sys 2.340s
I20260929 20:19:06.601455 22668 rpc-test.cc:1859] Sending 1024MB via ssl-enabled unix socket: real 3.240s	user 3.066s	sys 2.388s
I20260929 20:19:09.982281 22668 rpc-test.cc:1859] Sending 1024MB via ssl-enabled unix socket: real 3.381s	user 3.397s	sys 2.311s
I20260929 20:19:13.254987 22668 rpc-test.cc:1859] Sending 1024MB via ssl-enabled unix socket: real 3.273s	user 3.242s	sys 2.278s
I20260929 20:19:16.408129 22668 rpc-test.cc:1859] Sending 1024MB via ssl-enabled unix socket: real 3.153s	user 3.040s	sys 2.266s
W20260929 20:19:16.409917 23125 connection.cc:196] Error closing socket: Network error: TlsSocket::Close: Broken pipe
[       OK ] Parameters/TestRpc.TestPerformanceBySocketType/SSL_UnixSocket (16365 ms)
[----------] 20 tests from Parameters/TestRpc (53876 ms total)

[----------] 1 test from Parameters/TestRpcSocketTxRxQueue
[ RUN      ] Parameters/TestRpcSocketTxRxQueue.AcceptorRxQueueSizeMetric/0
I20260929 20:19:16.420899 23153 acceptor_pool.cc:254] collecting diagnostics on the listening RPC socket 0.0.0.0:38817 every 1 connection(s)
I20260929 20:19:16.421145 23154 acceptor_pool.cc:254] collecting diagnostics on the listening RPC socket 0.0.0.0:38817 every 1 connection(s)
W20260929 20:19:16.422849 23149 negotiation.cc:337] Failed RPC negotiation. Trace:
0929 20:19:16.422376 (+     0us) reactor.cc:625] Submitting negotiation task for server connection from 127.0.0.1:36690 (local address 127.0.0.1:38817)
0929 20:19:16.422543 (+   167us) server_negotiation.cc:206] Beginning negotiation
0929 20:19:16.422547 (+     4us) server_negotiation.cc:399] Waiting for connection header
0929 20:19:16.422666 (+   119us) negotiation.cc:327] Negotiation complete: Network error: Server connection negotiation failed: server connection from 127.0.0.1:36690: BlockingRecv error: recv got EOF from 127.0.0.1:36690 (error 108)
Metrics: {"server-negotiator.queue_time_us":62}
[       OK ] Parameters/TestRpcSocketTxRxQueue.AcceptorRxQueueSizeMetric/0 (10 ms)
[----------] 1 test from Parameters/TestRpcSocketTxRxQueue (10 ms total)

[----------] Global test environment tear-down
[==========] 21 tests from 2 test suites ran. (53887 ms total)
[  PASSED  ] 20 tests.
[  FAILED  ] 1 test, listed below:
[  FAILED  ] Parameters/TestRpc.TestCallWithChainCertAndChainCA/SSL_UnixSocket, where GetParam() = (true, true)

 1 FAILED TEST