Diagnosed failure

Parameters/TestRpc.TestCallWithChainCertAndChainCA/SSL_UnixSocket: /data0/somelongdirectorytoavoidrpathissues/src/kudu/src/kudu/rpc/rpc-test.cc:270: Failure
Failed
Bad status: Runtime error: could not verify certificate chain (error with cert: subject=CN = localhost, ST = sadfjas, C = AS, emailAddress = sdflkdsajf, O = lskdfjlsad, OU = sldfkja, issuer=C = AS, ST = ASDfkjdhf, L = lskdjf, O = saldfja, OU = skdjf, CN = localhost, emailAddress = sadjflkadsj): : certificate has expired
Google Test trace:
/data0/somelongdirectorytoavoidrpathissues/src/kudu/src/kudu/rpc/rpc-test.cc:267: Connecting to unix:/tmp/dist-test-taskR6cHOc/test-tmp/rpc-test-03caa24425bc46f591329a7f2b827a9f.sock
I20260925 22:39:14.326107   383 test_util.cc:175] -----------------------------------------------
I20260925 22:39:14.326172   383 test_util.cc:176] Had fatal failures, leaving test files at /tmp/dist-test-taskR6cHOc/test-tmp/rpc-test.6.Parameters_TestRpc.TestCallWithChainCertAndChainCA_SSL_UnixSocket.1790375954227057-383-0

Full log

Note: This is test shard 7 of 8.
[==========] Running 21 tests from 2 test suites.
[----------] Global test environment set-up.
[----------] 20 tests from Parameters/TestRpc
[ RUN      ] Parameters/TestRpc.TestMessengerCreateDestroy/SSL_UnixSocket
WARNING: Logging before InitGoogleLogging() is written to STDERR
I20260925 22:39:14.269121   383 rpc-test.cc:169] started messenger TestCreateDestroy
[       OK ] Parameters/TestRpc.TestMessengerCreateDestroy/SSL_UnixSocket (35 ms)
[ RUN      ] Parameters/TestRpc.TestNegotiationDeadlock/SSL_UnixSocket
I20260925 22:39:14.284363   403 acceptor_pool.cc:254] collecting diagnostics on the listening RPC socket unix:/tmp/dist-test-taskR6cHOc/test-tmp/rpc-test-99109cc46c6040048f57388b183e7133.sock every 8 connection(s)
I20260925 22:39:14.284458   404 acceptor_pool.cc:254] collecting diagnostics on the listening RPC socket unix:/tmp/dist-test-taskR6cHOc/test-tmp/rpc-test-99109cc46c6040048f57388b183e7133.sock every 8 connection(s)
[       OK ] Parameters/TestRpc.TestNegotiationDeadlock/SSL_UnixSocket (29 ms)
[ RUN      ] Parameters/TestRpc.TestCallWithChainCertAndChainCA/SSL_UnixSocket
I20260925 22:39:14.320613   420 acceptor_pool.cc:254] collecting diagnostics on the listening RPC socket unix:/tmp/dist-test-taskR6cHOc/test-tmp/rpc-test-03caa24425bc46f591329a7f2b827a9f.sock every 8 connection(s)
I20260925 22:39:14.320626   419 acceptor_pool.cc:254] collecting diagnostics on the listening RPC socket unix:/tmp/dist-test-taskR6cHOc/test-tmp/rpc-test-03caa24425bc46f591329a7f2b827a9f.sock every 8 connection(s)
/data0/somelongdirectorytoavoidrpathissues/src/kudu/src/kudu/rpc/rpc-test.cc:270: Failure
Failed
Bad status: Runtime error: could not verify certificate chain (error with cert: subject=CN = localhost, ST = sadfjas, C = AS, emailAddress = sdflkdsajf, O = lskdfjlsad, OU = sldfkja, issuer=C = AS, ST = ASDfkjdhf, L = lskdjf, O = saldfja, OU = skdjf, CN = localhost, emailAddress = sadjflkadsj): : certificate has expired
Google Test trace:
/data0/somelongdirectorytoavoidrpathissues/src/kudu/src/kudu/rpc/rpc-test.cc:267: Connecting to unix:/tmp/dist-test-taskR6cHOc/test-tmp/rpc-test-03caa24425bc46f591329a7f2b827a9f.sock
I20260925 22:39:14.326107   383 test_util.cc:175] -----------------------------------------------
I20260925 22:39:14.326172   383 test_util.cc:176] Had fatal failures, leaving test files at /tmp/dist-test-taskR6cHOc/test-tmp/rpc-test.6.Parameters_TestRpc.TestCallWithChainCertAndChainCA_SSL_UnixSocket.1790375954227057-383-0
[  FAILED  ] Parameters/TestRpc.TestCallWithChainCertAndChainCA/SSL_UnixSocket, where GetParam() = (true, true) (25 ms)
[ RUN      ] Parameters/TestRpc.TestCallWithPasswordProtectedKey/SSL_UnixSocket
I20260925 22:39:14.343631   444 acceptor_pool.cc:254] collecting diagnostics on the listening RPC socket unix:/tmp/dist-test-taskR6cHOc/test-tmp/rpc-test-10a3b50e21114a61b79171fe0d25bee1.sock every 8 connection(s)
I20260925 22:39:14.343652   445 acceptor_pool.cc:254] collecting diagnostics on the listening RPC socket unix:/tmp/dist-test-taskR6cHOc/test-tmp/rpc-test-10a3b50e21114a61b79171fe0d25bee1.sock every 8 connection(s)
W20260925 22:39:14.357649   441 connection.cc:196] Error closing socket: Network error: TlsSocket::Close: Broken pipe
[       OK ] Parameters/TestRpc.TestCallWithPasswordProtectedKey/SSL_UnixSocket (33 ms)
[ RUN      ] Parameters/TestRpc.TestCallToBadServer/SSL_UnixSocket
I20260925 22:39:14.371402   383 rpc-test.cc:394] Status: Network error: Client connection negotiation failed: client connection to 0.0.0.0:0: connect: Connection refused (error 111)
I20260925 22:39:14.371963   383 rpc-test.cc:394] Status: Network error: Client connection negotiation failed: client connection to 0.0.0.0:0: connect: Connection refused (error 111)
I20260925 22:39:14.372437   383 rpc-test.cc:394] Status: Network error: Client connection negotiation failed: client connection to 0.0.0.0:0: connect: Connection refused (error 111)
I20260925 22:39:14.372910   383 rpc-test.cc:394] Status: Network error: Client connection negotiation failed: client connection to 0.0.0.0:0: connect: Connection refused (error 111)
I20260925 22:39:14.373363   383 rpc-test.cc:394] Status: Network error: Client connection negotiation failed: client connection to 0.0.0.0:0: connect: Connection refused (error 111)
[       OK ] Parameters/TestRpc.TestCallToBadServer/SSL_UnixSocket (14 ms)
[ RUN      ] Parameters/TestRpc.TestWrongService/SSL_UnixSocket
I20260925 22:39:14.383893   479 acceptor_pool.cc:254] collecting diagnostics on the listening RPC socket unix:/tmp/dist-test-taskR6cHOc/test-tmp/rpc-test-941a2e72643940bfa110af9b9c4e2c7d.sock every 8 connection(s)
I20260925 22:39:14.383980   480 acceptor_pool.cc:254] collecting diagnostics on the listening RPC socket unix:/tmp/dist-test-taskR6cHOc/test-tmp/rpc-test-941a2e72643940bfa110af9b9c4e2c7d.sock every 8 connection(s)
I20260925 22:39:14.399514   476 messenger.cc:345] service WrongServiceName not registered on TestServer
W20260925 22:39:14.400370   476 connection.cc:196] Error closing socket: Network error: TlsSocket::Close: Broken pipe
[       OK ] Parameters/TestRpc.TestWrongService/SSL_UnixSocket (27 ms)
[ RUN      ] Parameters/TestRpc.TestConnectionKeepalive/SSL_UnixSocket
I20260925 22:39:14.428025   502 acceptor_pool.cc:254] collecting diagnostics on the listening RPC socket unix:/tmp/dist-test-taskR6cHOc/test-tmp/rpc-test-bd72037d562841a9893f59c4bf606727.sock every 8 connection(s)
I20260925 22:39:14.428066   503 acceptor_pool.cc:254] collecting diagnostics on the listening RPC socket unix:/tmp/dist-test-taskR6cHOc/test-tmp/rpc-test-bd72037d562841a9893f59c4bf606727.sock every 8 connection(s)
I20260925 22:39:14.428349   383 rpc-test.cc:488] Connecting to unix:/tmp/dist-test-taskR6cHOc/test-tmp/rpc-test-bd72037d562841a9893f59c4bf606727.sock
W20260925 22:39:14.904112   515 connection.cc:196] Error closing socket: Network error: TlsSocket::Close: Broken pipe
[       OK ] Parameters/TestRpc.TestConnectionKeepalive/SSL_UnixSocket (1049 ms)
[ RUN      ] Parameters/TestRpc.TestClientConnectionMetrics/SSL_UnixSocket
I20260925 22:39:15.484652   527 acceptor_pool.cc:254] collecting diagnostics on the listening RPC socket unix:/tmp/dist-test-taskR6cHOc/test-tmp/rpc-test-7616354aa66f4fabb966bdf183bd4c28.sock every 8 connection(s)
I20260925 22:39:15.484683   528 acceptor_pool.cc:254] collecting diagnostics on the listening RPC socket unix:/tmp/dist-test-taskR6cHOc/test-tmp/rpc-test-7616354aa66f4fabb966bdf183bd4c28.sock every 8 connection(s)
I20260925 22:39:15.485226   383 rpc-test.cc:569] Connecting to unix:/tmp/dist-test-taskR6cHOc/test-tmp/rpc-test-7616354aa66f4fabb966bdf183bd4c28.sock
[       OK ] Parameters/TestRpc.TestClientConnectionMetrics/SSL_UnixSocket (11014 ms)
[ RUN      ] Parameters/TestRpc.TestCredentialsPolicy/SSL_UnixSocket
I20260925 22:39:26.474251   550 acceptor_pool.cc:254] collecting diagnostics on the listening RPC socket unix:/tmp/dist-test-taskR6cHOc/test-tmp/rpc-test-92af2c5a0315406e9b02622dceeb6a27.sock every 8 connection(s)
I20260925 22:39:26.474398   551 acceptor_pool.cc:254] collecting diagnostics on the listening RPC socket unix:/tmp/dist-test-taskR6cHOc/test-tmp/rpc-test-92af2c5a0315406e9b02622dceeb6a27.sock every 8 connection(s)
I20260925 22:39:26.474840   383 rpc-test.cc:700] Connecting to unix:/tmp/dist-test-taskR6cHOc/test-tmp/rpc-test-92af2c5a0315406e9b02622dceeb6a27.sock
W20260925 22:39:26.492724   549 connection.cc:196] Error closing socket: Network error: TlsSocket::Close: Broken pipe
W20260925 22:39:26.497911   549 connection.cc:196] Error closing socket: Network error: TlsSocket::Close: Broken pipe
[       OK ] Parameters/TestRpc.TestCredentialsPolicy/SSL_UnixSocket (33 ms)
[ RUN      ] Parameters/TestRpc.TestCallLongerThanKeepalive/SSL_UnixSocket
I20260925 22:39:26.518038   575 acceptor_pool.cc:254] collecting diagnostics on the listening RPC socket unix:/tmp/dist-test-taskR6cHOc/test-tmp/rpc-test-bde0ea552fce476b998e0a6165a1b08f.sock every 8 connection(s)
I20260925 22:39:26.518111   576 acceptor_pool.cc:254] collecting diagnostics on the listening RPC socket unix:/tmp/dist-test-taskR6cHOc/test-tmp/rpc-test-bde0ea552fce476b998e0a6165a1b08f.sock every 8 connection(s)
I20260925 22:39:26.532450   579 rpc-test-base.h:222] got call: sleep_micros: 3000000 deferred: true
I20260925 22:39:29.533684   579 rpcz_store.cc:275] Call kudu.rpc.GenericCalculatorService.Sleep from unix:<unnamed> (request call id 0) took 3001 ms. Trace:
I20260925 22:39:29.533843   579 rpcz_store.cc:276] 0925 22:39:26.532374 (+     0us) service_pool.cc:170] Inserting onto call queue
0925 22:39:26.532420 (+    46us) service_pool.cc:227] Handling call
0925 22:39:29.533660 (+3001240us) inbound_call.cc:173] Queueing success response
Metrics: {}
[       OK ] Parameters/TestRpc.TestCallLongerThanKeepalive/SSL_UnixSocket (3038 ms)
[ RUN      ] Parameters/TestRpc.TestRpcSidecar/SSL_UnixSocket
I20260925 22:39:29.568161   600 acceptor_pool.cc:254] collecting diagnostics on the listening RPC socket unix:/tmp/dist-test-taskR6cHOc/test-tmp/rpc-test-ad0794b405864a0bbfd14646a9815e43.sock every 8 connection(s)
I20260925 22:39:29.568188   601 acceptor_pool.cc:254] collecting diagnostics on the listening RPC socket unix:/tmp/dist-test-taskR6cHOc/test-tmp/rpc-test-ad0794b405864a0bbfd14646a9815e43.sock every 8 connection(s)
W20260925 22:39:29.632473   597 connection.cc:196] Error closing socket: Network error: TlsSocket::Close: Broken pipe
[       OK ] Parameters/TestRpc.TestRpcSidecar/SSL_UnixSocket (96 ms)
[ RUN      ] Parameters/TestRpc.TestRpcSidecarLimits/SSL_UnixSocket
I20260925 22:39:37.045152   625 acceptor_pool.cc:254] collecting diagnostics on the listening RPC socket unix:/tmp/dist-test-taskR6cHOc/test-tmp/rpc-test-e18867d916c6424f82ce01d54cefe6ae.sock every 8 connection(s)
I20260925 22:39:37.045164   626 acceptor_pool.cc:254] collecting diagnostics on the listening RPC socket unix:/tmp/dist-test-taskR6cHOc/test-tmp/rpc-test-e18867d916c6424f82ce01d54cefe6ae.sock every 8 connection(s)
W20260925 22:39:37.058358   383 serialization.cc:72] Serialized kudu.rpc_test.PushStringsRequestPB (2147483654 bytes) is larger than the maximum configured RPC message size (52428800 bytes). Sending anyway, but peer may reject the data.
W20260925 22:39:37.062515   622 connection.cc:535] server connection from unix:<unnamed> recv error: Network error: RPC frame had a length of 2147483714, but we only support messages up to 52428800 bytes long.
W20260925 22:39:37.062635   622 connection.cc:158] shutting down server connection from unix:<unnamed> with pending inbound data: 4/2147483714 bytes received; last active 0 ns ago: status Network error: RPC frame had a length of 2147483714, but we only support messages up to 52428800 bytes long.
W20260925 22:39:37.062994   638 connection.cc:196] Error closing socket: Network error: TlsSocket::Close: Broken pipe
I20260925 22:39:37.087589   650 acceptor_pool.cc:254] collecting diagnostics on the listening RPC socket unix:/tmp/dist-test-taskR6cHOc/test-tmp/rpc-test-e18867d916c6424f82ce01d54cefe6ae.sock every 8 connection(s)
I20260925 22:39:37.087597   651 acceptor_pool.cc:254] collecting diagnostics on the listening RPC socket unix:/tmp/dist-test-taskR6cHOc/test-tmp/rpc-test-e18867d916c6424f82ce01d54cefe6ae.sock every 8 connection(s)
W20260925 22:39:49.436283   647 connection.cc:577] server connection from unix:<unnamed>: received bad data: 'Corruption: Invalid packet: message had a length of 2147483710, but we only support messages up to 2147483647 bytes
'
W20260925 22:39:49.436774   663 connection.cc:196] Error closing socket: Network error: TlsSocket::Close: Broken pipe
[       OK ] Parameters/TestRpc.TestRpcSidecarLimits/SSL_UnixSocket (19805 ms)
[ RUN      ] Parameters/TestRpc.TestCallTimeoutDoesntAffectNegotiation/SSL_UnixSocket
I20260925 22:39:49.447990   675 acceptor_pool.cc:254] collecting diagnostics on the listening RPC socket unix:/tmp/dist-test-taskR6cHOc/test-tmp/rpc-test-72223e11d35a4ca0aff3682e737f0a99.sock every 8 connection(s)
I20260925 22:39:49.448084   676 acceptor_pool.cc:254] collecting diagnostics on the listening RPC socket unix:/tmp/dist-test-taskR6cHOc/test-tmp/rpc-test-72223e11d35a4ca0aff3682e737f0a99.sock every 8 connection(s)
W20260925 22:39:49.462059   671 negotiation.cc:266] Injecting 500ms delay in negotiation
I20260925 22:39:49.512424   383 rpc-test-base.h:595] status: Timed out: connection negotiation to unix:/tmp/dist-test-taskR6cHOc/test-tmp/rpc-test-72223e11d35a4ca0aff3682e737f0a99.sock for RPC Sleep timed out after 0.050s (ON_OUTBOUND_QUEUE), seconds elapsed: 0.0509546
W20260925 22:39:49.967500   672 connection.cc:196] Error closing socket: Network error: TlsSocket::Close: Broken pipe
[       OK ] Parameters/TestRpc.TestCallTimeoutDoesntAffectNegotiation/SSL_UnixSocket (529 ms)
[ RUN      ] Parameters/TestRpc.TestRpcHandlerLatencyMetric/SSL_UnixSocket
I20260925 22:39:49.980134   700 acceptor_pool.cc:254] collecting diagnostics on the listening RPC socket unix:/tmp/dist-test-taskR6cHOc/test-tmp/rpc-test-a7fb228fe53b40228908c8da908885f6.sock every 8 connection(s)
I20260925 22:39:49.980320   701 acceptor_pool.cc:254] collecting diagnostics on the listening RPC socket unix:/tmp/dist-test-taskR6cHOc/test-tmp/rpc-test-a7fb228fe53b40228908c8da908885f6.sock every 8 connection(s)
I20260925 22:39:50.025496   383 rpc-test.cc:1236] Sleep() min lat: 20675
I20260925 22:39:50.025589   383 rpc-test.cc:1237] Sleep() mean lat: 20675
I20260925 22:39:50.025631   383 rpc-test.cc:1238] Sleep() max lat: 20675
I20260925 22:39:50.025645   383 rpc-test.cc:1239] Sleep() #calls: 1
[       OK ] Parameters/TestRpc.TestRpcHandlerLatencyMetric/SSL_UnixSocket (58 ms)
[ RUN      ] Parameters/TestRpc.TimedOutOnResponseMetricServiceQueue/SSL_UnixSocket
I20260925 22:39:50.064430   726 acceptor_pool.cc:254] collecting diagnostics on the listening RPC socket unix:/tmp/dist-test-taskR6cHOc/test-tmp/rpc-test-25a46d8abeb74a90a127bbbce19d2a36.sock every 8 connection(s)
I20260925 22:39:50.064495   727 acceptor_pool.cc:254] collecting diagnostics on the listening RPC socket unix:/tmp/dist-test-taskR6cHOc/test-tmp/rpc-test-25a46d8abeb74a90a127bbbce19d2a36.sock every 8 connection(s)
W20260925 22:39:50.115278   728 rpcz_store.cc:267] Call kudu.rpc_test.CalculatorService.Sleep from unix:<unnamed> (request call id 2) took 20 ms (client timeout 20 ms). Trace:
W20260925 22:39:50.115371   728 rpcz_store.cc:269] 0925 22:39:50.094849 (+     0us) service_pool.cc:170] Inserting onto call queue
0925 22:39:50.115224 (+ 20375us) service_pool.cc:214] Skipping call since client already timed out
0925 22:39:50.115259 (+    35us) inbound_call.cc:173] Queueing failure response
Metrics: {}
W20260925 22:39:50.116236   723 connection.cc:196] Error closing socket: Network error: TlsSocket::Close: Broken pipe
[       OK ] Parameters/TestRpc.TimedOutOnResponseMetricServiceQueue/SSL_UnixSocket (89 ms)
[ RUN      ] Parameters/TestRpc.RpcPendingConnectionsMetric/SSL_UnixSocket
I20260925 22:39:50.119802   749 acceptor_pool.cc:254] collecting diagnostics on the listening RPC socket 0.0.0.0:40443 every 8 connection(s)
I20260925 22:39:50.119850   750 acceptor_pool.cc:254] collecting diagnostics on the listening RPC socket 0.0.0.0:40443 every 8 connection(s)
W20260925 22:39:50.141230   745 negotiation.cc:337] Failed RPC negotiation. Trace:
0925 22:39:50.140518 (+     0us) reactor.cc:625] Submitting negotiation task for server connection from 127.0.0.1:44884 (local address 127.0.0.1:40443)
0925 22:39:50.140679 (+   161us) server_negotiation.cc:206] Beginning negotiation
0925 22:39:50.140683 (+     4us) server_negotiation.cc:399] Waiting for connection header
0925 22:39:50.140865 (+   182us) negotiation.cc:327] Negotiation complete: Network error: Server connection negotiation failed: server connection from 127.0.0.1:44884: BlockingRecv error: recv got EOF from 127.0.0.1:44884 (error 108)
Metrics: {"server-negotiator.queue_time_us":70}
[       OK ] Parameters/TestRpc.RpcPendingConnectionsMetric/SSL_UnixSocket (34 ms)
[ RUN      ] Parameters/TestRpc.TestRpcContextClientDeadline/SSL_UnixSocket
I20260925 22:39:50.187012   765 acceptor_pool.cc:254] collecting diagnostics on the listening RPC socket unix:/tmp/dist-test-taskR6cHOc/test-tmp/rpc-test-ceb7bf86afa44d7fb8273e7c57ed2f1b.sock every 8 connection(s)
I20260925 22:39:50.187052   766 acceptor_pool.cc:254] collecting diagnostics on the listening RPC socket unix:/tmp/dist-test-taskR6cHOc/test-tmp/rpc-test-ceb7bf86afa44d7fb8273e7c57ed2f1b.sock every 8 connection(s)
W20260925 22:39:50.220413   762 connection.cc:196] Error closing socket: Network error: TlsSocket::Close: Broken pipe
[       OK ] Parameters/TestRpc.TestRpcContextClientDeadline/SSL_UnixSocket (70 ms)
[ RUN      ] Parameters/TestRpc.TestApplicationFeatureFlagUnsupportedServer/SSL_UnixSocket
I20260925 22:39:50.233469   791 acceptor_pool.cc:254] collecting diagnostics on the listening RPC socket unix:/tmp/dist-test-taskR6cHOc/test-tmp/rpc-test-67e559209e144831996754571f6efa7b.sock every 8 connection(s)
I20260925 22:39:50.233461   790 acceptor_pool.cc:254] collecting diagnostics on the listening RPC socket unix:/tmp/dist-test-taskR6cHOc/test-tmp/rpc-test-67e559209e144831996754571f6efa7b.sock every 8 connection(s)
[       OK ] Parameters/TestRpc.TestApplicationFeatureFlagUnsupportedServer/SSL_UnixSocket (35 ms)
[ RUN      ] Parameters/TestRpc.TestCancellationAsync/SSL_UnixSocket
I20260925 22:39:50.274217   815 acceptor_pool.cc:254] collecting diagnostics on the listening RPC socket unix:/tmp/dist-test-taskR6cHOc/test-tmp/rpc-test-756e0a9f2d8b413f8a84d58beb8149fc.sock every 8 connection(s)
I20260925 22:39:50.274307   816 acceptor_pool.cc:254] collecting diagnostics on the listening RPC socket unix:/tmp/dist-test-taskR6cHOc/test-tmp/rpc-test-756e0a9f2d8b413f8a84d58beb8149fc.sock every 8 connection(s)
I20260925 22:39:50.274855   383 rpc-test.cc:1716] Connecting to unix:/tmp/dist-test-taskR6cHOc/test-tmp/rpc-test-756e0a9f2d8b413f8a84d58beb8149fc.sock
I20260925 22:39:50.284590   383 test_util.cc:268] Using random seed: 1693077803
I20260925 22:39:50.306803   819 rpc-test-base.h:240] got call: sleep_micros: 500 pattern: 4294967295 num_repetitions: 2097152 sidecar_idx: 0
I20260925 22:39:50.323408   818 rpc-test-base.h:240] got call: sleep_micros: 500 pattern: 4294967295 num_repetitions: 2097152 sidecar_idx: 0
I20260925 22:39:50.340320   819 rpc-test-base.h:240] got call: sleep_micros: 500 pattern: 4294967295 num_repetitions: 2097152 sidecar_idx: 0
I20260925 22:39:50.360097   818 rpc-test-base.h:240] got call: sleep_micros: 500 pattern: 4294967295 num_repetitions: 2097152 sidecar_idx: 0
I20260925 22:39:50.380643   819 rpc-test-base.h:240] got call: sleep_micros: 500 pattern: 4294967295 num_repetitions: 2097152 sidecar_idx: 0
I20260925 22:39:50.399686   818 rpc-test-base.h:240] got call: sleep_micros: 500 pattern: 4294967295 num_repetitions: 2097152 sidecar_idx: 0
I20260925 22:39:50.418506   819 rpc-test-base.h:240] got call: sleep_micros: 500 pattern: 4294967295 num_repetitions: 2097152 sidecar_idx: 0
I20260925 22:39:50.436856   818 rpc-test-base.h:240] got call: sleep_micros: 500 pattern: 4294967295 num_repetitions: 2097152 sidecar_idx: 0
W20260925 22:39:50.439379   812 connection.cc:196] Error closing socket: Network error: TlsSocket::Close: Broken pipe
W20260925 22:39:50.442687   812 connection.cc:441] server connection from unix:<unnamed> torn down before Call kudu.rpc.GenericCalculatorService.SleepWithSidecar from unix:<unnamed> (request call id 8) could send its response
W20260925 22:39:50.455763   812 connection.cc:441] server connection from unix:<unnamed> torn down before Call kudu.rpc.GenericCalculatorService.SleepWithSidecar from unix:<unnamed> (request call id 9) could send its response
[       OK ] Parameters/TestRpc.TestCancellationAsync/SSL_UnixSocket (199 ms)
[ RUN      ] Parameters/TestRpc.TestPerformanceBySocketType/SSL_UnixSocket
I20260925 22:39:50.467396   840 acceptor_pool.cc:254] collecting diagnostics on the listening RPC socket unix:/tmp/dist-test-taskR6cHOc/test-tmp/rpc-test-960f7fd584cd42b698a0c54ad2edd446.sock every 8 connection(s)
I20260925 22:39:50.467450   841 acceptor_pool.cc:254] collecting diagnostics on the listening RPC socket unix:/tmp/dist-test-taskR6cHOc/test-tmp/rpc-test-960f7fd584cd42b698a0c54ad2edd446.sock every 8 connection(s)
I20260925 22:39:50.467722   383 rpc-test.cc:1846] Connecting to unix:/tmp/dist-test-taskR6cHOc/test-tmp/rpc-test-960f7fd584cd42b698a0c54ad2edd446.sock
I20260925 22:39:52.099515   383 rpc-test.cc:1859] Sending 1024MB via ssl-enabled unix socket: real 1.606s	user 2.101s	sys 0.769s
I20260925 22:39:53.731315   383 rpc-test.cc:1859] Sending 1024MB via ssl-enabled unix socket: real 1.632s	user 2.036s	sys 0.874s
I20260925 22:39:55.370579   383 rpc-test.cc:1859] Sending 1024MB via ssl-enabled unix socket: real 1.639s	user 2.011s	sys 0.911s
I20260925 22:39:57.124486   383 rpc-test.cc:1859] Sending 1024MB via ssl-enabled unix socket: real 1.754s	user 2.175s	sys 0.938s
I20260925 22:39:58.757304   383 rpc-test.cc:1859] Sending 1024MB via ssl-enabled unix socket: real 1.633s	user 1.972s	sys 0.932s
W20260925 22:39:58.758121   837 connection.cc:196] Error closing socket: Network error: TlsSocket::Close: Broken pipe
[       OK ] Parameters/TestRpc.TestPerformanceBySocketType/SSL_UnixSocket (8301 ms)
[----------] 20 tests from Parameters/TestRpc (44523 ms total)

[----------] 1 test from Parameters/TestRpcSocketTxRxQueue
[ RUN      ] Parameters/TestRpcSocketTxRxQueue.AcceptorRxQueueSizeMetric/0
I20260925 22:39:58.761564   865 acceptor_pool.cc:254] collecting diagnostics on the listening RPC socket 0.0.0.0:42973 every 1 connection(s)
I20260925 22:39:58.761631   866 acceptor_pool.cc:254] collecting diagnostics on the listening RPC socket 0.0.0.0:42973 every 1 connection(s)
W20260925 22:39:58.762558   861 negotiation.cc:337] Failed RPC negotiation. Trace:
0925 22:39:58.762292 (+     0us) reactor.cc:625] Submitting negotiation task for server connection from 127.0.0.1:48730 (local address 127.0.0.1:42973)
0925 22:39:58.762383 (+    91us) server_negotiation.cc:206] Beginning negotiation
0925 22:39:58.762386 (+     3us) server_negotiation.cc:399] Waiting for connection header
0925 22:39:58.762485 (+    99us) negotiation.cc:327] Negotiation complete: Network error: Server connection negotiation failed: server connection from 127.0.0.1:48730: BlockingRecv error: recv got EOF from 127.0.0.1:48730 (error 108)
Metrics: {"server-negotiator.queue_time_us":24}
[       OK ] Parameters/TestRpcSocketTxRxQueue.AcceptorRxQueueSizeMetric/0 (5 ms)
[----------] 1 test from Parameters/TestRpcSocketTxRxQueue (5 ms total)

[----------] Global test environment tear-down
[==========] 21 tests from 2 test suites ran. (44528 ms total)
[  PASSED  ] 20 tests.
[  FAILED  ] 1 test, listed below:
[  FAILED  ] Parameters/TestRpc.TestCallWithChainCertAndChainCA/SSL_UnixSocket, where GetParam() = (true, true)

 1 FAILED TEST