Diagnosed failure

Parameters/TestRpc.TestCallWithChainCertAndChainCA/SSL_UnixSocket: /data0/somelongdirectorytoavoidrpathissues/src/kudu/src/kudu/rpc/rpc-test.cc:270: Failure
Failed
Bad status: Runtime error: could not verify certificate chain (error with cert: subject=CN = localhost, ST = sadfjas, C = AS, emailAddress = sdflkdsajf, O = lskdfjlsad, OU = sldfkja, issuer=C = AS, ST = ASDfkjdhf, L = lskdjf, O = saldfja, OU = skdjf, CN = localhost, emailAddress = sadjflkadsj): : certificate has expired
Google Test trace:
/data0/somelongdirectorytoavoidrpathissues/src/kudu/src/kudu/rpc/rpc-test.cc:267: Connecting to unix:/tmp/dist-test-taskclX09Y/test-tmp/rpc-test-19a65e543d714a3fa1e784ee85b2a3d9.sock
I20260928 03:48:05.792778  1717 test_util.cc:175] -----------------------------------------------
I20260928 03:48:05.792979  1717 test_util.cc:176] Had fatal failures, leaving test files at /tmp/dist-test-taskclX09Y/test-tmp/rpc-test.6.Parameters_TestRpc.TestCallWithChainCertAndChainCA_SSL_UnixSocket.1790567284422149-1717-0

Full log

Note: This is test shard 7 of 8.
[==========] Running 21 tests from 2 test suites.
[----------] Global test environment set-up.
[----------] 20 tests from Parameters/TestRpc
[ RUN      ] Parameters/TestRpc.TestMessengerCreateDestroy/SSL_UnixSocket
WARNING: Logging before InitGoogleLogging() is written to STDERR
I20260928 03:48:04.517731  1717 rpc-test.cc:169] started messenger TestCreateDestroy
[       OK ] Parameters/TestRpc.TestMessengerCreateDestroy/SSL_UnixSocket (1182 ms)
[ RUN      ] Parameters/TestRpc.TestNegotiationDeadlock/SSL_UnixSocket
I20260928 03:48:05.683565  1739 acceptor_pool.cc:254] collecting diagnostics on the listening RPC socket unix:/tmp/dist-test-taskclX09Y/test-tmp/rpc-test-a8752d1eaa0f41fa830238451ae91352.sock every 8 connection(s)
I20260928 03:48:05.685179  1740 acceptor_pool.cc:254] collecting diagnostics on the listening RPC socket unix:/tmp/dist-test-taskclX09Y/test-tmp/rpc-test-a8752d1eaa0f41fa830238451ae91352.sock every 8 connection(s)
[       OK ] Parameters/TestRpc.TestNegotiationDeadlock/SSL_UnixSocket (79 ms)
[ RUN      ] Parameters/TestRpc.TestCallWithChainCertAndChainCA/SSL_UnixSocket
I20260928 03:48:05.763458  1755 acceptor_pool.cc:254] collecting diagnostics on the listening RPC socket unix:/tmp/dist-test-taskclX09Y/test-tmp/rpc-test-19a65e543d714a3fa1e784ee85b2a3d9.sock every 8 connection(s)
I20260928 03:48:05.765658  1756 acceptor_pool.cc:254] collecting diagnostics on the listening RPC socket unix:/tmp/dist-test-taskclX09Y/test-tmp/rpc-test-19a65e543d714a3fa1e784ee85b2a3d9.sock every 8 connection(s)
/data0/somelongdirectorytoavoidrpathissues/src/kudu/src/kudu/rpc/rpc-test.cc:270: Failure
Failed
Bad status: Runtime error: could not verify certificate chain (error with cert: subject=CN = localhost, ST = sadfjas, C = AS, emailAddress = sdflkdsajf, O = lskdfjlsad, OU = sldfkja, issuer=C = AS, ST = ASDfkjdhf, L = lskdjf, O = saldfja, OU = skdjf, CN = localhost, emailAddress = sadjflkadsj): : certificate has expired
Google Test trace:
/data0/somelongdirectorytoavoidrpathissues/src/kudu/src/kudu/rpc/rpc-test.cc:267: Connecting to unix:/tmp/dist-test-taskclX09Y/test-tmp/rpc-test-19a65e543d714a3fa1e784ee85b2a3d9.sock
I20260928 03:48:05.792778  1717 test_util.cc:175] -----------------------------------------------
I20260928 03:48:05.792979  1717 test_util.cc:176] Had fatal failures, leaving test files at /tmp/dist-test-taskclX09Y/test-tmp/rpc-test.6.Parameters_TestRpc.TestCallWithChainCertAndChainCA_SSL_UnixSocket.1790567284422149-1717-0
[  FAILED  ] Parameters/TestRpc.TestCallWithChainCertAndChainCA/SSL_UnixSocket, where GetParam() = (true, true) (55 ms)
[ RUN      ] Parameters/TestRpc.TestCallWithPasswordProtectedKey/SSL_UnixSocket
I20260928 03:48:05.815385  1780 acceptor_pool.cc:254] collecting diagnostics on the listening RPC socket unix:/tmp/dist-test-taskclX09Y/test-tmp/rpc-test-95cf0e892a3b4eeab7c100191419093b.sock every 8 connection(s)
I20260928 03:48:05.816210  1781 acceptor_pool.cc:254] collecting diagnostics on the listening RPC socket unix:/tmp/dist-test-taskclX09Y/test-tmp/rpc-test-95cf0e892a3b4eeab7c100191419093b.sock every 8 connection(s)
[       OK ] Parameters/TestRpc.TestCallWithPasswordProtectedKey/SSL_UnixSocket (70 ms)
[ RUN      ] Parameters/TestRpc.TestCallToBadServer/SSL_UnixSocket
I20260928 03:48:05.881441  1717 rpc-test.cc:394] Status: Network error: Client connection negotiation failed: client connection to 0.0.0.0:0: connect: Connection refused (error 111)
I20260928 03:48:05.882789  1717 rpc-test.cc:394] Status: Network error: Client connection negotiation failed: client connection to 0.0.0.0:0: connect: Connection refused (error 111)
I20260928 03:48:05.884008  1717 rpc-test.cc:394] Status: Network error: Client connection negotiation failed: client connection to 0.0.0.0:0: connect: Connection refused (error 111)
I20260928 03:48:05.885212  1717 rpc-test.cc:394] Status: Network error: Client connection negotiation failed: client connection to 0.0.0.0:0: connect: Connection refused (error 111)
I20260928 03:48:05.886508  1717 rpc-test.cc:394] Status: Network error: Client connection negotiation failed: client connection to 0.0.0.0:0: connect: Connection refused (error 111)
[       OK ] Parameters/TestRpc.TestCallToBadServer/SSL_UnixSocket (25 ms)
[ RUN      ] Parameters/TestRpc.TestWrongService/SSL_UnixSocket
I20260928 03:48:05.906721  1815 acceptor_pool.cc:254] collecting diagnostics on the listening RPC socket unix:/tmp/dist-test-taskclX09Y/test-tmp/rpc-test-ea05c6741c0c49a99719d644f18355e4.sock every 8 connection(s)
I20260928 03:48:05.907394  1816 acceptor_pool.cc:254] collecting diagnostics on the listening RPC socket unix:/tmp/dist-test-taskclX09Y/test-tmp/rpc-test-ea05c6741c0c49a99719d644f18355e4.sock every 8 connection(s)
I20260928 03:48:05.936801  1812 messenger.cc:345] service WrongServiceName not registered on TestServer
W20260928 03:48:05.940207  1812 connection.cc:196] Error closing socket: Network error: TlsSocket::Close: Broken pipe
[       OK ] Parameters/TestRpc.TestWrongService/SSL_UnixSocket (56 ms)
[ RUN      ] Parameters/TestRpc.TestConnectionKeepalive/SSL_UnixSocket
I20260928 03:48:05.966097  1838 acceptor_pool.cc:254] collecting diagnostics on the listening RPC socket unix:/tmp/dist-test-taskclX09Y/test-tmp/rpc-test-ebd5bbe01f6a4bf7ab3cffe0458b72a1.sock every 8 connection(s)
I20260928 03:48:05.966791  1839 acceptor_pool.cc:254] collecting diagnostics on the listening RPC socket unix:/tmp/dist-test-taskclX09Y/test-tmp/rpc-test-ebd5bbe01f6a4bf7ab3cffe0458b72a1.sock every 8 connection(s)
I20260928 03:48:05.969924  1717 rpc-test.cc:488] Connecting to unix:/tmp/dist-test-taskclX09Y/test-tmp/rpc-test-ebd5bbe01f6a4bf7ab3cffe0458b72a1.sock
W20260928 03:48:06.449112  1851 connection.cc:196] Error closing socket: Network error: TlsSocket::Close: Broken pipe
[       OK ] Parameters/TestRpc.TestConnectionKeepalive/SSL_UnixSocket (1084 ms)
[ RUN      ] Parameters/TestRpc.TestClientConnectionMetrics/SSL_UnixSocket
I20260928 03:48:07.071448  1863 acceptor_pool.cc:254] collecting diagnostics on the listening RPC socket unix:/tmp/dist-test-taskclX09Y/test-tmp/rpc-test-35fbccee6b564f9ba90a13e2f6cd29a3.sock every 8 connection(s)
I20260928 03:48:07.072211  1864 acceptor_pool.cc:254] collecting diagnostics on the listening RPC socket unix:/tmp/dist-test-taskclX09Y/test-tmp/rpc-test-35fbccee6b564f9ba90a13e2f6cd29a3.sock every 8 connection(s)
I20260928 03:48:07.075774  1717 rpc-test.cc:569] Connecting to unix:/tmp/dist-test-taskclX09Y/test-tmp/rpc-test-35fbccee6b564f9ba90a13e2f6cd29a3.sock
W20260928 03:50:22.126441  1860 connection.cc:196] Error closing socket: Network error: TlsSocket::Close: Broken pipe
[       OK ] Parameters/TestRpc.TestClientConnectionMetrics/SSL_UnixSocket (135103 ms)
[ RUN      ] Parameters/TestRpc.TestCredentialsPolicy/SSL_UnixSocket
I20260928 03:50:22.152036  1899 acceptor_pool.cc:254] collecting diagnostics on the listening RPC socket unix:/tmp/dist-test-taskclX09Y/test-tmp/rpc-test-0d1ff28f2a834f83a24e38ab3a1851ae.sock every 8 connection(s)
I20260928 03:50:22.152925  1900 acceptor_pool.cc:254] collecting diagnostics on the listening RPC socket unix:/tmp/dist-test-taskclX09Y/test-tmp/rpc-test-0d1ff28f2a834f83a24e38ab3a1851ae.sock every 8 connection(s)
I20260928 03:50:22.156056  1717 rpc-test.cc:700] Connecting to unix:/tmp/dist-test-taskclX09Y/test-tmp/rpc-test-0d1ff28f2a834f83a24e38ab3a1851ae.sock
W20260928 03:50:22.185020  1898 connection.cc:196] Error closing socket: Network error: TlsSocket::Close: Broken pipe
[       OK ] Parameters/TestRpc.TestCredentialsPolicy/SSL_UnixSocket (72 ms)
[ RUN      ] Parameters/TestRpc.TestCallLongerThanKeepalive/SSL_UnixSocket
I20260928 03:50:22.234627  1924 acceptor_pool.cc:254] collecting diagnostics on the listening RPC socket unix:/tmp/dist-test-taskclX09Y/test-tmp/rpc-test-c548b3bd20934f99b9e88b220c8a0cc6.sock every 8 connection(s)
I20260928 03:50:22.235357  1925 acceptor_pool.cc:254] collecting diagnostics on the listening RPC socket unix:/tmp/dist-test-taskclX09Y/test-tmp/rpc-test-c548b3bd20934f99b9e88b220c8a0cc6.sock every 8 connection(s)
I20260928 03:50:22.269102  1928 rpc-test-base.h:222] got call: sleep_micros: 3000000 deferred: true
I20260928 03:50:25.273545  1928 rpcz_store.cc:275] Call kudu.rpc.GenericCalculatorService.Sleep from unix:<unnamed> (request call id 0) took 3004 ms. Trace:
I20260928 03:50:25.273972  1928 rpcz_store.cc:276] 0928 03:50:22.268880 (+     0us) service_pool.cc:170] Inserting onto call queue
0928 03:50:22.269017 (+   137us) service_pool.cc:227] Handling call
0928 03:50:25.273371 (+3004354us) inbound_call.cc:173] Queueing success response
Metrics: {}
W20260928 03:50:25.278714  1921 connection.cc:196] Error closing socket: Network error: TlsSocket::Close: Broken pipe
[       OK ] Parameters/TestRpc.TestCallLongerThanKeepalive/SSL_UnixSocket (3079 ms)
[ RUN      ] Parameters/TestRpc.TestRpcSidecar/SSL_UnixSocket
I20260928 03:50:25.310420  1950 acceptor_pool.cc:254] collecting diagnostics on the listening RPC socket unix:/tmp/dist-test-taskclX09Y/test-tmp/rpc-test-c7bf7eedd86743f48a3d4a1e87073fe6.sock every 8 connection(s)
I20260928 03:50:25.311290  1951 acceptor_pool.cc:254] collecting diagnostics on the listening RPC socket unix:/tmp/dist-test-taskclX09Y/test-tmp/rpc-test-c7bf7eedd86743f48a3d4a1e87073fe6.sock every 8 connection(s)
W20260928 03:50:25.812711  1947 connection.cc:196] Error closing socket: Network error: TlsSocket::Close: Broken pipe
[       OK ] Parameters/TestRpc.TestRpcSidecar/SSL_UnixSocket (531 ms)
[ RUN      ] Parameters/TestRpc.TestRpcSidecarLimits/SSL_UnixSocket
I20260928 03:50:42.570816  1976 acceptor_pool.cc:254] collecting diagnostics on the listening RPC socket unix:/tmp/dist-test-taskclX09Y/test-tmp/rpc-test-3ec3733dfb4a42c6a256a51b8339c5db.sock every 8 connection(s)
I20260928 03:50:42.571717  1977 acceptor_pool.cc:254] collecting diagnostics on the listening RPC socket unix:/tmp/dist-test-taskclX09Y/test-tmp/rpc-test-3ec3733dfb4a42c6a256a51b8339c5db.sock every 8 connection(s)
W20260928 03:50:42.607139  1717 serialization.cc:72] Serialized kudu.rpc_test.PushStringsRequestPB (2147483654 bytes) is larger than the maximum configured RPC message size (52428800 bytes). Sending anyway, but peer may reject the data.
W20260928 03:50:42.618441  1973 connection.cc:535] server connection from unix:<unnamed> recv error: Network error: RPC frame had a length of 2147483714, but we only support messages up to 52428800 bytes long.
W20260928 03:50:42.618891  1973 connection.cc:158] shutting down server connection from unix:<unnamed> with pending inbound data: 4/2147483714 bytes received; last active 0 ns ago: status Network error: RPC frame had a length of 2147483714, but we only support messages up to 52428800 bytes long.
W20260928 03:50:42.619768  1989 connection.cc:698] client connection to unix:/tmp/dist-test-taskclX09Y/test-tmp/rpc-test-3ec3733dfb4a42c6a256a51b8339c5db.sock send error: Network error: failed to write to TLS socket: Broken pipe
W20260928 03:50:42.620376  1989 connection.cc:196] Error closing socket: Network error: TlsSocket::Close: Success
[       OK ] Parameters/TestRpc.TestRpcSidecarLimits/SSL_UnixSocket (17576 ms)
[ RUN      ] Parameters/TestRpc.TestCallTimeoutDoesntAffectNegotiation/SSL_UnixSocket
I20260928 03:50:43.412153  2001 acceptor_pool.cc:254] collecting diagnostics on the listening RPC socket unix:/tmp/dist-test-taskclX09Y/test-tmp/rpc-test-51693a0e407c473e8a424d5a70b6928f.sock every 8 connection(s)
I20260928 03:50:43.412864  2002 acceptor_pool.cc:254] collecting diagnostics on the listening RPC socket unix:/tmp/dist-test-taskclX09Y/test-tmp/rpc-test-51693a0e407c473e8a424d5a70b6928f.sock every 8 connection(s)
W20260928 03:50:43.437212  1997 negotiation.cc:266] Injecting 500ms delay in negotiation
I20260928 03:50:43.487784  1717 rpc-test-base.h:595] status: Timed out: connection negotiation to unix:/tmp/dist-test-taskclX09Y/test-tmp/rpc-test-51693a0e407c473e8a424d5a70b6928f.sock for RPC Sleep timed out after 0.050s (ON_OUTBOUND_QUEUE), seconds elapsed: 0.0516144
W20260928 03:50:43.950290  1998 connection.cc:196] Error closing socket: Network error: TlsSocket::Close: Broken pipe
[       OK ] Parameters/TestRpc.TestCallTimeoutDoesntAffectNegotiation/SSL_UnixSocket (559 ms)
[ RUN      ] Parameters/TestRpc.TestRpcHandlerLatencyMetric/SSL_UnixSocket
I20260928 03:50:43.977394  2026 acceptor_pool.cc:254] collecting diagnostics on the listening RPC socket unix:/tmp/dist-test-taskclX09Y/test-tmp/rpc-test-8f380e478cc243c895af1fedafdf6a6e.sock every 8 connection(s)
I20260928 03:50:43.978169  2027 acceptor_pool.cc:254] collecting diagnostics on the listening RPC socket unix:/tmp/dist-test-taskclX09Y/test-tmp/rpc-test-8f380e478cc243c895af1fedafdf6a6e.sock every 8 connection(s)
I20260928 03:50:44.025744  1717 rpc-test.cc:1236] Sleep() min lat: 21629
I20260928 03:50:44.025940  1717 rpc-test.cc:1237] Sleep() mean lat: 21629
I20260928 03:50:44.026093  1717 rpc-test.cc:1238] Sleep() max lat: 21629
I20260928 03:50:44.026203  1717 rpc-test.cc:1239] Sleep() #calls: 1
W20260928 03:50:44.028891  2023 connection.cc:196] Error closing socket: Network error: TlsSocket::Close: Broken pipe
[       OK ] Parameters/TestRpc.TestRpcHandlerLatencyMetric/SSL_UnixSocket (78 ms)
[ RUN      ] Parameters/TestRpc.TimedOutOnResponseMetricServiceQueue/SSL_UnixSocket
I20260928 03:50:44.062629  2052 acceptor_pool.cc:254] collecting diagnostics on the listening RPC socket unix:/tmp/dist-test-taskclX09Y/test-tmp/rpc-test-d88792b5c0f749949383d19c9a72a215.sock every 8 connection(s)
I20260928 03:50:44.063346  2053 acceptor_pool.cc:254] collecting diagnostics on the listening RPC socket unix:/tmp/dist-test-taskclX09Y/test-tmp/rpc-test-d88792b5c0f749949383d19c9a72a215.sock every 8 connection(s)
W20260928 03:50:44.131309  2054 rpcz_store.cc:267] Call kudu.rpc_test.CalculatorService.Sleep from unix:<unnamed> (request call id 2) took 20 ms (client timeout 20 ms). Trace:
W20260928 03:50:44.131645  2054 rpcz_store.cc:269] 0928 03:50:44.110884 (+     0us) service_pool.cc:170] Inserting onto call queue
0928 03:50:44.131191 (+ 20307us) service_pool.cc:214] Skipping call since client already timed out
0928 03:50:44.131265 (+    74us) inbound_call.cc:173] Queueing failure response
Metrics: {}
W20260928 03:50:44.134478  2049 connection.cc:196] Error closing socket: Network error: TlsSocket::Close: Broken pipe
[       OK ] Parameters/TestRpc.TimedOutOnResponseMetricServiceQueue/SSL_UnixSocket (105 ms)
[ RUN      ] Parameters/TestRpc.RpcPendingConnectionsMetric/SSL_UnixSocket
I20260928 03:50:44.148610  2075 acceptor_pool.cc:254] collecting diagnostics on the listening RPC socket 0.0.0.0:42509 every 8 connection(s)
I20260928 03:50:44.149314  2076 acceptor_pool.cc:254] collecting diagnostics on the listening RPC socket 0.0.0.0:42509 every 8 connection(s)
W20260928 03:50:44.164361  2071 negotiation.cc:337] Failed RPC negotiation. Trace:
0928 03:50:44.162988 (+     0us) reactor.cc:625] Submitting negotiation task for server connection from 127.0.0.1:60668 (local address 127.0.0.1:42509)
0928 03:50:44.163395 (+   407us) server_negotiation.cc:206] Beginning negotiation
0928 03:50:44.163412 (+    17us) server_negotiation.cc:399] Waiting for connection header
0928 03:50:44.163638 (+   226us) negotiation.cc:327] Negotiation complete: Network error: Server connection negotiation failed: server connection from 127.0.0.1:60668: BlockingRecv error: recv got EOF from 127.0.0.1:60668 (error 108)
Metrics: {"server-negotiator.queue_time_us":117}
[       OK ] Parameters/TestRpc.RpcPendingConnectionsMetric/SSL_UnixSocket (37 ms)
[ RUN      ] Parameters/TestRpc.TestRpcContextClientDeadline/SSL_UnixSocket
I20260928 03:50:44.191809  2091 acceptor_pool.cc:254] collecting diagnostics on the listening RPC socket unix:/tmp/dist-test-taskclX09Y/test-tmp/rpc-test-924dc150ffa44e9ba8d2954eccb1ff98.sock every 8 connection(s)
I20260928 03:50:44.192534  2092 acceptor_pool.cc:254] collecting diagnostics on the listening RPC socket unix:/tmp/dist-test-taskclX09Y/test-tmp/rpc-test-924dc150ffa44e9ba8d2954eccb1ff98.sock every 8 connection(s)
W20260928 03:50:44.251022  2088 connection.cc:196] Error closing socket: Network error: TlsSocket::Close: Broken pipe
[       OK ] Parameters/TestRpc.TestRpcContextClientDeadline/SSL_UnixSocket (79 ms)
[ RUN      ] Parameters/TestRpc.TestApplicationFeatureFlagUnsupportedServer/SSL_UnixSocket
I20260928 03:50:44.274565  2116 acceptor_pool.cc:254] collecting diagnostics on the listening RPC socket unix:/tmp/dist-test-taskclX09Y/test-tmp/rpc-test-ab25e089454942eab047a9a3cd39644a.sock every 8 connection(s)
I20260928 03:50:44.275264  2117 acceptor_pool.cc:254] collecting diagnostics on the listening RPC socket unix:/tmp/dist-test-taskclX09Y/test-tmp/rpc-test-ab25e089454942eab047a9a3cd39644a.sock every 8 connection(s)
W20260928 03:50:44.322762  2113 connection.cc:196] Error closing socket: Network error: TlsSocket::Close: Broken pipe
[       OK ] Parameters/TestRpc.TestApplicationFeatureFlagUnsupportedServer/SSL_UnixSocket (72 ms)
[ RUN      ] Parameters/TestRpc.TestCancellationAsync/SSL_UnixSocket
I20260928 03:50:44.365720  2141 acceptor_pool.cc:254] collecting diagnostics on the listening RPC socket unix:/tmp/dist-test-taskclX09Y/test-tmp/rpc-test-91eabb3590384fc698695e53662294bf.sock every 8 connection(s)
I20260928 03:50:44.366421  2142 acceptor_pool.cc:254] collecting diagnostics on the listening RPC socket unix:/tmp/dist-test-taskclX09Y/test-tmp/rpc-test-91eabb3590384fc698695e53662294bf.sock every 8 connection(s)
I20260928 03:50:44.369509  1717 rpc-test.cc:1716] Connecting to unix:/tmp/dist-test-taskclX09Y/test-tmp/rpc-test-91eabb3590384fc698695e53662294bf.sock
I20260928 03:50:44.419857  1717 test_util.cc:268] Using random seed: -126315269
I20260928 03:50:44.644315  2145 rpc-test-base.h:240] got call: sleep_micros: 500 pattern: 4294967295 num_repetitions: 2097152 sidecar_idx: 0
I20260928 03:50:44.835996  2144 rpc-test-base.h:240] got call: sleep_micros: 500 pattern: 4294967295 num_repetitions: 2097152 sidecar_idx: 0
I20260928 03:50:45.064361  2145 rpc-test-base.h:240] got call: sleep_micros: 500 pattern: 4294967295 num_repetitions: 2097152 sidecar_idx: 0
W20260928 03:50:45.165963  2154 outbound_call.cc:322] RPC callback for RPC call kudu.rpc.GenericCalculatorService.SleepWithSidecar -> {remote=unix:/tmp/dist-test-taskclX09Y/test-tmp/rpc-test-91eabb3590384fc698695e53662294bf.sock, user_credentials={real_user=slave}} blocked reactor thread for 103662us
I20260928 03:50:45.389223  2145 rpc-test-base.h:240] got call: sleep_micros: 500 pattern: 4294967295 num_repetitions: 2097152 sidecar_idx: 0
I20260928 03:50:45.600349  2145 rpc-test-base.h:240] got call: sleep_micros: 500 pattern: 4294967295 num_repetitions: 2097152 sidecar_idx: 0
I20260928 03:50:45.803709  2144 rpc-test-base.h:240] got call: sleep_micros: 500 pattern: 4294967295 num_repetitions: 2097152 sidecar_idx: 0
I20260928 03:50:45.984272  2145 rpc-test-base.h:240] got call: sleep_micros: 500 pattern: 4294967295 num_repetitions: 2097152 sidecar_idx: 0
I20260928 03:50:46.211422  2144 rpc-test-base.h:240] got call: sleep_micros: 500 pattern: 4294967295 num_repetitions: 2097152 sidecar_idx: 0
I20260928 03:50:46.399360  2145 rpc-test-base.h:240] got call: sleep_micros: 500 pattern: 4294967295 num_repetitions: 2097152 sidecar_idx: 0
W20260928 03:50:46.414697  2138 connection.cc:196] Error closing socket: Network error: TlsSocket::Close: Broken pipe
W20260928 03:50:46.492805  2138 connection.cc:441] server connection from unix:<unnamed> torn down before Call kudu.rpc.GenericCalculatorService.SleepWithSidecar from unix:<unnamed> (request call id 8) could send its response
W20260928 03:50:46.583900  2138 connection.cc:441] server connection from unix:<unnamed> torn down before Call kudu.rpc.GenericCalculatorService.SleepWithSidecar from unix:<unnamed> (request call id 9) could send its response
[       OK ] Parameters/TestRpc.TestCancellationAsync/SSL_UnixSocket (2266 ms)
[ RUN      ] Parameters/TestRpc.TestPerformanceBySocketType/SSL_UnixSocket
I20260928 03:50:46.696911  2167 acceptor_pool.cc:254] collecting diagnostics on the listening RPC socket unix:/tmp/dist-test-taskclX09Y/test-tmp/rpc-test-45257043c1d841ea98b836a01f08739b.sock every 8 connection(s)
I20260928 03:50:46.697816  2168 acceptor_pool.cc:254] collecting diagnostics on the listening RPC socket unix:/tmp/dist-test-taskclX09Y/test-tmp/rpc-test-45257043c1d841ea98b836a01f08739b.sock every 8 connection(s)
I20260928 03:50:46.700820  1717 rpc-test.cc:1846] Connecting to unix:/tmp/dist-test-taskclX09Y/test-tmp/rpc-test-45257043c1d841ea98b836a01f08739b.sock
I20260928 03:51:07.890964  1717 rpc-test.cc:1859] Sending 1024MB via ssl-enabled unix socket: real 21.177s	user 19.141s	sys 12.558s
I20260928 03:51:28.834380  1717 rpc-test.cc:1859] Sending 1024MB via ssl-enabled unix socket: real 20.943s	user 18.743s	sys 12.475s
I20260928 03:51:50.083321  1717 rpc-test.cc:1859] Sending 1024MB via ssl-enabled unix socket: real 21.248s	user 19.037s	sys 12.708s
I20260928 03:52:11.401332  1717 rpc-test.cc:1859] Sending 1024MB via ssl-enabled unix socket: real 21.318s	user 19.040s	sys 12.870s
I20260928 03:52:32.814313  1717 rpc-test.cc:1859] Sending 1024MB via ssl-enabled unix socket: real 21.413s	user 19.229s	sys 12.915s
W20260928 03:52:32.820366  2164 connection.cc:196] Error closing socket: Network error: TlsSocket::Close: Broken pipe
[       OK ] Parameters/TestRpc.TestPerformanceBySocketType/SSL_UnixSocket (106237 ms)
[----------] 20 tests from Parameters/TestRpc (268358 ms total)

[----------] 1 test from Parameters/TestRpcSocketTxRxQueue
[ RUN      ] Parameters/TestRpcSocketTxRxQueue.AcceptorRxQueueSizeMetric/0
I20260928 03:52:32.844596  2202 acceptor_pool.cc:254] collecting diagnostics on the listening RPC socket 0.0.0.0:45913 every 1 connection(s)
I20260928 03:52:32.845613  2203 acceptor_pool.cc:254] collecting diagnostics on the listening RPC socket 0.0.0.0:45913 every 1 connection(s)
W20260928 03:52:32.851576  2198 negotiation.cc:337] Failed RPC negotiation. Trace:
0928 03:52:32.849865 (+     0us) reactor.cc:625] Submitting negotiation task for server connection from 127.0.0.1:48088 (local address 127.0.0.1:45913)
0928 03:52:32.850346 (+   481us) server_negotiation.cc:206] Beginning negotiation
0928 03:52:32.850370 (+    24us) server_negotiation.cc:399] Waiting for connection header
0928 03:52:32.850608 (+   238us) negotiation.cc:327] Negotiation complete: Network error: Server connection negotiation failed: server connection from 127.0.0.1:48088: BlockingRecv error: recv got EOF from 127.0.0.1:48088 (error 108)
Metrics: {"server-negotiator.queue_time_us":132}
[       OK ] Parameters/TestRpcSocketTxRxQueue.AcceptorRxQueueSizeMetric/0 (26 ms)
[----------] 1 test from Parameters/TestRpcSocketTxRxQueue (26 ms total)

[----------] Global test environment tear-down
[==========] 21 tests from 2 test suites ran. (268386 ms total)
[  PASSED  ] 20 tests.
[  FAILED  ] 1 test, listed below:
[  FAILED  ] Parameters/TestRpc.TestCallWithChainCertAndChainCA/SSL_UnixSocket, where GetParam() = (true, true)

 1 FAILED TEST