Diagnosed failure
Parameters/TestRpc.TestCallWithChainCertAndChainCA/SSL_UnixSocket: /data0/somelongdirectorytoavoidrpathissues/src/kudu/src/kudu/rpc/rpc-test.cc:270: Failure
Failed
Bad status: Runtime error: could not verify certificate chain (error with cert: subject=CN = localhost, ST = sadfjas, C = AS, emailAddress = sdflkdsajf, O = lskdfjlsad, OU = sldfkja, issuer=C = AS, ST = ASDfkjdhf, L = lskdjf, O = saldfja, OU = skdjf, CN = localhost, emailAddress = sadjflkadsj): : certificate has expired
Google Test trace:
/data0/somelongdirectorytoavoidrpathissues/src/kudu/src/kudu/rpc/rpc-test.cc:267: Connecting to unix:/tmp/dist-test-task6PYWmC/test-tmp/rpc-test-41909732b03d47a280f98511b1dce7fd.sock
I20260925 02:22:32.774657 17702 test_util.cc:175] -----------------------------------------------
I20260925 02:22:32.774705 17702 test_util.cc:176] Had fatal failures, leaving test files at /tmp/dist-test-task6PYWmC/test-tmp/rpc-test.6.Parameters_TestRpc.TestCallWithChainCertAndChainCA_SSL_UnixSocket.1790302952703679-17702-0
Full log
Note: This is test shard 7 of 8.
[==========] Running 21 tests from 2 test suites.
[----------] Global test environment set-up.
[----------] 20 tests from Parameters/TestRpc
[ RUN ] Parameters/TestRpc.TestMessengerCreateDestroy/SSL_UnixSocket
WARNING: Logging before InitGoogleLogging() is written to STDERR
I20260925 02:22:32.724781 17702 rpc-test.cc:169] started messenger TestCreateDestroy
[ OK ] Parameters/TestRpc.TestMessengerCreateDestroy/SSL_UnixSocket (19 ms)
[ RUN ] Parameters/TestRpc.TestNegotiationDeadlock/SSL_UnixSocket
I20260925 02:22:32.742158 17722 acceptor_pool.cc:254] collecting diagnostics on the listening RPC socket unix:/tmp/dist-test-task6PYWmC/test-tmp/rpc-test-aa68cc4fa5324bbab6bffd5eef21517d.sock every 8 connection(s)
I20260925 02:22:32.742192 17723 acceptor_pool.cc:254] collecting diagnostics on the listening RPC socket unix:/tmp/dist-test-task6PYWmC/test-tmp/rpc-test-aa68cc4fa5324bbab6bffd5eef21517d.sock every 8 connection(s)
[ OK ] Parameters/TestRpc.TestNegotiationDeadlock/SSL_UnixSocket (23 ms)
[ RUN ] Parameters/TestRpc.TestCallWithChainCertAndChainCA/SSL_UnixSocket
I20260925 02:22:32.770677 17738 acceptor_pool.cc:254] collecting diagnostics on the listening RPC socket unix:/tmp/dist-test-task6PYWmC/test-tmp/rpc-test-41909732b03d47a280f98511b1dce7fd.sock every 8 connection(s)
I20260925 02:22:32.770725 17739 acceptor_pool.cc:254] collecting diagnostics on the listening RPC socket unix:/tmp/dist-test-task6PYWmC/test-tmp/rpc-test-41909732b03d47a280f98511b1dce7fd.sock every 8 connection(s)
/data0/somelongdirectorytoavoidrpathissues/src/kudu/src/kudu/rpc/rpc-test.cc:270: Failure
Failed
Bad status: Runtime error: could not verify certificate chain (error with cert: subject=CN = localhost, ST = sadfjas, C = AS, emailAddress = sdflkdsajf, O = lskdfjlsad, OU = sldfkja, issuer=C = AS, ST = ASDfkjdhf, L = lskdjf, O = saldfja, OU = skdjf, CN = localhost, emailAddress = sadjflkadsj): : certificate has expired
Google Test trace:
/data0/somelongdirectorytoavoidrpathissues/src/kudu/src/kudu/rpc/rpc-test.cc:267: Connecting to unix:/tmp/dist-test-task6PYWmC/test-tmp/rpc-test-41909732b03d47a280f98511b1dce7fd.sock
I20260925 02:22:32.774657 17702 test_util.cc:175] -----------------------------------------------
I20260925 02:22:32.774705 17702 test_util.cc:176] Had fatal failures, leaving test files at /tmp/dist-test-task6PYWmC/test-tmp/rpc-test.6.Parameters_TestRpc.TestCallWithChainCertAndChainCA_SSL_UnixSocket.1790302952703679-17702-0
[ FAILED ] Parameters/TestRpc.TestCallWithChainCertAndChainCA/SSL_UnixSocket, where GetParam() = (true, true) (25 ms)
[ RUN ] Parameters/TestRpc.TestCallWithPasswordProtectedKey/SSL_UnixSocket
I20260925 02:22:32.790944 17763 acceptor_pool.cc:254] collecting diagnostics on the listening RPC socket unix:/tmp/dist-test-task6PYWmC/test-tmp/rpc-test-c1e0690c291e4d1f89ef03be8a39c1f9.sock every 8 connection(s)
I20260925 02:22:32.790975 17764 acceptor_pool.cc:254] collecting diagnostics on the listening RPC socket unix:/tmp/dist-test-task6PYWmC/test-tmp/rpc-test-c1e0690c291e4d1f89ef03be8a39c1f9.sock every 8 connection(s)
[ OK ] Parameters/TestRpc.TestCallWithPasswordProtectedKey/SSL_UnixSocket (29 ms)
[ RUN ] Parameters/TestRpc.TestCallToBadServer/SSL_UnixSocket
I20260925 02:22:32.813608 17702 rpc-test.cc:394] Status: Network error: Client connection negotiation failed: client connection to 0.0.0.0:0: connect: Connection refused (error 111)
I20260925 02:22:32.813933 17702 rpc-test.cc:394] Status: Network error: Client connection negotiation failed: client connection to 0.0.0.0:0: connect: Connection refused (error 111)
I20260925 02:22:32.814160 17702 rpc-test.cc:394] Status: Network error: Client connection negotiation failed: client connection to 0.0.0.0:0: connect: Connection refused (error 111)
I20260925 02:22:32.814345 17702 rpc-test.cc:394] Status: Network error: Client connection negotiation failed: client connection to 0.0.0.0:0: connect: Connection refused (error 111)
I20260925 02:22:32.814523 17702 rpc-test.cc:394] Status: Network error: Client connection negotiation failed: client connection to 0.0.0.0:0: connect: Connection refused (error 111)
[ OK ] Parameters/TestRpc.TestCallToBadServer/SSL_UnixSocket (10 ms)
[ RUN ] Parameters/TestRpc.TestWrongService/SSL_UnixSocket
I20260925 02:22:32.831477 17798 acceptor_pool.cc:254] collecting diagnostics on the listening RPC socket unix:/tmp/dist-test-task6PYWmC/test-tmp/rpc-test-9dddd2afdf234d5385fcfcc350cf9763.sock every 8 connection(s)
I20260925 02:22:32.831533 17799 acceptor_pool.cc:254] collecting diagnostics on the listening RPC socket unix:/tmp/dist-test-task6PYWmC/test-tmp/rpc-test-9dddd2afdf234d5385fcfcc350cf9763.sock every 8 connection(s)
I20260925 02:22:32.839813 17795 messenger.cc:345] service WrongServiceName not registered on TestServer
W20260925 02:22:32.840551 17795 connection.cc:196] Error closing socket: Network error: TlsSocket::Close: Broken pipe
[ OK ] Parameters/TestRpc.TestWrongService/SSL_UnixSocket (26 ms)
[ RUN ] Parameters/TestRpc.TestConnectionKeepalive/SSL_UnixSocket
I20260925 02:22:32.848229 17821 acceptor_pool.cc:254] collecting diagnostics on the listening RPC socket unix:/tmp/dist-test-task6PYWmC/test-tmp/rpc-test-59a46792442b44e792586f72b510de48.sock every 8 connection(s)
I20260925 02:22:32.848280 17822 acceptor_pool.cc:254] collecting diagnostics on the listening RPC socket unix:/tmp/dist-test-task6PYWmC/test-tmp/rpc-test-59a46792442b44e792586f72b510de48.sock every 8 connection(s)
I20260925 02:22:32.848439 17702 rpc-test.cc:488] Connecting to unix:/tmp/dist-test-task6PYWmC/test-tmp/rpc-test-59a46792442b44e792586f72b510de48.sock
W20260925 02:22:33.343003 17834 connection.cc:196] Error closing socket: Network error: TlsSocket::Close: Broken pipe
[ OK ] Parameters/TestRpc.TestConnectionKeepalive/SSL_UnixSocket (1024 ms)
[ RUN ] Parameters/TestRpc.TestClientConnectionMetrics/SSL_UnixSocket
I20260925 02:22:33.878720 17846 acceptor_pool.cc:254] collecting diagnostics on the listening RPC socket unix:/tmp/dist-test-task6PYWmC/test-tmp/rpc-test-bf46647ce65b4e5a928319ebb1bcf4da.sock every 8 connection(s)
I20260925 02:22:33.878778 17847 acceptor_pool.cc:254] collecting diagnostics on the listening RPC socket unix:/tmp/dist-test-task6PYWmC/test-tmp/rpc-test-bf46647ce65b4e5a928319ebb1bcf4da.sock every 8 connection(s)
I20260925 02:22:33.878958 17702 rpc-test.cc:569] Connecting to unix:/tmp/dist-test-task6PYWmC/test-tmp/rpc-test-bf46647ce65b4e5a928319ebb1bcf4da.sock
[ OK ] Parameters/TestRpc.TestClientConnectionMetrics/SSL_UnixSocket (9513 ms)
[ RUN ] Parameters/TestRpc.TestCredentialsPolicy/SSL_UnixSocket
I20260925 02:22:43.388150 17869 acceptor_pool.cc:254] collecting diagnostics on the listening RPC socket unix:/tmp/dist-test-task6PYWmC/test-tmp/rpc-test-614c881eea3343ab81c71f7ac2d61e62.sock every 8 connection(s)
I20260925 02:22:43.388231 17870 acceptor_pool.cc:254] collecting diagnostics on the listening RPC socket unix:/tmp/dist-test-task6PYWmC/test-tmp/rpc-test-614c881eea3343ab81c71f7ac2d61e62.sock every 8 connection(s)
I20260925 02:22:43.388300 17702 rpc-test.cc:700] Connecting to unix:/tmp/dist-test-task6PYWmC/test-tmp/rpc-test-614c881eea3343ab81c71f7ac2d61e62.sock
W20260925 02:22:43.402835 17868 connection.cc:196] Error closing socket: Network error: TlsSocket::Close: Broken pipe
W20260925 02:22:43.406455 17868 connection.cc:196] Error closing socket: Network error: TlsSocket::Close: Broken pipe
[ OK ] Parameters/TestRpc.TestCredentialsPolicy/SSL_UnixSocket (27 ms)
[ RUN ] Parameters/TestRpc.TestCallLongerThanKeepalive/SSL_UnixSocket
I20260925 02:22:43.425150 17894 acceptor_pool.cc:254] collecting diagnostics on the listening RPC socket unix:/tmp/dist-test-task6PYWmC/test-tmp/rpc-test-4df96afc66e148e293b60b78e1b0fd42.sock every 8 connection(s)
I20260925 02:22:43.425208 17895 acceptor_pool.cc:254] collecting diagnostics on the listening RPC socket unix:/tmp/dist-test-task6PYWmC/test-tmp/rpc-test-4df96afc66e148e293b60b78e1b0fd42.sock every 8 connection(s)
I20260925 02:22:43.437712 17898 rpc-test-base.h:222] got call: sleep_micros: 3000000 deferred: true
I20260925 02:22:46.438467 17898 rpcz_store.cc:275] Call kudu.rpc.GenericCalculatorService.Sleep from unix:<unnamed> (request call id 0) took 3000 ms. Trace:
I20260925 02:22:46.438575 17898 rpcz_store.cc:276] 0925 02:22:43.437624 (+ 0us) service_pool.cc:170] Inserting onto call queue
0925 02:22:43.437685 (+ 61us) service_pool.cc:227] Handling call
0925 02:22:46.438449 (+3000764us) inbound_call.cc:173] Queueing success response
Metrics: {}
[ OK ] Parameters/TestRpc.TestCallLongerThanKeepalive/SSL_UnixSocket (3032 ms)
[ RUN ] Parameters/TestRpc.TestRpcSidecar/SSL_UnixSocket
I20260925 02:22:46.461607 17919 acceptor_pool.cc:254] collecting diagnostics on the listening RPC socket unix:/tmp/dist-test-task6PYWmC/test-tmp/rpc-test-56a9fa83ccd047cd90cce5e14929803e.sock every 8 connection(s)
I20260925 02:22:46.461666 17920 acceptor_pool.cc:254] collecting diagnostics on the listening RPC socket unix:/tmp/dist-test-task6PYWmC/test-tmp/rpc-test-56a9fa83ccd047cd90cce5e14929803e.sock every 8 connection(s)
W20260925 02:22:46.504350 17916 connection.cc:196] Error closing socket: Network error: TlsSocket::Close: Broken pipe
[ OK ] Parameters/TestRpc.TestRpcSidecar/SSL_UnixSocket (64 ms)
[ RUN ] Parameters/TestRpc.TestRpcSidecarLimits/SSL_UnixSocket
I20260925 02:22:48.573612 17944 acceptor_pool.cc:254] collecting diagnostics on the listening RPC socket unix:/tmp/dist-test-task6PYWmC/test-tmp/rpc-test-5c22d0973ea6401e9d49be9e8deb70b1.sock every 8 connection(s)
I20260925 02:22:48.573640 17945 acceptor_pool.cc:254] collecting diagnostics on the listening RPC socket unix:/tmp/dist-test-task6PYWmC/test-tmp/rpc-test-5c22d0973ea6401e9d49be9e8deb70b1.sock every 8 connection(s)
W20260925 02:22:48.587896 17702 serialization.cc:72] Serialized kudu.rpc_test.PushStringsRequestPB (2147483654 bytes) is larger than the maximum configured RPC message size (52428800 bytes). Sending anyway, but peer may reject the data.
W20260925 02:22:48.591184 17941 connection.cc:535] server connection from unix:<unnamed> recv error: Network error: RPC frame had a length of 2147483714, but we only support messages up to 52428800 bytes long.
W20260925 02:22:48.591234 17941 connection.cc:158] shutting down server connection from unix:<unnamed> with pending inbound data: 4/2147483714 bytes received; last active 0 ns ago: status Network error: RPC frame had a length of 2147483714, but we only support messages up to 52428800 bytes long.
W20260925 02:22:48.591459 17957 connection.cc:698] client connection to unix:/tmp/dist-test-task6PYWmC/test-tmp/rpc-test-5c22d0973ea6401e9d49be9e8deb70b1.sock send error: Network error: failed to write to TLS socket: Broken pipe
W20260925 02:22:48.591594 17957 connection.cc:196] Error closing socket: Network error: TlsSocket::Close: Success
I20260925 02:22:48.600162 17970 acceptor_pool.cc:254] collecting diagnostics on the listening RPC socket unix:/tmp/dist-test-task6PYWmC/test-tmp/rpc-test-5c22d0973ea6401e9d49be9e8deb70b1.sock every 8 connection(s)
I20260925 02:22:48.600236 17969 acceptor_pool.cc:254] collecting diagnostics on the listening RPC socket unix:/tmp/dist-test-task6PYWmC/test-tmp/rpc-test-5c22d0973ea6401e9d49be9e8deb70b1.sock every 8 connection(s)
W20260925 02:22:53.877461 17966 connection.cc:577] server connection from unix:<unnamed>: received bad data: 'Corruption: Invalid packet: message had a length of 2147483710, but we only support messages up to 2147483647 bytes
'
W20260925 02:22:53.877744 17982 connection.cc:196] Error closing socket: Network error: TlsSocket::Close: Broken pipe
[ OK ] Parameters/TestRpc.TestRpcSidecarLimits/SSL_UnixSocket (7374 ms)
[ RUN ] Parameters/TestRpc.TestCallTimeoutDoesntAffectNegotiation/SSL_UnixSocket
I20260925 02:22:53.894075 17994 acceptor_pool.cc:254] collecting diagnostics on the listening RPC socket unix:/tmp/dist-test-task6PYWmC/test-tmp/rpc-test-f531b1de2c4544d3845eafdc4e264228.sock every 8 connection(s)
I20260925 02:22:53.894116 17995 acceptor_pool.cc:254] collecting diagnostics on the listening RPC socket unix:/tmp/dist-test-task6PYWmC/test-tmp/rpc-test-f531b1de2c4544d3845eafdc4e264228.sock every 8 connection(s)
W20260925 02:22:53.902684 17990 negotiation.cc:266] Injecting 500ms delay in negotiation
I20260925 02:22:53.952988 17702 rpc-test-base.h:595] status: Timed out: connection negotiation to unix:/tmp/dist-test-task6PYWmC/test-tmp/rpc-test-f531b1de2c4544d3845eafdc4e264228.sock for RPC Sleep timed out after 0.050s (ON_OUTBOUND_QUEUE), seconds elapsed: 0.0505543
W20260925 02:22:54.406769 17991 connection.cc:196] Error closing socket: Network error: TlsSocket::Close: Broken pipe
[ OK ] Parameters/TestRpc.TestCallTimeoutDoesntAffectNegotiation/SSL_UnixSocket (527 ms)
[ RUN ] Parameters/TestRpc.TestRpcHandlerLatencyMetric/SSL_UnixSocket
I20260925 02:22:54.434684 18019 acceptor_pool.cc:254] collecting diagnostics on the listening RPC socket unix:/tmp/dist-test-task6PYWmC/test-tmp/rpc-test-2970ba32706c4614bcd877738d361ac7.sock every 8 connection(s)
I20260925 02:22:54.434698 18020 acceptor_pool.cc:254] collecting diagnostics on the listening RPC socket unix:/tmp/dist-test-task6PYWmC/test-tmp/rpc-test-2970ba32706c4614bcd877738d361ac7.sock every 8 connection(s)
I20260925 02:22:54.482568 17702 rpc-test.cc:1236] Sleep() min lat: 20289
I20260925 02:22:54.482635 17702 rpc-test.cc:1237] Sleep() mean lat: 20289
I20260925 02:22:54.482659 17702 rpc-test.cc:1238] Sleep() max lat: 20289
I20260925 02:22:54.482673 17702 rpc-test.cc:1239] Sleep() #calls: 1
[ OK ] Parameters/TestRpc.TestRpcHandlerLatencyMetric/SSL_UnixSocket (76 ms)
[ RUN ] Parameters/TestRpc.TimedOutOnResponseMetricServiceQueue/SSL_UnixSocket
I20260925 02:22:54.503484 18045 acceptor_pool.cc:254] collecting diagnostics on the listening RPC socket unix:/tmp/dist-test-task6PYWmC/test-tmp/rpc-test-1e130b168bd14571b600d94d139e743c.sock every 8 connection(s)
I20260925 02:22:54.503533 18046 acceptor_pool.cc:254] collecting diagnostics on the listening RPC socket unix:/tmp/dist-test-task6PYWmC/test-tmp/rpc-test-1e130b168bd14571b600d94d139e743c.sock every 8 connection(s)
W20260925 02:22:54.565115 18047 rpcz_store.cc:267] Call kudu.rpc_test.CalculatorService.Sleep from unix:<unnamed> (request call id 2) took 20 ms (client timeout 20 ms). Trace:
W20260925 02:22:54.565241 18047 rpcz_store.cc:269] 0925 02:22:54.544859 (+ 0us) service_pool.cc:170] Inserting onto call queue
0925 02:22:54.565082 (+ 20223us) service_pool.cc:214] Skipping call since client already timed out
0925 02:22:54.565095 (+ 13us) inbound_call.cc:173] Queueing failure response
Metrics: {}
[ OK ] Parameters/TestRpc.TimedOutOnResponseMetricServiceQueue/SSL_UnixSocket (82 ms)
[ RUN ] Parameters/TestRpc.RpcPendingConnectionsMetric/SSL_UnixSocket
I20260925 02:22:54.568876 18068 acceptor_pool.cc:254] collecting diagnostics on the listening RPC socket 0.0.0.0:46877 every 8 connection(s)
I20260925 02:22:54.568959 18069 acceptor_pool.cc:254] collecting diagnostics on the listening RPC socket 0.0.0.0:46877 every 8 connection(s)
W20260925 02:22:54.569640 18064 negotiation.cc:337] Failed RPC negotiation. Trace:
0925 02:22:54.569458 (+ 0us) reactor.cc:625] Submitting negotiation task for server connection from 127.0.0.1:53798 (local address 127.0.0.1:46877)
0925 02:22:54.569508 (+ 50us) server_negotiation.cc:206] Beginning negotiation
0925 02:22:54.569510 (+ 2us) server_negotiation.cc:399] Waiting for connection header
0925 02:22:54.569588 (+ 78us) negotiation.cc:327] Negotiation complete: Network error: Server connection negotiation failed: server connection from 127.0.0.1:53798: BlockingRecv error: recv got EOF from 127.0.0.1:53798 (error 108)
Metrics: {"server-negotiator.queue_time_us":22}
[ OK ] Parameters/TestRpc.RpcPendingConnectionsMetric/SSL_UnixSocket (13 ms)
[ RUN ] Parameters/TestRpc.TestRpcContextClientDeadline/SSL_UnixSocket
I20260925 02:22:54.595763 18084 acceptor_pool.cc:254] collecting diagnostics on the listening RPC socket unix:/tmp/dist-test-task6PYWmC/test-tmp/rpc-test-2678ff9bcb694a1392167588cb30b845.sock every 8 connection(s)
I20260925 02:22:54.595877 18085 acceptor_pool.cc:254] collecting diagnostics on the listening RPC socket unix:/tmp/dist-test-task6PYWmC/test-tmp/rpc-test-2678ff9bcb694a1392167588cb30b845.sock every 8 connection(s)
[ OK ] Parameters/TestRpc.TestRpcContextClientDeadline/SSL_UnixSocket (52 ms)
[ RUN ] Parameters/TestRpc.TestApplicationFeatureFlagUnsupportedServer/SSL_UnixSocket
I20260925 02:22:54.646543 18109 acceptor_pool.cc:254] collecting diagnostics on the listening RPC socket unix:/tmp/dist-test-task6PYWmC/test-tmp/rpc-test-583a52fc30f040f097062de91504ebd9.sock every 8 connection(s)
I20260925 02:22:54.646605 18110 acceptor_pool.cc:254] collecting diagnostics on the listening RPC socket unix:/tmp/dist-test-task6PYWmC/test-tmp/rpc-test-583a52fc30f040f097062de91504ebd9.sock every 8 connection(s)
W20260925 02:22:54.663250 18106 connection.cc:196] Error closing socket: Network error: TlsSocket::Close: Broken pipe
[ OK ] Parameters/TestRpc.TestApplicationFeatureFlagUnsupportedServer/SSL_UnixSocket (31 ms)
[ RUN ] Parameters/TestRpc.TestCancellationAsync/SSL_UnixSocket
I20260925 02:22:54.689276 18134 acceptor_pool.cc:254] collecting diagnostics on the listening RPC socket unix:/tmp/dist-test-task6PYWmC/test-tmp/rpc-test-5dce4d8316184e0d8333d0cd4eaad690.sock every 8 connection(s)
I20260925 02:22:54.689337 18135 acceptor_pool.cc:254] collecting diagnostics on the listening RPC socket unix:/tmp/dist-test-task6PYWmC/test-tmp/rpc-test-5dce4d8316184e0d8333d0cd4eaad690.sock every 8 connection(s)
I20260925 02:22:54.689574 17702 rpc-test.cc:1716] Connecting to unix:/tmp/dist-test-task6PYWmC/test-tmp/rpc-test-5dce4d8316184e0d8333d0cd4eaad690.sock
I20260925 02:22:54.702762 17702 test_util.cc:268] Using random seed: 1691940008
I20260925 02:22:54.717111 18138 rpc-test-base.h:240] got call: sleep_micros: 500 pattern: 4294967295 num_repetitions: 2097152 sidecar_idx: 0
I20260925 02:22:54.727880 18138 rpc-test-base.h:240] got call: sleep_micros: 500 pattern: 4294967295 num_repetitions: 2097152 sidecar_idx: 0
I20260925 02:22:54.741320 18138 rpc-test-base.h:240] got call: sleep_micros: 500 pattern: 4294967295 num_repetitions: 2097152 sidecar_idx: 0
I20260925 02:22:54.753201 18138 rpc-test-base.h:240] got call: sleep_micros: 500 pattern: 4294967295 num_repetitions: 2097152 sidecar_idx: 0
I20260925 02:22:54.764479 18138 rpc-test-base.h:240] got call: sleep_micros: 500 pattern: 4294967295 num_repetitions: 2097152 sidecar_idx: 0
I20260925 02:22:54.775327 18138 rpc-test-base.h:240] got call: sleep_micros: 500 pattern: 4294967295 num_repetitions: 2097152 sidecar_idx: 0
I20260925 02:22:54.785642 18138 rpc-test-base.h:240] got call: sleep_micros: 500 pattern: 4294967295 num_repetitions: 2097152 sidecar_idx: 0
I20260925 02:22:54.795714 18138 rpc-test-base.h:240] got call: sleep_micros: 500 pattern: 4294967295 num_repetitions: 2097152 sidecar_idx: 0
W20260925 02:22:54.796955 18131 connection.cc:196] Error closing socket: Network error: TlsSocket::Close: Broken pipe
W20260925 02:22:54.798729 18131 connection.cc:441] server connection from unix:<unnamed> torn down before Call kudu.rpc.GenericCalculatorService.SleepWithSidecar from unix:<unnamed> (request call id 9) could send its response
[ OK ] Parameters/TestRpc.TestCancellationAsync/SSL_UnixSocket (135 ms)
[ RUN ] Parameters/TestRpc.TestPerformanceBySocketType/SSL_UnixSocket
I20260925 02:22:54.806197 18159 acceptor_pool.cc:254] collecting diagnostics on the listening RPC socket unix:/tmp/dist-test-task6PYWmC/test-tmp/rpc-test-f8f8db266e80467da3fd5ff20b3b74e4.sock every 8 connection(s)
I20260925 02:22:54.806264 18160 acceptor_pool.cc:254] collecting diagnostics on the listening RPC socket unix:/tmp/dist-test-task6PYWmC/test-tmp/rpc-test-f8f8db266e80467da3fd5ff20b3b74e4.sock every 8 connection(s)
I20260925 02:22:54.806438 17702 rpc-test.cc:1846] Connecting to unix:/tmp/dist-test-task6PYWmC/test-tmp/rpc-test-f8f8db266e80467da3fd5ff20b3b74e4.sock
I20260925 02:22:56.029923 17702 rpc-test.cc:1859] Sending 1024MB via ssl-enabled unix socket: real 1.201s user 1.376s sys 0.790s
I20260925 02:22:57.182950 17702 rpc-test.cc:1859] Sending 1024MB via ssl-enabled unix socket: real 1.153s user 1.269s sys 0.817s
I20260925 02:22:58.415901 17702 rpc-test.cc:1859] Sending 1024MB via ssl-enabled unix socket: real 1.233s user 1.345s sys 0.880s
I20260925 02:22:59.703595 17702 rpc-test.cc:1859] Sending 1024MB via ssl-enabled unix socket: real 1.288s user 1.471s sys 0.852s
I20260925 02:23:00.930420 17702 rpc-test.cc:1859] Sending 1024MB via ssl-enabled unix socket: real 1.227s user 1.256s sys 0.942s
W20260925 02:23:00.931221 18156 connection.cc:196] Error closing socket: Network error: TlsSocket::Close: Broken pipe
[ OK ] Parameters/TestRpc.TestPerformanceBySocketType/SSL_UnixSocket (6132 ms)
[----------] 20 tests from Parameters/TestRpc (28225 ms total)
[----------] 1 test from Parameters/TestRpcSocketTxRxQueue
[ RUN ] Parameters/TestRpcSocketTxRxQueue.AcceptorRxQueueSizeMetric/0
I20260925 02:23:00.933946 18184 acceptor_pool.cc:254] collecting diagnostics on the listening RPC socket 0.0.0.0:36057 every 1 connection(s)
I20260925 02:23:00.934010 18185 acceptor_pool.cc:254] collecting diagnostics on the listening RPC socket 0.0.0.0:36057 every 1 connection(s)
W20260925 02:23:00.934521 18180 negotiation.cc:337] Failed RPC negotiation. Trace:
0925 02:23:00.934382 (+ 0us) reactor.cc:625] Submitting negotiation task for server connection from 127.0.0.1:59944 (local address 127.0.0.1:36057)
0925 02:23:00.934421 (+ 39us) server_negotiation.cc:206] Beginning negotiation
0925 02:23:00.934423 (+ 2us) server_negotiation.cc:399] Waiting for connection header
0925 02:23:00.934492 (+ 69us) negotiation.cc:327] Negotiation complete: Network error: Server connection negotiation failed: server connection from 127.0.0.1:59944: BlockingRecv error: recv got EOF from 127.0.0.1:59944 (error 108)
Metrics: {"server-negotiator.queue_time_us":15}
[ OK ] Parameters/TestRpcSocketTxRxQueue.AcceptorRxQueueSizeMetric/0 (4 ms)
[----------] 1 test from Parameters/TestRpcSocketTxRxQueue (4 ms total)
[----------] Global test environment tear-down
[==========] 21 tests from 2 test suites ran. (28230 ms total)
[ PASSED ] 20 tests.
[ FAILED ] 1 test, listed below:
[ FAILED ] Parameters/TestRpc.TestCallWithChainCertAndChainCA/SSL_UnixSocket, where GetParam() = (true, true)
1 FAILED TEST