Diagnosed failure

Parameters/TestRpc.TestCallWithChainCertAndChainCA/SSL_TCP: /data0/somelongdirectorytoavoidrpathissues/src/kudu/src/kudu/rpc/rpc-test.cc:270: Failure
Failed
Bad status: Runtime error: could not verify certificate chain (error with cert: subject=CN = localhost, ST = sadfjas, C = AS, emailAddress = sdflkdsajf, O = lskdfjlsad, OU = sldfkja, issuer=C = AS, ST = ASDfkjdhf, L = lskdjf, O = saldfja, OU = skdjf, CN = localhost, emailAddress = sadjflkadsj): : certificate has expired
Google Test trace:
/data0/somelongdirectorytoavoidrpathissues/src/kudu/src/kudu/rpc/rpc-test.cc:267: Connecting to 0.0.0.0:32813
I20260927 10:41:02.722174   383 test_util.cc:175] -----------------------------------------------
I20260927 10:41:02.722235   383 test_util.cc:176] Had fatal failures, leaving test files at /tmp/dist-test-taskWLzmAc/test-tmp/rpc-test.5.Parameters_TestRpc.TestCallWithChainCertAndChainCA_SSL_TCP.1790505662631079-383-0

Full log

Note: This is test shard 6 of 8.
[==========] Running 21 tests from 2 test suites.
[----------] Global test environment set-up.
[----------] 20 tests from Parameters/TestRpc
[ RUN      ] Parameters/TestRpc.TestMessengerCreateDestroy/SSL_TCP
WARNING: Logging before InitGoogleLogging() is written to STDERR
I20260927 10:41:02.673198   383 rpc-test.cc:169] started messenger TestCreateDestroy
[       OK ] Parameters/TestRpc.TestMessengerCreateDestroy/SSL_TCP (37 ms)
[ RUN      ] Parameters/TestRpc.TestNegotiationDeadlock/SSL_TCP
I20260927 10:41:02.687282   404 acceptor_pool.cc:254] collecting diagnostics on the listening RPC socket 0.0.0.0:40259 every 8 connection(s)
I20260927 10:41:02.687282   403 acceptor_pool.cc:254] collecting diagnostics on the listening RPC socket 0.0.0.0:40259 every 8 connection(s)
[       OK ] Parameters/TestRpc.TestNegotiationDeadlock/SSL_TCP (23 ms)
[ RUN      ] Parameters/TestRpc.TestCallWithChainCertAndChainCA/SSL_TCP
I20260927 10:41:02.714002   419 acceptor_pool.cc:254] collecting diagnostics on the listening RPC socket 0.0.0.0:32813 every 8 connection(s)
I20260927 10:41:02.714222   420 acceptor_pool.cc:254] collecting diagnostics on the listening RPC socket 0.0.0.0:32813 every 8 connection(s)
/data0/somelongdirectorytoavoidrpathissues/src/kudu/src/kudu/rpc/rpc-test.cc:270: Failure
Failed
Bad status: Runtime error: could not verify certificate chain (error with cert: subject=CN = localhost, ST = sadfjas, C = AS, emailAddress = sdflkdsajf, O = lskdfjlsad, OU = sldfkja, issuer=C = AS, ST = ASDfkjdhf, L = lskdjf, O = saldfja, OU = skdjf, CN = localhost, emailAddress = sadjflkadsj): : certificate has expired
Google Test trace:
/data0/somelongdirectorytoavoidrpathissues/src/kudu/src/kudu/rpc/rpc-test.cc:267: Connecting to 0.0.0.0:32813
I20260927 10:41:02.722174   383 test_util.cc:175] -----------------------------------------------
I20260927 10:41:02.722235   383 test_util.cc:176] Had fatal failures, leaving test files at /tmp/dist-test-taskWLzmAc/test-tmp/rpc-test.5.Parameters_TestRpc.TestCallWithChainCertAndChainCA_SSL_TCP.1790505662631079-383-0
[  FAILED  ] Parameters/TestRpc.TestCallWithChainCertAndChainCA/SSL_TCP, where GetParam() = (true, false) (23 ms)
[ RUN      ] Parameters/TestRpc.TestCallWithPasswordProtectedKey/SSL_TCP
I20260927 10:41:02.751276   444 acceptor_pool.cc:254] collecting diagnostics on the listening RPC socket 0.0.0.0:37895 every 8 connection(s)
I20260927 10:41:02.751307   445 acceptor_pool.cc:254] collecting diagnostics on the listening RPC socket 0.0.0.0:37895 every 8 connection(s)
[       OK ] Parameters/TestRpc.TestCallWithPasswordProtectedKey/SSL_TCP (44 ms)
[ RUN      ] Parameters/TestRpc.TestCallToBadServer/SSL_TCP
I20260927 10:41:02.776659   383 rpc-test.cc:394] Status: Network error: Client connection negotiation failed: client connection to 0.0.0.0:0: connect: Connection refused (error 111)
I20260927 10:41:02.777226   383 rpc-test.cc:394] Status: Network error: Client connection negotiation failed: client connection to 0.0.0.0:0: connect: Connection refused (error 111)
I20260927 10:41:02.777635   383 rpc-test.cc:394] Status: Network error: Client connection negotiation failed: client connection to 0.0.0.0:0: connect: Connection refused (error 111)
I20260927 10:41:02.778049   383 rpc-test.cc:394] Status: Network error: Client connection negotiation failed: client connection to 0.0.0.0:0: connect: Connection refused (error 111)
I20260927 10:41:02.778465   383 rpc-test.cc:394] Status: Network error: Client connection negotiation failed: client connection to 0.0.0.0:0: connect: Connection refused (error 111)
[       OK ] Parameters/TestRpc.TestCallToBadServer/SSL_TCP (12 ms)
[ RUN      ] Parameters/TestRpc.TestWrongService/SSL_TCP
I20260927 10:41:02.795097   479 acceptor_pool.cc:254] collecting diagnostics on the listening RPC socket 0.0.0.0:35269 every 8 connection(s)
I20260927 10:41:02.795145   480 acceptor_pool.cc:254] collecting diagnostics on the listening RPC socket 0.0.0.0:35269 every 8 connection(s)
I20260927 10:41:02.834390   477 messenger.cc:345] service WrongServiceName not registered on TestServer
[       OK ] Parameters/TestRpc.TestWrongService/SSL_TCP (57 ms)
[ RUN      ] Parameters/TestRpc.TestConnectionKeepalive/SSL_TCP
I20260927 10:41:02.866477   502 acceptor_pool.cc:254] collecting diagnostics on the listening RPC socket 0.0.0.0:36991 every 8 connection(s)
I20260927 10:41:02.866494   503 acceptor_pool.cc:254] collecting diagnostics on the listening RPC socket 0.0.0.0:36991 every 8 connection(s)
I20260927 10:41:02.866779   383 rpc-test.cc:488] Connecting to 0.0.0.0:36991
[       OK ] Parameters/TestRpc.TestConnectionKeepalive/SSL_TCP (1057 ms)
[ RUN      ] Parameters/TestRpc.TestClientConnectionMetrics/SSL_TCP
I20260927 10:41:03.918028   527 acceptor_pool.cc:254] collecting diagnostics on the listening RPC socket 0.0.0.0:46173 every 8 connection(s)
I20260927 10:41:03.918066   528 acceptor_pool.cc:254] collecting diagnostics on the listening RPC socket 0.0.0.0:46173 every 8 connection(s)
I20260927 10:41:03.918339   383 rpc-test.cc:569] Connecting to 0.0.0.0:46173
[       OK ] Parameters/TestRpc.TestClientConnectionMetrics/SSL_TCP (14968 ms)
[ RUN      ] Parameters/TestRpc.TestCredentialsPolicy/SSL_TCP
I20260927 10:41:18.877432   550 acceptor_pool.cc:254] collecting diagnostics on the listening RPC socket 0.0.0.0:43041 every 8 connection(s)
I20260927 10:41:18.877563   551 acceptor_pool.cc:254] collecting diagnostics on the listening RPC socket 0.0.0.0:43041 every 8 connection(s)
I20260927 10:41:18.877856   383 rpc-test.cc:700] Connecting to 0.0.0.0:43041
[       OK ] Parameters/TestRpc.TestCredentialsPolicy/SSL_TCP (49 ms)
[ RUN      ] Parameters/TestRpc.TestCallLongerThanKeepalive/SSL_TCP
I20260927 10:41:18.926779   576 acceptor_pool.cc:254] collecting diagnostics on the listening RPC socket 0.0.0.0:45771 every 8 connection(s)
I20260927 10:41:18.926752   575 acceptor_pool.cc:254] collecting diagnostics on the listening RPC socket 0.0.0.0:45771 every 8 connection(s)
I20260927 10:41:18.951025   579 rpc-test-base.h:222] got call: sleep_micros: 3000000 deferred: true
I20260927 10:41:21.951958   579 rpcz_store.cc:275] Call kudu.rpc.GenericCalculatorService.Sleep from 127.0.0.1:53908 (request call id 0) took 3001 ms. Trace:
I20260927 10:41:21.952090   579 rpcz_store.cc:276] 0927 10:41:18.950919 (+     0us) service_pool.cc:170] Inserting onto call queue
0927 10:41:18.950991 (+    72us) service_pool.cc:227] Handling call
0927 10:41:21.951938 (+3000947us) inbound_call.cc:173] Queueing success response
Metrics: {}
[       OK ] Parameters/TestRpc.TestCallLongerThanKeepalive/SSL_TCP (3043 ms)
[ RUN      ] Parameters/TestRpc.TestRpcSidecar/SSL_TCP
I20260927 10:41:21.964697   600 acceptor_pool.cc:254] collecting diagnostics on the listening RPC socket 0.0.0.0:42765 every 8 connection(s)
I20260927 10:41:21.964812   601 acceptor_pool.cc:254] collecting diagnostics on the listening RPC socket 0.0.0.0:42765 every 8 connection(s)
[       OK ] Parameters/TestRpc.TestRpcSidecar/SSL_TCP (82 ms)
[ RUN      ] Parameters/TestRpc.TestRpcSidecarLimits/SSL_TCP
I20260927 10:41:23.772220   625 acceptor_pool.cc:254] collecting diagnostics on the listening RPC socket 0.0.0.0:43793 every 8 connection(s)
I20260927 10:41:23.772277   626 acceptor_pool.cc:254] collecting diagnostics on the listening RPC socket 0.0.0.0:43793 every 8 connection(s)
W20260927 10:41:23.784548   383 serialization.cc:72] Serialized kudu.rpc_test.PushStringsRequestPB (2147483654 bytes) is larger than the maximum configured RPC message size (52428800 bytes). Sending anyway, but peer may reject the data.
W20260927 10:41:23.788870   622 connection.cc:535] server connection from 127.0.0.1:50830 recv error: Network error: RPC frame had a length of 2147483714, but we only support messages up to 52428800 bytes long.
W20260927 10:41:23.788966   622 connection.cc:158] shutting down server connection from 127.0.0.1:50830 with pending inbound data: 4/2147483714 bytes received; last active 0 ns ago: status Network error: RPC frame had a length of 2147483714, but we only support messages up to 52428800 bytes long.
W20260927 10:41:23.789278   638 connection.cc:196] Error closing socket: Network error: TlsSocket::Close: Connection reset by peer
I20260927 10:41:23.810212   650 acceptor_pool.cc:254] collecting diagnostics on the listening RPC socket 0.0.0.0:35131 every 8 connection(s)
I20260927 10:41:23.810261   651 acceptor_pool.cc:254] collecting diagnostics on the listening RPC socket 0.0.0.0:35131 every 8 connection(s)
W20260927 10:41:28.142755   648 connection.cc:577] server connection from 127.0.0.1:43410: received bad data: 'Corruption: Invalid packet: message had a length of 2147483710, but we only support messages up to 2147483647 bytes
'
[       OK ] Parameters/TestRpc.TestRpcSidecarLimits/SSL_TCP (6108 ms)
[ RUN      ] Parameters/TestRpc.TestCallTimeoutDoesntAffectNegotiation/SSL_TCP
I20260927 10:41:28.186183   675 acceptor_pool.cc:254] collecting diagnostics on the listening RPC socket 0.0.0.0:44621 every 8 connection(s)
I20260927 10:41:28.186210   676 acceptor_pool.cc:254] collecting diagnostics on the listening RPC socket 0.0.0.0:44621 every 8 connection(s)
W20260927 10:41:28.191366   671 negotiation.cc:266] Injecting 500ms delay in negotiation
I20260927 10:41:28.241714   383 rpc-test-base.h:595] status: Timed out: connection negotiation to 0.0.0.0:44621 for RPC Sleep timed out after 0.050s (ON_OUTBOUND_QUEUE), seconds elapsed: 0.0507999
[       OK ] Parameters/TestRpc.TestCallTimeoutDoesntAffectNegotiation/SSL_TCP (551 ms)
[ RUN      ] Parameters/TestRpc.TestRpcHandlerLatencyMetric/SSL_TCP
I20260927 10:41:28.716849   700 acceptor_pool.cc:254] collecting diagnostics on the listening RPC socket 0.0.0.0:45969 every 8 connection(s)
I20260927 10:41:28.716890   701 acceptor_pool.cc:254] collecting diagnostics on the listening RPC socket 0.0.0.0:45969 every 8 connection(s)
I20260927 10:41:28.754751   383 rpc-test.cc:1236] Sleep() min lat: 20376
I20260927 10:41:28.754827   383 rpc-test.cc:1237] Sleep() mean lat: 20376
I20260927 10:41:28.754858   383 rpc-test.cc:1238] Sleep() max lat: 20376
I20260927 10:41:28.754871   383 rpc-test.cc:1239] Sleep() #calls: 1
[       OK ] Parameters/TestRpc.TestRpcHandlerLatencyMetric/SSL_TCP (59 ms)
[ RUN      ] Parameters/TestRpc.TimedOutOnResponseMetricServiceQueue/SSL_TCP
I20260927 10:41:28.777293   726 acceptor_pool.cc:254] collecting diagnostics on the listening RPC socket 0.0.0.0:42377 every 8 connection(s)
I20260927 10:41:28.777331   727 acceptor_pool.cc:254] collecting diagnostics on the listening RPC socket 0.0.0.0:42377 every 8 connection(s)
W20260927 10:41:28.836874   728 rpcz_store.cc:267] Call kudu.rpc_test.CalculatorService.Sleep from 127.0.0.1:45140 (request call id 2) took 20 ms (client timeout 20 ms). Trace:
W20260927 10:41:28.837019   728 rpcz_store.cc:269] 0927 10:41:28.816495 (+     0us) service_pool.cc:170] Inserting onto call queue
0927 10:41:28.836817 (+ 20322us) service_pool.cc:214] Skipping call since client already timed out
0927 10:41:28.836855 (+    38us) inbound_call.cc:173] Queueing failure response
Metrics: {}
[       OK ] Parameters/TestRpc.TimedOutOnResponseMetricServiceQueue/SSL_TCP (81 ms)
[ RUN      ] Parameters/TestRpc.RpcPendingConnectionsMetric/SSL_TCP
I20260927 10:41:28.841315   749 acceptor_pool.cc:254] collecting diagnostics on the listening RPC socket 0.0.0.0:46113 every 8 connection(s)
I20260927 10:41:28.841365   750 acceptor_pool.cc:254] collecting diagnostics on the listening RPC socket 0.0.0.0:46113 every 8 connection(s)
W20260927 10:41:28.851217   745 negotiation.cc:337] Failed RPC negotiation. Trace:
0927 10:41:28.850605 (+     0us) reactor.cc:625] Submitting negotiation task for server connection from 127.0.0.1:38350 (local address 127.0.0.1:46113)
0927 10:41:28.850749 (+   144us) server_negotiation.cc:206] Beginning negotiation
0927 10:41:28.850755 (+     6us) server_negotiation.cc:399] Waiting for connection header
0927 10:41:28.850920 (+   165us) negotiation.cc:327] Negotiation complete: Network error: Server connection negotiation failed: server connection from 127.0.0.1:38350: BlockingRecv error: recv got EOF from 127.0.0.1:38350 (error 108)
Metrics: {"server-negotiator.queue_time_us":53}
[       OK ] Parameters/TestRpc.RpcPendingConnectionsMetric/SSL_TCP (22 ms)
[ RUN      ] Parameters/TestRpc.TestRpcContextClientDeadline/SSL_TCP
I20260927 10:41:28.871233   765 acceptor_pool.cc:254] collecting diagnostics on the listening RPC socket 0.0.0.0:38679 every 8 connection(s)
I20260927 10:41:28.871269   766 acceptor_pool.cc:254] collecting diagnostics on the listening RPC socket 0.0.0.0:38679 every 8 connection(s)
[       OK ] Parameters/TestRpc.TestRpcContextClientDeadline/SSL_TCP (51 ms)
[ RUN      ] Parameters/TestRpc.TestApplicationFeatureFlagUnsupportedServer/SSL_TCP
I20260927 10:41:28.924292   790 acceptor_pool.cc:254] collecting diagnostics on the listening RPC socket 0.0.0.0:33421 every 8 connection(s)
I20260927 10:41:28.924331   791 acceptor_pool.cc:254] collecting diagnostics on the listening RPC socket 0.0.0.0:33421 every 8 connection(s)
[       OK ] Parameters/TestRpc.TestApplicationFeatureFlagUnsupportedServer/SSL_TCP (44 ms)
[ RUN      ] Parameters/TestRpc.TestCancellationAsync/SSL_TCP
I20260927 10:41:28.973366   815 acceptor_pool.cc:254] collecting diagnostics on the listening RPC socket 0.0.0.0:34533 every 8 connection(s)
I20260927 10:41:28.973410   816 acceptor_pool.cc:254] collecting diagnostics on the listening RPC socket 0.0.0.0:34533 every 8 connection(s)
I20260927 10:41:28.973707   383 rpc-test.cc:1716] Connecting to 0.0.0.0:34533
I20260927 10:41:28.985746   383 test_util.cc:268] Using random seed: -1752207216
I20260927 10:41:29.005775   819 rpc-test-base.h:240] got call: sleep_micros: 500 pattern: 4294967295 num_repetitions: 2097152 sidecar_idx: 0
I20260927 10:41:29.025059   818 rpc-test-base.h:240] got call: sleep_micros: 500 pattern: 4294967295 num_repetitions: 2097152 sidecar_idx: 0
I20260927 10:41:29.042516   819 rpc-test-base.h:240] got call: sleep_micros: 500 pattern: 4294967295 num_repetitions: 2097152 sidecar_idx: 0
I20260927 10:41:29.062045   818 rpc-test-base.h:240] got call: sleep_micros: 500 pattern: 4294967295 num_repetitions: 2097152 sidecar_idx: 0
I20260927 10:41:29.079854   819 rpc-test-base.h:240] got call: sleep_micros: 500 pattern: 4294967295 num_repetitions: 2097152 sidecar_idx: 0
I20260927 10:41:29.100404   818 rpc-test-base.h:240] got call: sleep_micros: 500 pattern: 4294967295 num_repetitions: 2097152 sidecar_idx: 0
I20260927 10:41:29.118489   819 rpc-test-base.h:240] got call: sleep_micros: 500 pattern: 4294967295 num_repetitions: 2097152 sidecar_idx: 0
W20260927 10:41:29.125007   813 connection.cc:441] server connection from 127.0.0.1:59166 torn down before Call kudu.rpc.GenericCalculatorService.SleepWithSidecar from 127.0.0.1:59166 (request call id 8) could send its response
W20260927 10:41:29.136185   813 connection.cc:441] server connection from 127.0.0.1:59166 torn down before Call kudu.rpc.GenericCalculatorService.SleepWithSidecar from 127.0.0.1:59166 (request call id 9) could send its response
[       OK ] Parameters/TestRpc.TestCancellationAsync/SSL_TCP (179 ms)
[ RUN      ] Parameters/TestRpc.TestPerformanceBySocketType/SSL_TCP
I20260927 10:41:29.152846   840 acceptor_pool.cc:254] collecting diagnostics on the listening RPC socket 0.0.0.0:33373 every 8 connection(s)
I20260927 10:41:29.152882   841 acceptor_pool.cc:254] collecting diagnostics on the listening RPC socket 0.0.0.0:33373 every 8 connection(s)
I20260927 10:41:29.153177   383 rpc-test.cc:1846] Connecting to 0.0.0.0:33373
I20260927 10:41:31.467905   383 rpc-test.cc:1859] Sending 1024MB via ssl-enabled tcp socket: real 2.297s	user 2.330s	sys 1.732s
I20260927 10:41:33.670668   383 rpc-test.cc:1859] Sending 1024MB via ssl-enabled tcp socket: real 2.203s	user 2.337s	sys 1.567s
I20260927 10:41:35.966282   383 rpc-test.cc:1859] Sending 1024MB via ssl-enabled tcp socket: real 2.296s	user 2.448s	sys 1.570s
I20260927 10:41:38.268980   383 rpc-test.cc:1859] Sending 1024MB via ssl-enabled tcp socket: real 2.303s	user 2.422s	sys 1.611s
I20260927 10:41:40.479766   383 rpc-test.cc:1859] Sending 1024MB via ssl-enabled tcp socket: real 2.211s	user 2.215s	sys 1.686s
[       OK ] Parameters/TestRpc.TestPerformanceBySocketType/SSL_TCP (11344 ms)
[----------] 20 tests from Parameters/TestRpc (37844 ms total)

[----------] 1 test from Parameters/TestRpcSocketTxRxQueue
[ RUN      ] Parameters/TestRpcSocketTxRxQueue.OverCapacity/0
W20260927 10:41:40.755726   865 negotiation.cc:337] Failed RPC negotiation. Trace:
0927 10:41:40.488847 (+     0us) reactor.cc:625] Submitting negotiation task for client connection to 0.0.0.0:43597 (local address 127.0.0.1:37800)
0927 10:41:40.488952 (+   105us) negotiation.cc:107] Waiting for socket to connect
0927 10:41:40.488965 (+    13us) client_negotiation.cc:174] Beginning negotiation
0927 10:41:40.489044 (+    79us) client_negotiation.cc:252] Sending NEGOTIATE NegotiatePB request
0927 10:41:40.755493 (+266449us) negotiation.cc:327] Negotiation complete: Network error: Client connection negotiation failed: client connection to 0.0.0.0:43597: BlockingRecv error: recv error from unknown peer: Transport endpoint is not connected (error 107)
Metrics: {"client-negotiator.queue_time_us":41}
W20260927 10:41:40.755832   857 negotiation.cc:337] Failed RPC negotiation. Trace:
0927 10:41:40.487722 (+     0us) reactor.cc:625] Submitting negotiation task for client connection to 0.0.0.0:43597 (local address 127.0.0.1:37786)
0927 10:41:40.487862 (+   140us) negotiation.cc:107] Waiting for socket to connect
0927 10:41:40.487880 (+    18us) client_negotiation.cc:174] Beginning negotiation
0927 10:41:40.487982 (+   102us) client_negotiation.cc:252] Sending NEGOTIATE NegotiatePB request
0927 10:41:40.755493 (+267511us) negotiation.cc:327] Negotiation complete: Network error: Client connection negotiation failed: client connection to 0.0.0.0:43597: BlockingRecv error: recv error from unknown peer: Transport endpoint is not connected (error 107)
Metrics: {"client-negotiator.queue_time_us":43}
W20260927 10:41:40.755927   893 negotiation.cc:337] Failed RPC negotiation. Trace:
0927 10:41:40.492447 (+     0us) reactor.cc:625] Submitting negotiation task for client connection to 0.0.0.0:43597 (local address 127.0.0.1:37836)
0927 10:41:40.492554 (+   107us) negotiation.cc:107] Waiting for socket to connect
0927 10:41:40.492567 (+    13us) client_negotiation.cc:174] Beginning negotiation
0927 10:41:40.492639 (+    72us) client_negotiation.cc:252] Sending NEGOTIATE NegotiatePB request
0927 10:41:40.755861 (+263222us) negotiation.cc:327] Negotiation complete: Network error: Client connection negotiation failed: client connection to 0.0.0.0:43597: BlockingRecv error: recv error from unknown peer: Transport endpoint is not connected (error 107)
Metrics: {"client-negotiator.queue_time_us":46}
W20260927 10:41:40.755754   875 negotiation.cc:337] Failed RPC negotiation. Trace:
0927 10:41:40.490060 (+     0us) reactor.cc:625] Submitting negotiation task for client connection to 0.0.0.0:43597 (local address 127.0.0.1:37812)
0927 10:41:40.490168 (+   108us) negotiation.cc:107] Waiting for socket to connect
0927 10:41:40.490180 (+    12us) client_negotiation.cc:174] Beginning negotiation
0927 10:41:40.490252 (+    72us) client_negotiation.cc:252] Sending NEGOTIATE NegotiatePB request
0927 10:41:40.755493 (+265241us) negotiation.cc:327] Negotiation complete: Network error: Client connection negotiation failed: client connection to 0.0.0.0:43597: BlockingRecv error: recv error from unknown peer: Transport endpoint is not connected (error 107)
Metrics: {"client-negotiator.queue_time_us":44}
W20260927 10:41:40.755754   902 negotiation.cc:337] Failed RPC negotiation. Trace:
0927 10:41:40.493573 (+     0us) reactor.cc:625] Submitting negotiation task for client connection to 0.0.0.0:43597 (local address 127.0.0.1:37840)
0927 10:41:40.493674 (+   101us) negotiation.cc:107] Waiting for socket to connect
0927 10:41:40.493697 (+    23us) client_negotiation.cc:174] Beginning negotiation
0927 10:41:40.493783 (+    86us) client_negotiation.cc:252] Sending NEGOTIATE NegotiatePB request
0927 10:41:40.755704 (+261921us) negotiation.cc:327] Negotiation complete: Network error: Client connection negotiation failed: client connection to 0.0.0.0:43597: BlockingRecv error: recv error from unknown peer: Transport endpoint is not connected (error 107)
Metrics: {"client-negotiator.queue_time_us":25}
W20260927 10:41:40.756557   884 negotiation.cc:337] Failed RPC negotiation. Trace:
0927 10:41:40.491287 (+     0us) reactor.cc:625] Submitting negotiation task for client connection to 0.0.0.0:43597 (local address 127.0.0.1:37822)
0927 10:41:40.491413 (+   126us) negotiation.cc:107] Waiting for socket to connect
0927 10:41:40.491427 (+    14us) client_negotiation.cc:174] Beginning negotiation
0927 10:41:40.491509 (+    82us) client_negotiation.cc:252] Sending NEGOTIATE NegotiatePB request
0927 10:41:40.755493 (+263984us) negotiation.cc:327] Negotiation complete: Network error: Client connection negotiation failed: client connection to 0.0.0.0:43597: BlockingRecv error: recv error from unknown peer: Transport endpoint is not connected (error 107)
Metrics: {"client-negotiator.queue_time_us":46}
[       OK ] Parameters/TestRpcSocketTxRxQueue.OverCapacity/0 (1052 ms)
[----------] 1 test from Parameters/TestRpcSocketTxRxQueue (1052 ms total)

[----------] Global test environment tear-down
[==========] 21 tests from 2 test suites ran. (38896 ms total)
[  PASSED  ] 20 tests.
[  FAILED  ] 1 test, listed below:
[  FAILED  ] Parameters/TestRpc.TestCallWithChainCertAndChainCA/SSL_TCP, where GetParam() = (true, false)

 1 FAILED TEST