Diagnosed failure

Parameters/TestRpc.TestCallWithChainCertAndRootCA/SSL_UnixSocket: /data0/somelongdirectorytoavoidrpathissues/src/kudu/src/kudu/rpc/rpc-test.cc:303: Failure
Failed
Bad status: Runtime error: could not verify certificate chain (error with cert: subject=CN = localhost, ST = sadfjas, C = AS, emailAddress = sdflkdsajf, O = lskdfjlsad, OU = sldfkja, issuer=C = AS, ST = ASDfkjdhf, L = lskdjf, O = saldfja, OU = skdjf, CN = localhost, emailAddress = sadjflkadsj): : certificate has expired
Google Test trace:
/data0/somelongdirectorytoavoidrpathissues/src/kudu/src/kudu/rpc/rpc-test.cc:300: Connecting to unix:/tmp/dist-test-taskYEKzE5/test-tmp/rpc-test-ef9a5453252943e6956bdd91ad678d8e.sock
I20260925 16:41:18.660459 32381 test_util.cc:175] -----------------------------------------------
I20260925 16:41:18.660677 32381 test_util.cc:176] Had fatal failures, leaving test files at /tmp/dist-test-taskYEKzE5/test-tmp/rpc-test.2.Parameters_TestRpc.TestCallWithChainCertAndRootCA_SSL_UnixSocket.1790354475205096-32381-0

Full log

Note: This is test shard 3 of 8.
[==========] Running 21 tests from 2 test suites.
[----------] Global test environment set-up.
[----------] 1 test from TestRpc
[ RUN      ] TestRpc.TestNegotiationTimeout
WARNING: Logging before InitGoogleLogging() is written to STDERR
I20260925 16:41:15.401563 32381 rpc-test-base.h:595] status: Timed out: connection negotiation to 0.0.0.0:38033 for RPC Sleep timed out after 0.100s (ON_OUTBOUND_QUEUE), seconds elapsed: 0.101671
W20260925 16:41:18.323900 32391 negotiation.cc:337] Failed RPC negotiation. Trace:
0925 16:41:15.300944 (+     0us) reactor.cc:625] Submitting negotiation task for client connection to 0.0.0.0:38033 (local address 127.0.0.1:60368)
0925 16:41:15.302223 (+  1279us) negotiation.cc:107] Waiting for socket to connect
0925 16:41:15.302275 (+    52us) client_negotiation.cc:174] Beginning negotiation
0925 16:41:15.315281 (+ 13006us) client_negotiation.cc:252] Sending NEGOTIATE NegotiatePB request
0925 16:41:18.322668 (+3007387us) negotiation.cc:327] Negotiation complete: Timed out: Client connection negotiation failed: client connection to 0.0.0.0:38033: received 0 of 4 requested bytes
Metrics: {"client-negotiator.queue_time_us":249}
[       OK ] TestRpc.TestNegotiationTimeout (3068 ms)
[----------] 1 test from TestRpc (3068 ms total)

[----------] 20 tests from Parameters/TestRpc
[ RUN      ] Parameters/TestRpc.TestAcceptorPoolStartStop/SSL_UnixSocket
I20260925 16:41:18.361534 32407 acceptor_pool.cc:254] collecting diagnostics on the listening RPC socket unix:/tmp/dist-test-taskYEKzE5/test-tmp/rpc-test-70e43d82411d45549c1b0300cd9062b2.sock every 8 connection(s)
I20260925 16:41:18.363307 32408 acceptor_pool.cc:254] collecting diagnostics on the listening RPC socket unix:/tmp/dist-test-taskYEKzE5/test-tmp/rpc-test-70e43d82411d45549c1b0300cd9062b2.sock every 8 connection(s)
I20260925 16:41:18.404525 32418 acceptor_pool.cc:254] collecting diagnostics on the listening RPC socket unix:/tmp/dist-test-taskYEKzE5/test-tmp/rpc-test-70e43d82411d45549c1b0300cd9062b2.sock every 8 connection(s)
I20260925 16:41:18.406530 32419 acceptor_pool.cc:254] collecting diagnostics on the listening RPC socket unix:/tmp/dist-test-taskYEKzE5/test-tmp/rpc-test-70e43d82411d45549c1b0300cd9062b2.sock every 8 connection(s)
I20260925 16:41:18.439116 32429 acceptor_pool.cc:254] collecting diagnostics on the listening RPC socket unix:/tmp/dist-test-taskYEKzE5/test-tmp/rpc-test-70e43d82411d45549c1b0300cd9062b2.sock every 8 connection(s)
I20260925 16:41:18.439919 32430 acceptor_pool.cc:254] collecting diagnostics on the listening RPC socket unix:/tmp/dist-test-taskYEKzE5/test-tmp/rpc-test-70e43d82411d45549c1b0300cd9062b2.sock every 8 connection(s)
I20260925 16:41:18.465914 32440 acceptor_pool.cc:254] collecting diagnostics on the listening RPC socket unix:/tmp/dist-test-taskYEKzE5/test-tmp/rpc-test-70e43d82411d45549c1b0300cd9062b2.sock every 8 connection(s)
I20260925 16:41:18.466638 32441 acceptor_pool.cc:254] collecting diagnostics on the listening RPC socket unix:/tmp/dist-test-taskYEKzE5/test-tmp/rpc-test-70e43d82411d45549c1b0300cd9062b2.sock every 8 connection(s)
I20260925 16:41:18.502465 32451 acceptor_pool.cc:254] collecting diagnostics on the listening RPC socket unix:/tmp/dist-test-taskYEKzE5/test-tmp/rpc-test-70e43d82411d45549c1b0300cd9062b2.sock every 8 connection(s)
I20260925 16:41:18.503316 32452 acceptor_pool.cc:254] collecting diagnostics on the listening RPC socket unix:/tmp/dist-test-taskYEKzE5/test-tmp/rpc-test-70e43d82411d45549c1b0300cd9062b2.sock every 8 connection(s)
[       OK ] Parameters/TestRpc.TestAcceptorPoolStartStop/SSL_UnixSocket (179 ms)
[ RUN      ] Parameters/TestRpc.TestCall/SSL_UnixSocket
I20260925 16:41:18.539803 32464 acceptor_pool.cc:254] collecting diagnostics on the listening RPC socket unix:/tmp/dist-test-taskYEKzE5/test-tmp/rpc-test-856f035ebe7f4ba2a14df231453c6822.sock every 8 connection(s)
I20260925 16:41:18.542229 32465 acceptor_pool.cc:254] collecting diagnostics on the listening RPC socket unix:/tmp/dist-test-taskYEKzE5/test-tmp/rpc-test-856f035ebe7f4ba2a14df231453c6822.sock every 8 connection(s)
I20260925 16:41:18.547966 32381 rpc-test.cc:234] Connecting to unix:/tmp/dist-test-taskYEKzE5/test-tmp/rpc-test-856f035ebe7f4ba2a14df231453c6822.sock
W20260925 16:41:18.603907 32461 connection.cc:196] Error closing socket: Network error: TlsSocket::Close: Broken pipe
[       OK ] Parameters/TestRpc.TestCall/SSL_UnixSocket (101 ms)
[ RUN      ] Parameters/TestRpc.TestCallWithChainCertAndRootCA/SSL_UnixSocket
I20260925 16:41:18.637470 32489 acceptor_pool.cc:254] collecting diagnostics on the listening RPC socket unix:/tmp/dist-test-taskYEKzE5/test-tmp/rpc-test-ef9a5453252943e6956bdd91ad678d8e.sock every 8 connection(s)
I20260925 16:41:18.638420 32490 acceptor_pool.cc:254] collecting diagnostics on the listening RPC socket unix:/tmp/dist-test-taskYEKzE5/test-tmp/rpc-test-ef9a5453252943e6956bdd91ad678d8e.sock every 8 connection(s)
/data0/somelongdirectorytoavoidrpathissues/src/kudu/src/kudu/rpc/rpc-test.cc:303: Failure
Failed
Bad status: Runtime error: could not verify certificate chain (error with cert: subject=CN = localhost, ST = sadfjas, C = AS, emailAddress = sdflkdsajf, O = lskdfjlsad, OU = sldfkja, issuer=C = AS, ST = ASDfkjdhf, L = lskdjf, O = saldfja, OU = skdjf, CN = localhost, emailAddress = sadjflkadsj): : certificate has expired
Google Test trace:
/data0/somelongdirectorytoavoidrpathissues/src/kudu/src/kudu/rpc/rpc-test.cc:300: Connecting to unix:/tmp/dist-test-taskYEKzE5/test-tmp/rpc-test-ef9a5453252943e6956bdd91ad678d8e.sock
I20260925 16:41:18.660459 32381 test_util.cc:175] -----------------------------------------------
I20260925 16:41:18.660677 32381 test_util.cc:176] Had fatal failures, leaving test files at /tmp/dist-test-taskYEKzE5/test-tmp/rpc-test.2.Parameters_TestRpc.TestCallWithChainCertAndRootCA_SSL_UnixSocket.1790354475205096-32381-0
[  FAILED  ] Parameters/TestRpc.TestCallWithChainCertAndRootCA/SSL_UnixSocket, where GetParam() = (true, true) (51 ms)
[ RUN      ] Parameters/TestRpc.TestCallWithBadPasswordProtectedKey/SSL_UnixSocket
[       OK ] Parameters/TestRpc.TestCallWithBadPasswordProtectedKey/SSL_UnixSocket (31 ms)
[ RUN      ] Parameters/TestRpc.TestInvalidMethodCall/SSL_UnixSocket
I20260925 16:41:18.725327 32526 acceptor_pool.cc:254] collecting diagnostics on the listening RPC socket unix:/tmp/dist-test-taskYEKzE5/test-tmp/rpc-test-3f60454d62e645b8a1172c7f63ec8aac.sock every 8 connection(s)
I20260925 16:41:18.726243 32527 acceptor_pool.cc:254] collecting diagnostics on the listening RPC socket unix:/tmp/dist-test-taskYEKzE5/test-tmp/rpc-test-3f60454d62e645b8a1172c7f63ec8aac.sock every 8 connection(s)
I20260925 16:41:18.729888 32381 rpc-test.cc:406] Connecting to unix:/tmp/dist-test-taskYEKzE5/test-tmp/rpc-test-3f60454d62e645b8a1172c7f63ec8aac.sock
[       OK ] Parameters/TestRpc.TestInvalidMethodCall/SSL_UnixSocket (83 ms)
[ RUN      ] Parameters/TestRpc.TestHighFDs/SSL_UnixSocket
I20260925 16:41:19.013917 32551 acceptor_pool.cc:254] collecting diagnostics on the listening RPC socket unix:/tmp/dist-test-taskYEKzE5/test-tmp/rpc-test-083f9283cb744904ac041eae2acf74de.sock every 8 connection(s)
I20260925 16:41:19.014703 32552 acceptor_pool.cc:254] collecting diagnostics on the listening RPC socket unix:/tmp/dist-test-taskYEKzE5/test-tmp/rpc-test-083f9283cb744904ac041eae2acf74de.sock every 8 connection(s)
[       OK ] Parameters/TestRpc.TestHighFDs/SSL_UnixSocket (294 ms)
[ RUN      ] Parameters/TestRpc.TestConnectionAlwaysKeepalive/SSL_UnixSocket
I20260925 16:41:19.088269 32574 acceptor_pool.cc:254] collecting diagnostics on the listening RPC socket unix:/tmp/dist-test-taskYEKzE5/test-tmp/rpc-test-60164fe35ac34c53be2bf50339ff3679.sock every 8 connection(s)
I20260925 16:41:19.089040 32575 acceptor_pool.cc:254] collecting diagnostics on the listening RPC socket unix:/tmp/dist-test-taskYEKzE5/test-tmp/rpc-test-60164fe35ac34c53be2bf50339ff3679.sock every 8 connection(s)
I20260925 16:41:19.092264 32381 rpc-test.cc:532] Connecting to unix:/tmp/dist-test-taskYEKzE5/test-tmp/rpc-test-60164fe35ac34c53be2bf50339ff3679.sock
W20260925 16:41:22.143368 32573 connection.cc:196] Error closing socket: Network error: TlsSocket::Close: Broken pipe
[       OK ] Parameters/TestRpc.TestConnectionAlwaysKeepalive/SSL_UnixSocket (3076 ms)
[ RUN      ] Parameters/TestRpc.TestReopenOutboundConnections/SSL_UnixSocket
I20260925 16:41:22.171784 32597 acceptor_pool.cc:254] collecting diagnostics on the listening RPC socket unix:/tmp/dist-test-taskYEKzE5/test-tmp/rpc-test-8a749bf1c65e40cfa35299dbdb8e6d73.sock every 8 connection(s)
I20260925 16:41:22.172415 32598 acceptor_pool.cc:254] collecting diagnostics on the listening RPC socket unix:/tmp/dist-test-taskYEKzE5/test-tmp/rpc-test-8a749bf1c65e40cfa35299dbdb8e6d73.sock every 8 connection(s)
I20260925 16:41:22.175853 32381 rpc-test.cc:658] Connecting to unix:/tmp/dist-test-taskYEKzE5/test-tmp/rpc-test-8a749bf1c65e40cfa35299dbdb8e6d73.sock
W20260925 16:41:22.212519 32596 connection.cc:196] Error closing socket: Network error: TlsSocket::Close: Broken pipe
W20260925 16:41:22.222935 32596 connection.cc:196] Error closing socket: Network error: TlsSocket::Close: Broken pipe
W20260925 16:41:22.232738 32596 connection.cc:196] Error closing socket: Network error: TlsSocket::Close: Broken pipe
W20260925 16:41:22.242956 32596 connection.cc:196] Error closing socket: Network error: TlsSocket::Close: Broken pipe
W20260925 16:41:22.253255 32596 connection.cc:196] Error closing socket: Network error: TlsSocket::Close: Broken pipe
W20260925 16:41:22.264067 32596 connection.cc:196] Error closing socket: Network error: TlsSocket::Close: Broken pipe
W20260925 16:41:22.274893 32596 connection.cc:196] Error closing socket: Network error: TlsSocket::Close: Broken pipe
W20260925 16:41:22.285555 32596 connection.cc:196] Error closing socket: Network error: TlsSocket::Close: Broken pipe
W20260925 16:41:22.296257 32596 connection.cc:196] Error closing socket: Network error: TlsSocket::Close: Broken pipe
W20260925 16:41:22.306483 32596 connection.cc:196] Error closing socket: Network error: TlsSocket::Close: Broken pipe
W20260925 16:41:22.317812 32596 connection.cc:196] Error closing socket: Network error: TlsSocket::Close: Broken pipe
W20260925 16:41:22.329388 32596 connection.cc:196] Error closing socket: Network error: TlsSocket::Close: Broken pipe
W20260925 16:41:22.341166 32596 connection.cc:196] Error closing socket: Network error: TlsSocket::Close: Broken pipe
W20260925 16:41:22.353543 32596 connection.cc:196] Error closing socket: Network error: TlsSocket::Close: Broken pipe
W20260925 16:41:22.353729 32597 acceptor_pool.cc:285] unable to collect diagnostics on RPC socket unix:/tmp/dist-test-taskYEKzE5/test-tmp/rpc-test-8a749bf1c65e40cfa35299dbdb8e6d73.sock: Not implemented: netlink diagnostics is currently supported only on IPv4 TCP sockets
W20260925 16:41:22.364475 32596 connection.cc:196] Error closing socket: Network error: TlsSocket::Close: Broken pipe
W20260925 16:41:22.375627 32596 connection.cc:196] Error closing socket: Network error: TlsSocket::Close: Broken pipe
W20260925 16:41:22.397215 32596 connection.cc:196] Error closing socket: Network error: TlsSocket::Close: Broken pipe
W20260925 16:41:22.420763 32596 connection.cc:196] Error closing socket: Network error: TlsSocket::Close: Broken pipe
W20260925 16:41:22.432360 32596 connection.cc:196] Error closing socket: Network error: TlsSocket::Close: Broken pipe
W20260925 16:41:22.443420 32596 connection.cc:196] Error closing socket: Network error: TlsSocket::Close: Broken pipe
W20260925 16:41:22.454900 32596 connection.cc:196] Error closing socket: Network error: TlsSocket::Close: Broken pipe
W20260925 16:41:22.465718 32596 connection.cc:196] Error closing socket: Network error: TlsSocket::Close: Broken pipe
W20260925 16:41:22.477249 32596 connection.cc:196] Error closing socket: Network error: TlsSocket::Close: Broken pipe
W20260925 16:41:22.488252 32596 connection.cc:196] Error closing socket: Network error: TlsSocket::Close: Broken pipe
W20260925 16:41:22.500294 32596 connection.cc:196] Error closing socket: Network error: TlsSocket::Close: Broken pipe
W20260925 16:41:22.511025 32596 connection.cc:196] Error closing socket: Network error: TlsSocket::Close: Broken pipe
W20260925 16:41:22.520788 32596 connection.cc:196] Error closing socket: Network error: TlsSocket::Close: Broken pipe
W20260925 16:41:22.530889 32596 connection.cc:196] Error closing socket: Network error: TlsSocket::Close: Broken pipe
W20260925 16:41:22.540100 32596 connection.cc:196] Error closing socket: Network error: TlsSocket::Close: Broken pipe
W20260925 16:41:22.550412 32596 connection.cc:196] Error closing socket: Network error: TlsSocket::Close: Broken pipe
[       OK ] Parameters/TestRpc.TestReopenOutboundConnections/SSL_UnixSocket (406 ms)
[ RUN      ] Parameters/TestRpc.TestConnectionNetworkPlane/SSL_UnixSocket
I20260925 16:41:22.574923 32620 acceptor_pool.cc:254] collecting diagnostics on the listening RPC socket unix:/tmp/dist-test-taskYEKzE5/test-tmp/rpc-test-9cbe3aa58bf047d2b0e0f5bf74f6845f.sock every 8 connection(s)
I20260925 16:41:22.575665 32621 acceptor_pool.cc:254] collecting diagnostics on the listening RPC socket unix:/tmp/dist-test-taskYEKzE5/test-tmp/rpc-test-9cbe3aa58bf047d2b0e0f5bf74f6845f.sock every 8 connection(s)
I20260925 16:41:22.578975 32381 rpc-test.cc:772] Connecting to unix:/tmp/dist-test-taskYEKzE5/test-tmp/rpc-test-9cbe3aa58bf047d2b0e0f5bf74f6845f.sock
W20260925 16:41:22.622794 32619 connection.cc:196] Error closing socket: Network error: TlsSocket::Close: Broken pipe
W20260925 16:41:22.624951 32619 connection.cc:196] Error closing socket: Network error: TlsSocket::Close: Broken pipe
[       OK ] Parameters/TestRpc.TestConnectionNetworkPlane/SSL_UnixSocket (72 ms)
[ RUN      ] Parameters/TestRpc.TestTCPKeepalive/SSL_UnixSocket
I20260925 16:41:22.652814 32645 acceptor_pool.cc:254] collecting diagnostics on the listening RPC socket unix:/tmp/dist-test-taskYEKzE5/test-tmp/rpc-test-635ca86966d240428b38c5647678a609.sock every 8 connection(s)
I20260925 16:41:22.653553 32646 acceptor_pool.cc:254] collecting diagnostics on the listening RPC socket unix:/tmp/dist-test-taskYEKzE5/test-tmp/rpc-test-635ca86966d240428b38c5647678a609.sock every 8 connection(s)
I20260925 16:41:22.684393 32649 rpc-test-base.h:222] got call: sleep_micros: 8000000 deferred: true
I20260925 16:41:30.688433 32649 rpcz_store.cc:275] Call kudu.rpc.GenericCalculatorService.Sleep from unix:<unnamed> (request call id 0) took 8004 ms. Trace:
I20260925 16:41:30.688889 32649 rpcz_store.cc:276] 0925 16:41:22.684240 (+     0us) service_pool.cc:170] Inserting onto call queue
0925 16:41:22.684337 (+    97us) service_pool.cc:227] Handling call
0925 16:41:30.688252 (+8003915us) inbound_call.cc:173] Queueing success response
Metrics: {}
W20260925 16:41:30.696192 32642 connection.cc:196] Error closing socket: Network error: TlsSocket::Close: Broken pipe
[       OK ] Parameters/TestRpc.TestTCPKeepalive/SSL_UnixSocket (8075 ms)
[ RUN      ] Parameters/TestRpc.TestMaxSmallSidecars/SSL_UnixSocket
I20260925 16:41:30.732122 32671 acceptor_pool.cc:254] collecting diagnostics on the listening RPC socket unix:/tmp/dist-test-taskYEKzE5/test-tmp/rpc-test-bc4fa50cdf814573b3c8efd6889ff341.sock every 8 connection(s)
I20260925 16:41:30.733007 32672 acceptor_pool.cc:254] collecting diagnostics on the listening RPC socket unix:/tmp/dist-test-taskYEKzE5/test-tmp/rpc-test-bc4fa50cdf814573b3c8efd6889ff341.sock every 8 connection(s)
W20260925 16:41:30.913000 32668 connection.cc:196] Error closing socket: Network error: TlsSocket::Close: Broken pipe
[       OK ] Parameters/TestRpc.TestMaxSmallSidecars/SSL_UnixSocket (215 ms)
[ RUN      ] Parameters/TestRpc.TestCallTimeout/SSL_UnixSocket
I20260925 16:41:30.951829 32696 acceptor_pool.cc:254] collecting diagnostics on the listening RPC socket unix:/tmp/dist-test-taskYEKzE5/test-tmp/rpc-test-adee75595fc347448cf7dd0bf2a5c06b.sock every 8 connection(s)
I20260925 16:41:30.952463 32697 acceptor_pool.cc:254] collecting diagnostics on the listening RPC socket unix:/tmp/dist-test-taskYEKzE5/test-tmp/rpc-test-adee75595fc347448cf7dd0bf2a5c06b.sock every 8 connection(s)
I20260925 16:41:30.985379 32381 rpc-test-base.h:595] status: Timed out: connection negotiation to unix:/tmp/dist-test-taskYEKzE5/test-tmp/rpc-test-adee75595fc347448cf7dd0bf2a5c06b.sock for RPC Sleep timed out after 0.000s (ON_OUTBOUND_QUEUE), seconds elapsed: 0.00302301
I20260925 16:41:30.992461 32700 rpc-test-base.h:222] got call: sleep_micros: 700000
I20260925 16:41:31.187335 32381 rpc-test-base.h:595] status: Timed out: Sleep RPC to unix:/tmp/dist-test-taskYEKzE5/test-tmp/rpc-test-adee75595fc347448cf7dd0bf2a5c06b.sock timed out after 0.200s (SENT), seconds elapsed: 0.201478
I20260925 16:41:31.188643 32699 rpc-test-base.h:222] got call: sleep_micros: 2000000
W20260925 16:41:31.693138 32700 rpcz_store.cc:267] Call kudu.rpc.GenericCalculatorService.Sleep from unix:<unnamed> (request call id 1) took 700 ms (client timeout 200 ms). Trace:
W20260925 16:41:31.693506 32700 rpcz_store.cc:269] 0925 16:41:30.992308 (+     0us) service_pool.cc:170] Inserting onto call queue
0925 16:41:30.992415 (+   107us) service_pool.cc:227] Handling call
0925 16:41:31.693083 (+700668us) inbound_call.cc:173] Queueing success response
Metrics: {}
I20260925 16:41:32.690060 32381 rpc-test-base.h:595] status: Timed out: Sleep RPC to unix:/tmp/dist-test-taskYEKzE5/test-tmp/rpc-test-adee75595fc347448cf7dd0bf2a5c06b.sock timed out after 1.500s (SENT), seconds elapsed: 1.50239
W20260925 16:41:33.189198 32699 rpcz_store.cc:267] Call kudu.rpc.GenericCalculatorService.Sleep from unix:<unnamed> (request call id 2) took 2000 ms (client timeout 1500 ms). Trace:
W20260925 16:41:33.189534 32699 rpcz_store.cc:269] 0925 16:41:31.188469 (+     0us) service_pool.cc:170] Inserting onto call queue
0925 16:41:31.188584 (+   115us) service_pool.cc:227] Handling call
0925 16:41:33.189135 (+2000551us) inbound_call.cc:173] Queueing success response
Metrics: {}
W20260925 16:41:33.190225 32693 connection.cc:441] server connection from unix:<unnamed> torn down before Call kudu.rpc.GenericCalculatorService.Sleep from unix:<unnamed> (request call id 2) could send its response
[       OK ] Parameters/TestRpc.TestCallTimeout/SSL_UnixSocket (2277 ms)
[ RUN      ] Parameters/TestRpc.TestServerShutsDown/SSL_UnixSocket
I20260925 16:41:33.197855 32381 rpc-test.cc:1125] Connecting to 0.0.0.0:43983
W20260925 16:41:33.207231 32713 negotiation.cc:337] Failed RPC negotiation. Trace:
0925 16:41:33.205703 (+     0us) reactor.cc:625] Submitting negotiation task for client connection to 0.0.0.0:43983 (local address 127.0.0.1:42132)
0925 16:41:33.206242 (+   539us) negotiation.cc:107] Waiting for socket to connect
0925 16:41:33.206275 (+    33us) client_negotiation.cc:174] Beginning negotiation
0925 16:41:33.206512 (+   237us) client_negotiation.cc:252] Sending NEGOTIATE NegotiatePB request
0925 16:41:33.206733 (+   221us) negotiation.cc:327] Negotiation complete: Network error: Client connection negotiation failed: client connection to 0.0.0.0:43983: BlockingWrite error: write error: Broken pipe (error 32)
Metrics: {"client-negotiator.queue_time_us":124}
[       OK ] Parameters/TestRpc.TestServerShutsDown/SSL_UnixSocket (14 ms)
[ RUN      ] Parameters/TestRpc.TimedOutOnResponseMetric/SSL_UnixSocket
I20260925 16:41:33.235699 32730 acceptor_pool.cc:254] collecting diagnostics on the listening RPC socket unix:/tmp/dist-test-taskYEKzE5/test-tmp/rpc-test-e8560fbab904416e89c9d841e30ac11b.sock every 8 connection(s)
I20260925 16:41:33.236449 32731 acceptor_pool.cc:254] collecting diagnostics on the listening RPC socket unix:/tmp/dist-test-taskYEKzE5/test-tmp/rpc-test-e8560fbab904416e89c9d841e30ac11b.sock every 8 connection(s)
W20260925 16:41:33.489511 32734 rpcz_store.cc:267] Call kudu.rpc_test.CalculatorService.Sleep from unix:<unnamed> (request call id 3) took 50 ms (client timeout 25 ms). Trace:
W20260925 16:41:33.489883 32734 rpcz_store.cc:269] 0925 16:41:33.438868 (+     0us) service_pool.cc:170] Inserting onto call queue
0925 16:41:33.438994 (+   126us) service_pool.cc:227] Handling call
0925 16:41:33.489426 (+ 50432us) inbound_call.cc:173] Queueing success response
Related trace 'test_child':
Metrics: {"test_sleep_us":50000,"child_traces":[["test_child",{"related_trace_metric":1}]]}
W20260925 16:41:33.549448 32734 rpcz_store.cc:267] Call kudu.rpc_test.CalculatorService.Sleep from unix:<unnamed> (request call id 4) took 50 ms (client timeout 50 ms). Trace:
W20260925 16:41:33.549762 32734 rpcz_store.cc:269] 0925 16:41:33.498758 (+     0us) service_pool.cc:170] Inserting onto call queue
0925 16:41:33.498994 (+   236us) service_pool.cc:227] Handling call
0925 16:41:33.549379 (+ 50385us) inbound_call.cc:173] Queueing success response
Related trace 'test_child':
Metrics: {"test_sleep_us":50000,"child_traces":[["test_child",{"related_trace_metric":1}]]}
[       OK ] Parameters/TestRpc.TimedOutOnResponseMetric/SSL_UnixSocket (348 ms)
[ RUN      ] Parameters/TestRpc.AcceptorDispatchingTimesMetric/SSL_UnixSocket
I20260925 16:41:33.570972 32755 acceptor_pool.cc:254] collecting diagnostics on the listening RPC socket 0.0.0.0:46389 every 8 connection(s)
I20260925 16:41:33.571694 32756 acceptor_pool.cc:254] collecting diagnostics on the listening RPC socket 0.0.0.0:46389 every 8 connection(s)
W20260925 16:41:33.576858 32751 negotiation.cc:337] Failed RPC negotiation. Trace:
0925 16:41:33.575650 (+     0us) reactor.cc:625] Submitting negotiation task for server connection from 127.0.0.1:39562 (local address 127.0.0.1:46389)
0925 16:41:33.576099 (+   449us) server_negotiation.cc:206] Beginning negotiation
0925 16:41:33.576113 (+    14us) server_negotiation.cc:399] Waiting for connection header
0925 16:41:33.576393 (+   280us) negotiation.cc:327] Negotiation complete: Network error: Server connection negotiation failed: server connection from 127.0.0.1:39562: BlockingRecv error: recv got EOF from 127.0.0.1:39562 (error 108)
Metrics: {"server-negotiator.queue_time_us":146}
[       OK ] Parameters/TestRpc.AcceptorDispatchingTimesMetric/SSL_UnixSocket (23 ms)
[ RUN      ] Parameters/TestRpc.TestRpcCallbackDestroysMessenger/SSL_UnixSocket
[       OK ] Parameters/TestRpc.TestRpcCallbackDestroysMessenger/SSL_UnixSocket (29 ms)
[ RUN      ] Parameters/TestRpc.TestApplicationFeatureFlag/SSL_UnixSocket
I20260925 16:41:33.633637   312 acceptor_pool.cc:254] collecting diagnostics on the listening RPC socket unix:/tmp/dist-test-taskYEKzE5/test-tmp/rpc-test-46b48bbbcb3447b6a47417810f7351bb.sock every 8 connection(s)
I20260925 16:41:33.634416   313 acceptor_pool.cc:254] collecting diagnostics on the listening RPC socket unix:/tmp/dist-test-taskYEKzE5/test-tmp/rpc-test-46b48bbbcb3447b6a47417810f7351bb.sock every 8 connection(s)
W20260925 16:41:33.688988   309 messenger.cc:357] Unable to handle RPC call: Not implemented: call requires unsupported application feature flags: 99
[       OK ] Parameters/TestRpc.TestApplicationFeatureFlag/SSL_UnixSocket (85 ms)
[ RUN      ] Parameters/TestRpc.TestCancellation/SSL_UnixSocket
I20260925 16:41:33.731137   337 acceptor_pool.cc:254] collecting diagnostics on the listening RPC socket unix:/tmp/dist-test-taskYEKzE5/test-tmp/rpc-test-e958943e9b134fa49b1591c80a8e9768.sock every 8 connection(s)
I20260925 16:41:33.731851   338 acceptor_pool.cc:254] collecting diagnostics on the listening RPC socket unix:/tmp/dist-test-taskYEKzE5/test-tmp/rpc-test-e958943e9b134fa49b1591c80a8e9768.sock every 8 connection(s)
I20260925 16:41:33.735409 32381 rpc-test.cc:1648] Connecting to unix:/tmp/dist-test-taskYEKzE5/test-tmp/rpc-test-e958943e9b134fa49b1591c80a8e9768.sock
I20260925 16:41:33.847599 32381 rpc-test-base.h:595] status: Aborted: Sleep RPC to unix:/tmp/dist-test-taskYEKzE5/test-tmp/rpc-test-e958943e9b134fa49b1591c80a8e9768.sock is cancelled in state READY, seconds elapsed: 0.000405016
I20260925 16:41:34.043020 32381 rpc-test-base.h:595] status: Aborted: Sleep RPC to unix:/tmp/dist-test-taskYEKzE5/test-tmp/rpc-test-e958943e9b134fa49b1591c80a8e9768.sock is cancelled in state SENT, seconds elapsed: 0.000860161
I20260925 16:41:34.043275   340 rpc-test-base.h:222] got call: sleep_micros: 510000
I20260925 16:41:34.229333 32381 rpc-test-base.h:595] status: Aborted: Sleep RPC to unix:/tmp/dist-test-taskYEKzE5/test-tmp/rpc-test-e958943e9b134fa49b1591c80a8e9768.sock is cancelled in state SENT, seconds elapsed: 0.00100322
I20260925 16:41:34.229521   339 rpc-test-base.h:222] got call: sleep_micros: 510000
I20260925 16:41:34.408566 32381 rpc-test-base.h:595] status: Aborted: Sleep RPC to unix:/tmp/dist-test-taskYEKzE5/test-tmp/rpc-test-e958943e9b134fa49b1591c80a8e9768.sock is cancelled in state SENT, seconds elapsed: 0.000916745
W20260925 16:41:34.419665   341 rpcz_store.cc:267] Call kudu.rpc.GenericCalculatorService.Sleep from unix:<unnamed> (request call id 11) took 11 ms (client timeout 10 ms). Trace:
W20260925 16:41:34.420022   341 rpcz_store.cc:269] 0925 16:41:34.408554 (+     0us) service_pool.cc:170] Inserting onto call queue
0925 16:41:34.419375 (+ 10821us) service_pool.cc:214] Skipping call since client already timed out
0925 16:41:34.419470 (+    95us) inbound_call.cc:173] Queueing failure response
Metrics: {}
I20260925 16:41:34.420574   341 rpc-test-base.h:222] got call: sleep_micros: 1500000
W20260925 16:41:34.553907   340 rpcz_store.cc:267] Call kudu.rpc.GenericCalculatorService.Sleep from unix:<unnamed> (request call id 3) took 510 ms (client timeout 10 ms). Trace:
W20260925 16:41:34.554280   340 rpcz_store.cc:269] 0925 16:41:34.043078 (+     0us) service_pool.cc:170] Inserting onto call queue
0925 16:41:34.043217 (+   139us) service_pool.cc:227] Handling call
0925 16:41:34.553855 (+510638us) inbound_call.cc:173] Queueing success response
Metrics: {}
W20260925 16:41:34.740128   339 rpcz_store.cc:267] Call kudu.rpc.GenericCalculatorService.Sleep from unix:<unnamed> (request call id 7) took 510 ms (client timeout 10 ms). Trace:
W20260925 16:41:34.740463   339 rpcz_store.cc:269] 0925 16:41:34.229329 (+     0us) service_pool.cc:170] Inserting onto call queue
0925 16:41:34.229462 (+   133us) service_pool.cc:227] Handling call
0925 16:41:34.740075 (+510613us) inbound_call.cc:173] Queueing success response
Metrics: {}
I20260925 16:41:35.410624 32381 rpc-test-base.h:595] status: Timed out: Sleep RPC to unix:/tmp/dist-test-taskYEKzE5/test-tmp/rpc-test-e958943e9b134fa49b1591c80a8e9768.sock timed out after 1.000s (SENT), seconds elapsed: 1.00159
I20260925 16:41:35.412671   339 rpc-test-base.h:222] got call: sleep_micros: 1500000
W20260925 16:41:35.921334   341 rpcz_store.cc:267] Call kudu.rpc.GenericCalculatorService.Sleep from unix:<unnamed> (request call id 12) took 1511 ms (client timeout 1000 ms). Trace:
W20260925 16:41:35.922043   341 rpcz_store.cc:269] 0925 16:41:34.409769 (+     0us) service_pool.cc:170] Inserting onto call queue
0925 16:41:34.420537 (+ 10768us) service_pool.cc:227] Handling call
0925 16:41:35.921178 (+1500641us) inbound_call.cc:173] Queueing success response
Metrics: {}
I20260925 16:41:36.413139 32381 rpc-test-base.h:595] status: Timed out: Sleep RPC to unix:/tmp/dist-test-taskYEKzE5/test-tmp/rpc-test-e958943e9b134fa49b1591c80a8e9768.sock timed out after 1.000s (SENT), seconds elapsed: 1.00202
W20260925 16:41:36.414639   334 messenger.cc:357] Unable to handle RPC call: Not implemented: call requires unsupported application feature flags: 99, 1
W20260925 16:41:36.416246   334 messenger.cc:357] Unable to handle RPC call: Not implemented: call requires unsupported application feature flags: 99, 1
W20260925 16:41:36.634388   334 connection.cc:196] Error closing socket: Network error: TlsSocket::Close: Broken pipe
W20260925 16:41:36.913410   339 rpcz_store.cc:267] Call kudu.rpc.GenericCalculatorService.Sleep from unix:<unnamed> (request call id 13) took 1501 ms (client timeout 1000 ms). Trace:
W20260925 16:41:36.913762   339 rpcz_store.cc:269] 0925 16:41:35.412321 (+     0us) service_pool.cc:170] Inserting onto call queue
0925 16:41:35.412552 (+   231us) service_pool.cc:227] Handling call
0925 16:41:36.913357 (+1500805us) inbound_call.cc:173] Queueing success response
Metrics: {}
W20260925 16:41:36.914333   334 connection.cc:441] server connection from unix:<unnamed> torn down before Call kudu.rpc.GenericCalculatorService.Sleep from unix:<unnamed> (request call id 13) could send its response
[       OK ] Parameters/TestRpc.TestCancellation/SSL_UnixSocket (3225 ms)
[ RUN      ] Parameters/TestRpc.TestCancellationMultiThreads/SSL_UnixSocket
I20260925 16:41:36.947315   363 acceptor_pool.cc:254] collecting diagnostics on the listening RPC socket unix:/tmp/dist-test-taskYEKzE5/test-tmp/rpc-test-039550fa9f1c4208855bc96a2eaa8a8f.sock every 8 connection(s)
I20260925 16:41:36.948201   364 acceptor_pool.cc:254] collecting diagnostics on the listening RPC socket unix:/tmp/dist-test-taskYEKzE5/test-tmp/rpc-test-039550fa9f1c4208855bc96a2eaa8a8f.sock every 8 connection(s)
I20260925 16:41:36.951486 32381 rpc-test.cc:1808] Connecting to unix:/tmp/dist-test-taskYEKzE5/test-tmp/rpc-test-039550fa9f1c4208855bc96a2eaa8a8f.sock
I20260925 16:41:37.107139   377 test_util.cc:268] Using random seed: 1674736718
I20260925 16:41:37.108249   378 test_util.cc:268] Using random seed: 1674737923
I20260925 16:41:37.109915   379 test_util.cc:268] Using random seed: 1674739379
I20260925 16:41:37.111248   380 test_util.cc:268] Using random seed: 1674740903
I20260925 16:41:37.113265   381 test_util.cc:268] Using random seed: 1674742738
I20260925 16:41:37.115114   382 test_util.cc:268] Using random seed: 1674744203
I20260925 16:41:37.117393   383 test_util.cc:268] Using random seed: 1674746521
I20260925 16:41:37.118770   384 test_util.cc:268] Using random seed: 1674748352
I20260925 16:41:37.120428   385 test_util.cc:268] Using random seed: 1674750011
I20260925 16:41:37.122426   386 test_util.cc:268] Using random seed: 1674751956
I20260925 16:41:37.124377   387 test_util.cc:268] Using random seed: 1674753405
I20260925 16:41:37.125741   388 test_util.cc:268] Using random seed: 1674755220
I20260925 16:41:37.127154   389 test_util.cc:268] Using random seed: 1674756732
I20260925 16:41:37.129292   390 test_util.cc:268] Using random seed: 1674758784
I20260925 16:41:37.131232   391 test_util.cc:268] Using random seed: 1674760363
I20260925 16:41:37.133163   392 test_util.cc:268] Using random seed: 1674762332
I20260925 16:41:37.134523   393 test_util.cc:268] Using random seed: 1674764101
I20260925 16:41:37.136485   394 test_util.cc:268] Using random seed: 1674766026
I20260925 16:41:37.138495   395 test_util.cc:268] Using random seed: 1674768048
I20260925 16:41:37.140516   396 test_util.cc:268] Using random seed: 1674770038
I20260925 16:41:37.142547   397 test_util.cc:268] Using random seed: 1674772084
I20260925 16:41:37.144160   398 test_util.cc:268] Using random seed: 1674773665
I20260925 16:41:37.146804   399 test_util.cc:268] Using random seed: 1674775948
I20260925 16:41:37.148247   400 test_util.cc:268] Using random seed: 1674777743
I20260925 16:41:37.150270   401 test_util.cc:268] Using random seed: 1674779790
I20260925 16:41:37.152247   402 test_util.cc:268] Using random seed: 1674781782
I20260925 16:41:37.154214   403 test_util.cc:268] Using random seed: 1674783710
I20260925 16:41:37.156096   404 test_util.cc:268] Using random seed: 1674785191
I20260925 16:41:37.157593   405 test_util.cc:268] Using random seed: 1674787103
I20260925 16:41:37.159559   406 test_util.cc:268] Using random seed: 1674789046
W20260925 16:41:57.179349   360 connection.cc:196] Error closing socket: Network error: TlsSocket::Close: Broken pipe
[       OK ] Parameters/TestRpc.TestCancellationMultiThreads/SSL_UnixSocket (20275 ms)
[ RUN      ] Parameters/TestRpc.TestCallId/SSL_UnixSocket
I20260925 16:41:57.219846   420 acceptor_pool.cc:254] collecting diagnostics on the listening RPC socket unix:/tmp/dist-test-taskYEKzE5/test-tmp/rpc-test-e117619de10d46428835bb7ca1c5857b.sock every 8 connection(s)
I20260925 16:41:57.220718   421 acceptor_pool.cc:254] collecting diagnostics on the listening RPC socket unix:/tmp/dist-test-taskYEKzE5/test-tmp/rpc-test-e117619de10d46428835bb7ca1c5857b.sock every 8 connection(s)
[       OK ] Parameters/TestRpc.TestCallId/SSL_UnixSocket (86 ms)
[----------] 20 tests from Parameters/TestRpc (38957 ms total)

[----------] Global test environment tear-down
[==========] 21 tests from 2 test suites ran. (42026 ms total)
[  PASSED  ] 20 tests.
[  FAILED  ] 1 test, listed below:
[  FAILED  ] Parameters/TestRpc.TestCallWithChainCertAndRootCA/SSL_UnixSocket, where GetParam() = (true, true)

 1 FAILED TEST
I20260925 16:41:57.303519 32381 logging.cc:424] LogThrottler /data0/somelongdirectorytoavoidrpathissues/src/kudu/src/kudu/rpc/acceptor_pool.cc:285: suppressed but not reported on 3 messages since previous log ~34 seconds ago