Diagnosed failure

Parameters/TestRpc.TestCallWithChainCertAndChainCA/SSL_TCP: /data0/somelongdirectorytoavoidrpathissues/src/kudu/src/kudu/rpc/rpc-test.cc:270: Failure
Failed
Bad status: Runtime error: could not verify certificate chain (error with cert: subject=CN = localhost, ST = sadfjas, C = AS, emailAddress = sdflkdsajf, O = lskdfjlsad, OU = sldfkja, issuer=C = AS, ST = ASDfkjdhf, L = lskdjf, O = saldfja, OU = skdjf, CN = localhost, emailAddress = sadjflkadsj): : certificate has expired
Google Test trace:
/data0/somelongdirectorytoavoidrpathissues/src/kudu/src/kudu/rpc/rpc-test.cc:267: Connecting to 0.0.0.0:36413
I20260925 02:22:24.659083 13331 test_util.cc:175] -----------------------------------------------
I20260925 02:22:24.659142 13331 test_util.cc:176] Had fatal failures, leaving test files at /tmp/dist-test-task3zWJir/test-tmp/rpc-test.5.Parameters_TestRpc.TestCallWithChainCertAndChainCA_SSL_TCP.1790302944581955-13331-0

Full log

Note: This is test shard 6 of 8.
[==========] Running 21 tests from 2 test suites.
[----------] Global test environment set-up.
[----------] 20 tests from Parameters/TestRpc
[ RUN      ] Parameters/TestRpc.TestMessengerCreateDestroy/SSL_TCP
WARNING: Logging before InitGoogleLogging() is written to STDERR
I20260925 02:22:24.606245 13331 rpc-test.cc:169] started messenger TestCreateDestroy
[       OK ] Parameters/TestRpc.TestMessengerCreateDestroy/SSL_TCP (22 ms)
[ RUN      ] Parameters/TestRpc.TestNegotiationDeadlock/SSL_TCP
I20260925 02:22:24.615886 13352 acceptor_pool.cc:254] collecting diagnostics on the listening RPC socket 0.0.0.0:33875 every 8 connection(s)
I20260925 02:22:24.615935 13351 acceptor_pool.cc:254] collecting diagnostics on the listening RPC socket 0.0.0.0:33875 every 8 connection(s)
[       OK ] Parameters/TestRpc.TestNegotiationDeadlock/SSL_TCP (15 ms)
[ RUN      ] Parameters/TestRpc.TestCallWithChainCertAndChainCA/SSL_TCP
I20260925 02:22:24.653906 13367 acceptor_pool.cc:254] collecting diagnostics on the listening RPC socket 0.0.0.0:36413 every 8 connection(s)
I20260925 02:22:24.653906 13368 acceptor_pool.cc:254] collecting diagnostics on the listening RPC socket 0.0.0.0:36413 every 8 connection(s)
/data0/somelongdirectorytoavoidrpathissues/src/kudu/src/kudu/rpc/rpc-test.cc:270: Failure
Failed
Bad status: Runtime error: could not verify certificate chain (error with cert: subject=CN = localhost, ST = sadfjas, C = AS, emailAddress = sdflkdsajf, O = lskdfjlsad, OU = sldfkja, issuer=C = AS, ST = ASDfkjdhf, L = lskdjf, O = saldfja, OU = skdjf, CN = localhost, emailAddress = sadjflkadsj): : certificate has expired
Google Test trace:
/data0/somelongdirectorytoavoidrpathissues/src/kudu/src/kudu/rpc/rpc-test.cc:267: Connecting to 0.0.0.0:36413
I20260925 02:22:24.659083 13331 test_util.cc:175] -----------------------------------------------
I20260925 02:22:24.659142 13331 test_util.cc:176] Had fatal failures, leaving test files at /tmp/dist-test-task3zWJir/test-tmp/rpc-test.5.Parameters_TestRpc.TestCallWithChainCertAndChainCA_SSL_TCP.1790302944581955-13331-0
[  FAILED  ] Parameters/TestRpc.TestCallWithChainCertAndChainCA/SSL_TCP, where GetParam() = (true, false) (35 ms)
[ RUN      ] Parameters/TestRpc.TestCallWithPasswordProtectedKey/SSL_TCP
I20260925 02:22:24.670984 13392 acceptor_pool.cc:254] collecting diagnostics on the listening RPC socket 0.0.0.0:46175 every 8 connection(s)
I20260925 02:22:24.671022 13393 acceptor_pool.cc:254] collecting diagnostics on the listening RPC socket 0.0.0.0:46175 every 8 connection(s)
[       OK ] Parameters/TestRpc.TestCallWithPasswordProtectedKey/SSL_TCP (26 ms)
[ RUN      ] Parameters/TestRpc.TestCallToBadServer/SSL_TCP
I20260925 02:22:24.694845 13331 rpc-test.cc:394] Status: Network error: Client connection negotiation failed: client connection to 0.0.0.0:0: connect: Connection refused (error 111)
I20260925 02:22:24.695154 13331 rpc-test.cc:394] Status: Network error: Client connection negotiation failed: client connection to 0.0.0.0:0: connect: Connection refused (error 111)
I20260925 02:22:24.695482 13331 rpc-test.cc:394] Status: Network error: Client connection negotiation failed: client connection to 0.0.0.0:0: connect: Connection refused (error 111)
I20260925 02:22:24.695719 13331 rpc-test.cc:394] Status: Network error: Client connection negotiation failed: client connection to 0.0.0.0:0: connect: Connection refused (error 111)
I20260925 02:22:24.695902 13331 rpc-test.cc:394] Status: Network error: Client connection negotiation failed: client connection to 0.0.0.0:0: connect: Connection refused (error 111)
[       OK ] Parameters/TestRpc.TestCallToBadServer/SSL_TCP (10 ms)
[ RUN      ] Parameters/TestRpc.TestWrongService/SSL_TCP
I20260925 02:22:24.703270 13427 acceptor_pool.cc:254] collecting diagnostics on the listening RPC socket 0.0.0.0:41133 every 8 connection(s)
I20260925 02:22:24.703302 13428 acceptor_pool.cc:254] collecting diagnostics on the listening RPC socket 0.0.0.0:41133 every 8 connection(s)
I20260925 02:22:24.714761 13424 messenger.cc:345] service WrongServiceName not registered on TestServer
[       OK ] Parameters/TestRpc.TestWrongService/SSL_TCP (20 ms)
[ RUN      ] Parameters/TestRpc.TestConnectionKeepalive/SSL_TCP
I20260925 02:22:24.731390 13450 acceptor_pool.cc:254] collecting diagnostics on the listening RPC socket 0.0.0.0:38567 every 8 connection(s)
I20260925 02:22:24.731446 13451 acceptor_pool.cc:254] collecting diagnostics on the listening RPC socket 0.0.0.0:38567 every 8 connection(s)
I20260925 02:22:24.731592 13331 rpc-test.cc:488] Connecting to 0.0.0.0:38567
[       OK ] Parameters/TestRpc.TestConnectionKeepalive/SSL_TCP (1052 ms)
[ RUN      ] Parameters/TestRpc.TestClientConnectionMetrics/SSL_TCP
I20260925 02:22:25.779637 13475 acceptor_pool.cc:254] collecting diagnostics on the listening RPC socket 0.0.0.0:43757 every 8 connection(s)
I20260925 02:22:25.779736 13476 acceptor_pool.cc:254] collecting diagnostics on the listening RPC socket 0.0.0.0:43757 every 8 connection(s)
I20260925 02:22:25.779860 13331 rpc-test.cc:569] Connecting to 0.0.0.0:43757
[       OK ] Parameters/TestRpc.TestClientConnectionMetrics/SSL_TCP (10423 ms)
[ RUN      ] Parameters/TestRpc.TestCredentialsPolicy/SSL_TCP
I20260925 02:22:36.218470 13498 acceptor_pool.cc:254] collecting diagnostics on the listening RPC socket 0.0.0.0:41855 every 8 connection(s)
I20260925 02:22:36.218515 13499 acceptor_pool.cc:254] collecting diagnostics on the listening RPC socket 0.0.0.0:41855 every 8 connection(s)
I20260925 02:22:36.218715 13331 rpc-test.cc:700] Connecting to 0.0.0.0:41855
[       OK ] Parameters/TestRpc.TestCredentialsPolicy/SSL_TCP (62 ms)
[ RUN      ] Parameters/TestRpc.TestCallLongerThanKeepalive/SSL_TCP
I20260925 02:22:36.264875 13523 acceptor_pool.cc:254] collecting diagnostics on the listening RPC socket 0.0.0.0:36835 every 8 connection(s)
I20260925 02:22:36.264904 13524 acceptor_pool.cc:254] collecting diagnostics on the listening RPC socket 0.0.0.0:36835 every 8 connection(s)
I20260925 02:22:36.277040 13526 rpc-test-base.h:222] got call: sleep_micros: 3000000 deferred: true
I20260925 02:22:39.277812 13526 rpcz_store.cc:275] Call kudu.rpc.GenericCalculatorService.Sleep from 127.0.0.1:51036 (request call id 0) took 3000 ms. Trace:
I20260925 02:22:39.277963 13526 rpcz_store.cc:276] 0925 02:22:36.276975 (+     0us) service_pool.cc:170] Inserting onto call queue
0925 02:22:36.277014 (+    39us) service_pool.cc:227] Handling call
0925 02:22:39.277795 (+3000781us) inbound_call.cc:173] Queueing success response
Metrics: {}
[       OK ] Parameters/TestRpc.TestCallLongerThanKeepalive/SSL_TCP (3024 ms)
[ RUN      ] Parameters/TestRpc.TestRpcSidecar/SSL_TCP
I20260925 02:22:39.289242 13548 acceptor_pool.cc:254] collecting diagnostics on the listening RPC socket 0.0.0.0:38333 every 8 connection(s)
I20260925 02:22:39.289300 13549 acceptor_pool.cc:254] collecting diagnostics on the listening RPC socket 0.0.0.0:38333 every 8 connection(s)
[       OK ] Parameters/TestRpc.TestRpcSidecar/SSL_TCP (64 ms)
[ RUN      ] Parameters/TestRpc.TestRpcSidecarLimits/SSL_TCP
I20260925 02:22:41.510828 13573 acceptor_pool.cc:254] collecting diagnostics on the listening RPC socket 0.0.0.0:39945 every 8 connection(s)
I20260925 02:22:41.510860 13574 acceptor_pool.cc:254] collecting diagnostics on the listening RPC socket 0.0.0.0:39945 every 8 connection(s)
W20260925 02:22:41.534281 13331 serialization.cc:72] Serialized kudu.rpc_test.PushStringsRequestPB (2147483654 bytes) is larger than the maximum configured RPC message size (52428800 bytes). Sending anyway, but peer may reject the data.
W20260925 02:22:41.537671 13572 connection.cc:535] server connection from 127.0.0.1:35396 recv error: Network error: RPC frame had a length of 2147483714, but we only support messages up to 52428800 bytes long.
W20260925 02:22:41.537751 13572 connection.cc:158] shutting down server connection from 127.0.0.1:35396 with pending inbound data: 4/2147483714 bytes received; last active 0 ns ago: status Network error: RPC frame had a length of 2147483714, but we only support messages up to 52428800 bytes long.
W20260925 02:22:41.537987 13586 connection.cc:196] Error closing socket: Network error: TlsSocket::Close: Connection reset by peer
I20260925 02:22:41.550572 13598 acceptor_pool.cc:254] collecting diagnostics on the listening RPC socket 0.0.0.0:39455 every 8 connection(s)
I20260925 02:22:41.550601 13599 acceptor_pool.cc:254] collecting diagnostics on the listening RPC socket 0.0.0.0:39455 every 8 connection(s)
W20260925 02:22:46.279198 13596 connection.cc:577] server connection from 127.0.0.1:58842: received bad data: 'Corruption: Invalid packet: message had a length of 2147483710, but we only support messages up to 2147483647 bytes
'
[       OK ] Parameters/TestRpc.TestRpcSidecarLimits/SSL_TCP (6936 ms)
[ RUN      ] Parameters/TestRpc.TestCallTimeoutDoesntAffectNegotiation/SSL_TCP
I20260925 02:22:46.315145 13623 acceptor_pool.cc:254] collecting diagnostics on the listening RPC socket 0.0.0.0:42041 every 8 connection(s)
I20260925 02:22:46.315204 13624 acceptor_pool.cc:254] collecting diagnostics on the listening RPC socket 0.0.0.0:42041 every 8 connection(s)
W20260925 02:22:46.324949 13619 negotiation.cc:266] Injecting 500ms delay in negotiation
I20260925 02:22:46.375274 13331 rpc-test-base.h:595] status: Timed out: connection negotiation to 0.0.0.0:42041 for RPC Sleep timed out after 0.050s (ON_OUTBOUND_QUEUE), seconds elapsed: 0.0507223
[       OK ] Parameters/TestRpc.TestCallTimeoutDoesntAffectNegotiation/SSL_TCP (553 ms)
[ RUN      ] Parameters/TestRpc.TestRpcHandlerLatencyMetric/SSL_TCP
I20260925 02:22:46.847949 13648 acceptor_pool.cc:254] collecting diagnostics on the listening RPC socket 0.0.0.0:38411 every 8 connection(s)
I20260925 02:22:46.847975 13649 acceptor_pool.cc:254] collecting diagnostics on the listening RPC socket 0.0.0.0:38411 every 8 connection(s)
I20260925 02:22:46.903623 13331 rpc-test.cc:1236] Sleep() min lat: 20357
I20260925 02:22:46.903704 13331 rpc-test.cc:1237] Sleep() mean lat: 20357
I20260925 02:22:46.903734 13331 rpc-test.cc:1238] Sleep() max lat: 20357
I20260925 02:22:46.903749 13331 rpc-test.cc:1239] Sleep() #calls: 1
[       OK ] Parameters/TestRpc.TestRpcHandlerLatencyMetric/SSL_TCP (70 ms)
[ RUN      ] Parameters/TestRpc.TimedOutOnResponseMetricServiceQueue/SSL_TCP
I20260925 02:22:46.928609 13674 acceptor_pool.cc:254] collecting diagnostics on the listening RPC socket 0.0.0.0:33657 every 8 connection(s)
I20260925 02:22:46.928646 13675 acceptor_pool.cc:254] collecting diagnostics on the listening RPC socket 0.0.0.0:33657 every 8 connection(s)
W20260925 02:22:46.981494 13676 rpcz_store.cc:267] Call kudu.rpc_test.CalculatorService.Sleep from 127.0.0.1:45554 (request call id 2) took 20 ms (client timeout 20 ms). Trace:
W20260925 02:22:46.981611 13676 rpcz_store.cc:269] 0925 02:22:46.961203 (+     0us) service_pool.cc:170] Inserting onto call queue
0925 02:22:46.981463 (+ 20260us) service_pool.cc:214] Skipping call since client already timed out
0925 02:22:46.981476 (+    13us) inbound_call.cc:173] Queueing failure response
Metrics: {}
[       OK ] Parameters/TestRpc.TimedOutOnResponseMetricServiceQueue/SSL_TCP (77 ms)
[ RUN      ] Parameters/TestRpc.RpcPendingConnectionsMetric/SSL_TCP
I20260925 02:22:46.985163 13697 acceptor_pool.cc:254] collecting diagnostics on the listening RPC socket 0.0.0.0:36813 every 8 connection(s)
I20260925 02:22:46.985255 13698 acceptor_pool.cc:254] collecting diagnostics on the listening RPC socket 0.0.0.0:36813 every 8 connection(s)
W20260925 02:22:46.985831 13693 negotiation.cc:337] Failed RPC negotiation. Trace:
0925 02:22:46.985662 (+     0us) reactor.cc:625] Submitting negotiation task for server connection from 127.0.0.1:44174 (local address 127.0.0.1:36813)
0925 02:22:46.985712 (+    50us) server_negotiation.cc:206] Beginning negotiation
0925 02:22:46.985714 (+     2us) server_negotiation.cc:399] Waiting for connection header
0925 02:22:46.985769 (+    55us) negotiation.cc:327] Negotiation complete: Network error: Server connection negotiation failed: server connection from 127.0.0.1:44174: BlockingRecv error: recv got EOF from 127.0.0.1:44174 (error 108)
Metrics: {"server-negotiator.queue_time_us":15}
[       OK ] Parameters/TestRpc.RpcPendingConnectionsMetric/SSL_TCP (13 ms)
[ RUN      ] Parameters/TestRpc.TestRpcContextClientDeadline/SSL_TCP
I20260925 02:22:47.029037 13713 acceptor_pool.cc:254] collecting diagnostics on the listening RPC socket 0.0.0.0:35871 every 8 connection(s)
I20260925 02:22:47.029083 13714 acceptor_pool.cc:254] collecting diagnostics on the listening RPC socket 0.0.0.0:35871 every 8 connection(s)
[       OK ] Parameters/TestRpc.TestRpcContextClientDeadline/SSL_TCP (68 ms)
[ RUN      ] Parameters/TestRpc.TestApplicationFeatureFlagUnsupportedServer/SSL_TCP
I20260925 02:22:47.086580 13738 acceptor_pool.cc:254] collecting diagnostics on the listening RPC socket 0.0.0.0:39219 every 8 connection(s)
I20260925 02:22:47.086594 13739 acceptor_pool.cc:254] collecting diagnostics on the listening RPC socket 0.0.0.0:39219 every 8 connection(s)
[       OK ] Parameters/TestRpc.TestApplicationFeatureFlagUnsupportedServer/SSL_TCP (34 ms)
[ RUN      ] Parameters/TestRpc.TestCancellationAsync/SSL_TCP
I20260925 02:22:47.112859 13764 acceptor_pool.cc:254] collecting diagnostics on the listening RPC socket 0.0.0.0:32817 every 8 connection(s)
I20260925 02:22:47.112870 13763 acceptor_pool.cc:254] collecting diagnostics on the listening RPC socket 0.0.0.0:32817 every 8 connection(s)
I20260925 02:22:47.113113 13331 rpc-test.cc:1716] Connecting to 0.0.0.0:32817
I20260925 02:22:47.124050 13331 test_util.cc:268] Using random seed: 1684361296
I20260925 02:22:47.139058 13765 rpc-test-base.h:240] got call: sleep_micros: 500 pattern: 4294967295 num_repetitions: 2097152 sidecar_idx: 0
I20260925 02:22:47.149499 13765 rpc-test-base.h:240] got call: sleep_micros: 500 pattern: 4294967295 num_repetitions: 2097152 sidecar_idx: 0
I20260925 02:22:47.160175 13765 rpc-test-base.h:240] got call: sleep_micros: 500 pattern: 4294967295 num_repetitions: 2097152 sidecar_idx: 0
I20260925 02:22:47.171738 13765 rpc-test-base.h:240] got call: sleep_micros: 500 pattern: 4294967295 num_repetitions: 2097152 sidecar_idx: 0
I20260925 02:22:47.183192 13765 rpc-test-base.h:240] got call: sleep_micros: 500 pattern: 4294967295 num_repetitions: 2097152 sidecar_idx: 0
I20260925 02:22:47.195298 13765 rpc-test-base.h:240] got call: sleep_micros: 500 pattern: 4294967295 num_repetitions: 2097152 sidecar_idx: 0
I20260925 02:22:47.207139 13765 rpc-test-base.h:240] got call: sleep_micros: 500 pattern: 4294967295 num_repetitions: 2097152 sidecar_idx: 0
I20260925 02:22:47.219579 13765 rpc-test-base.h:240] got call: sleep_micros: 500 pattern: 4294967295 num_repetitions: 2097152 sidecar_idx: 0
W20260925 02:22:47.222944 13761 connection.cc:441] server connection from 127.0.0.1:44654 torn down before Call kudu.rpc.GenericCalculatorService.SleepWithSidecar from 127.0.0.1:44654 (request call id 9) could send its response
[       OK ] Parameters/TestRpc.TestCancellationAsync/SSL_TCP (123 ms)
[ RUN      ] Parameters/TestRpc.TestPerformanceBySocketType/SSL_TCP
I20260925 02:22:47.246953 13788 acceptor_pool.cc:254] collecting diagnostics on the listening RPC socket 0.0.0.0:41339 every 8 connection(s)
I20260925 02:22:47.247013 13789 acceptor_pool.cc:254] collecting diagnostics on the listening RPC socket 0.0.0.0:41339 every 8 connection(s)
I20260925 02:22:47.247188 13331 rpc-test.cc:1846] Connecting to 0.0.0.0:41339
I20260925 02:22:48.913990 13331 rpc-test.cc:1859] Sending 1024MB via ssl-enabled tcp socket: real 1.646s	user 1.535s	sys 1.404s
I20260925 02:22:50.599472 13331 rpc-test.cc:1859] Sending 1024MB via ssl-enabled tcp socket: real 1.685s	user 1.542s	sys 1.441s
I20260925 02:22:52.283854 13331 rpc-test.cc:1859] Sending 1024MB via ssl-enabled tcp socket: real 1.684s	user 1.567s	sys 1.417s
I20260925 02:22:53.872431 13331 rpc-test.cc:1859] Sending 1024MB via ssl-enabled tcp socket: real 1.588s	user 1.345s	sys 1.494s
I20260925 02:22:55.546669 13331 rpc-test.cc:1859] Sending 1024MB via ssl-enabled tcp socket: real 1.674s	user 1.635s	sys 1.357s
[       OK ] Parameters/TestRpc.TestPerformanceBySocketType/SSL_TCP (8324 ms)
[----------] 20 tests from Parameters/TestRpc (30964 ms total)

[----------] 1 test from Parameters/TestRpcSocketTxRxQueue
[ RUN      ] Parameters/TestRpcSocketTxRxQueue.OverCapacity/0
W20260925 02:22:55.822901 13832 negotiation.cc:337] Failed RPC negotiation. Trace:
0925 02:22:55.560512 (+     0us) reactor.cc:625] Submitting negotiation task for client connection to 0.0.0.0:33123 (local address 127.0.0.1:41892)
0925 02:22:55.560566 (+    54us) negotiation.cc:107] Waiting for socket to connect
0925 02:22:55.560575 (+     9us) client_negotiation.cc:174] Beginning negotiation
0925 02:22:55.560616 (+    41us) client_negotiation.cc:252] Sending NEGOTIATE NegotiatePB request
0925 02:22:55.822799 (+262183us) negotiation.cc:327] Negotiation complete: Network error: Client connection negotiation failed: client connection to 0.0.0.0:33123: BlockingRecv error: recv error from unknown peer: Transport endpoint is not connected (error 107)
Metrics: {"client-negotiator.queue_time_us":33}
W20260925 02:22:55.822947 13814 negotiation.cc:337] Failed RPC negotiation. Trace:
0925 02:22:55.558717 (+     0us) reactor.cc:625] Submitting negotiation task for client connection to 0.0.0.0:33123 (local address 127.0.0.1:41872)
0925 02:22:55.558779 (+    62us) negotiation.cc:107] Waiting for socket to connect
0925 02:22:55.558788 (+     9us) client_negotiation.cc:174] Beginning negotiation
0925 02:22:55.558831 (+    43us) client_negotiation.cc:252] Sending NEGOTIATE NegotiatePB request
0925 02:22:55.822745 (+263914us) negotiation.cc:327] Negotiation complete: Network error: Client connection negotiation failed: client connection to 0.0.0.0:33123: BlockingRecv error: recv error from unknown peer: Transport endpoint is not connected (error 107)
Metrics: {"client-negotiator.queue_time_us":38}
W20260925 02:22:55.822927 13850 negotiation.cc:337] Failed RPC negotiation. Trace:
0925 02:22:55.562227 (+     0us) reactor.cc:625] Submitting negotiation task for client connection to 0.0.0.0:33123 (local address 127.0.0.1:41910)
0925 02:22:55.562281 (+    54us) negotiation.cc:107] Waiting for socket to connect
0925 02:22:55.562290 (+     9us) client_negotiation.cc:174] Beginning negotiation
0925 02:22:55.562328 (+    38us) client_negotiation.cc:252] Sending NEGOTIATE NegotiatePB request
0925 02:22:55.822856 (+260528us) negotiation.cc:327] Negotiation complete: Network error: Client connection negotiation failed: client connection to 0.0.0.0:33123: BlockingRecv error: recv error from unknown peer: Transport endpoint is not connected (error 107)
Metrics: {"client-negotiator.queue_time_us":33}
W20260925 02:22:55.823045 13841 negotiation.cc:337] Failed RPC negotiation. Trace:
0925 02:22:55.561370 (+     0us) reactor.cc:625] Submitting negotiation task for client connection to 0.0.0.0:33123 (local address 127.0.0.1:41906)
0925 02:22:55.561425 (+    55us) negotiation.cc:107] Waiting for socket to connect
0925 02:22:55.561434 (+     9us) client_negotiation.cc:174] Beginning negotiation
0925 02:22:55.561472 (+    38us) client_negotiation.cc:252] Sending NEGOTIATE NegotiatePB request
0925 02:22:55.822927 (+261455us) negotiation.cc:327] Negotiation complete: Network error: Client connection negotiation failed: client connection to 0.0.0.0:33123: BlockingRecv error: recv error from unknown peer: Transport endpoint is not connected (error 107)
Metrics: {"client-negotiator.queue_time_us":33}
W20260925 02:22:55.823045 13805 negotiation.cc:337] Failed RPC negotiation. Trace:
0925 02:22:55.557866 (+     0us) reactor.cc:625] Submitting negotiation task for client connection to 0.0.0.0:33123 (local address 127.0.0.1:41858)
0925 02:22:55.557910 (+    44us) negotiation.cc:107] Waiting for socket to connect
0925 02:22:55.557920 (+    10us) client_negotiation.cc:174] Beginning negotiation
0925 02:22:55.557972 (+    52us) client_negotiation.cc:252] Sending NEGOTIATE NegotiatePB request
0925 02:22:55.822745 (+264773us) negotiation.cc:327] Negotiation complete: Network error: Client connection negotiation failed: client connection to 0.0.0.0:33123: BlockingRecv error: recv error from unknown peer: Transport endpoint is not connected (error 107)
Metrics: {"client-negotiator.queue_time_us":17}
W20260925 02:22:55.823307 13823 negotiation.cc:337] Failed RPC negotiation. Trace:
0925 02:22:55.559588 (+     0us) reactor.cc:625] Submitting negotiation task for client connection to 0.0.0.0:33123 (local address 127.0.0.1:41880)
0925 02:22:55.559643 (+    55us) negotiation.cc:107] Waiting for socket to connect
0925 02:22:55.559652 (+     9us) client_negotiation.cc:174] Beginning negotiation
0925 02:22:55.559692 (+    40us) client_negotiation.cc:252] Sending NEGOTIATE NegotiatePB request
0925 02:22:55.822745 (+263053us) negotiation.cc:327] Negotiation complete: Network error: Client connection negotiation failed: client connection to 0.0.0.0:33123: BlockingRecv error: recv error from unknown peer: Transport endpoint is not connected (error 107)
Metrics: {"client-negotiator.queue_time_us":34}
[       OK ] Parameters/TestRpcSocketTxRxQueue.OverCapacity/0 (1053 ms)
[----------] 1 test from Parameters/TestRpcSocketTxRxQueue (1053 ms total)

[----------] Global test environment tear-down
[==========] 21 tests from 2 test suites ran. (32018 ms total)
[  PASSED  ] 20 tests.
[  FAILED  ] 1 test, listed below:
[  FAILED  ] Parameters/TestRpc.TestCallWithChainCertAndChainCA/SSL_TCP, where GetParam() = (true, false)

 1 FAILED TEST