Diagnosed failure
Parameters/TestRpc.TestCallWithChainCertAndChainCA/SSL_UnixSocket: /data0/somelongdirectorytoavoidrpathissues/src/kudu/src/kudu/rpc/rpc-test.cc:270: Failure
Failed
Bad status: Runtime error: could not verify certificate chain (error with cert: subject=CN = localhost, ST = sadfjas, C = AS, emailAddress = sdflkdsajf, O = lskdfjlsad, OU = sldfkja, issuer=C = AS, ST = ASDfkjdhf, L = lskdjf, O = saldfja, OU = skdjf, CN = localhost, emailAddress = sadjflkadsj): : certificate has expired
Google Test trace:
/data0/somelongdirectorytoavoidrpathissues/src/kudu/src/kudu/rpc/rpc-test.cc:267: Connecting to unix:/tmp/dist-test-taskjjc8FH/test-tmp/rpc-test-f6effa47cc7e42afb65a45fd00910008.sock
I20260926 19:31:39.855046 379 test_util.cc:175] -----------------------------------------------
I20260926 19:31:39.855154 379 test_util.cc:176] Had fatal failures, leaving test files at /tmp/dist-test-taskjjc8FH/test-tmp/rpc-test.6.Parameters_TestRpc.TestCallWithChainCertAndChainCA_SSL_UnixSocket.1790451099731345-379-0
Full log
Note: This is test shard 7 of 8.
[==========] Running 21 tests from 2 test suites.
[----------] Global test environment set-up.
[----------] 20 tests from Parameters/TestRpc
[ RUN ] Parameters/TestRpc.TestMessengerCreateDestroy/SSL_UnixSocket
WARNING: Logging before InitGoogleLogging() is written to STDERR
I20260926 19:31:39.773452 379 rpc-test.cc:169] started messenger TestCreateDestroy
[ OK ] Parameters/TestRpc.TestMessengerCreateDestroy/SSL_UnixSocket (25 ms)
[ RUN ] Parameters/TestRpc.TestNegotiationDeadlock/SSL_UnixSocket
I20260926 19:31:39.801414 399 acceptor_pool.cc:254] collecting diagnostics on the listening RPC socket unix:/tmp/dist-test-taskjjc8FH/test-tmp/rpc-test-b16ad76a9b2e4c5488d293654677f2e0.sock every 8 connection(s)
I20260926 19:31:39.801739 400 acceptor_pool.cc:254] collecting diagnostics on the listening RPC socket unix:/tmp/dist-test-taskjjc8FH/test-tmp/rpc-test-b16ad76a9b2e4c5488d293654677f2e0.sock every 8 connection(s)
[ OK ] Parameters/TestRpc.TestNegotiationDeadlock/SSL_UnixSocket (45 ms)
[ RUN ] Parameters/TestRpc.TestCallWithChainCertAndChainCA/SSL_UnixSocket
I20260926 19:31:39.842262 415 acceptor_pool.cc:254] collecting diagnostics on the listening RPC socket unix:/tmp/dist-test-taskjjc8FH/test-tmp/rpc-test-f6effa47cc7e42afb65a45fd00910008.sock every 8 connection(s)
I20260926 19:31:39.842619 416 acceptor_pool.cc:254] collecting diagnostics on the listening RPC socket unix:/tmp/dist-test-taskjjc8FH/test-tmp/rpc-test-f6effa47cc7e42afb65a45fd00910008.sock every 8 connection(s)
/data0/somelongdirectorytoavoidrpathissues/src/kudu/src/kudu/rpc/rpc-test.cc:270: Failure
Failed
Bad status: Runtime error: could not verify certificate chain (error with cert: subject=CN = localhost, ST = sadfjas, C = AS, emailAddress = sdflkdsajf, O = lskdfjlsad, OU = sldfkja, issuer=C = AS, ST = ASDfkjdhf, L = lskdjf, O = saldfja, OU = skdjf, CN = localhost, emailAddress = sadjflkadsj): : certificate has expired
Google Test trace:
/data0/somelongdirectorytoavoidrpathissues/src/kudu/src/kudu/rpc/rpc-test.cc:267: Connecting to unix:/tmp/dist-test-taskjjc8FH/test-tmp/rpc-test-f6effa47cc7e42afb65a45fd00910008.sock
I20260926 19:31:39.855046 379 test_util.cc:175] -----------------------------------------------
I20260926 19:31:39.855154 379 test_util.cc:176] Had fatal failures, leaving test files at /tmp/dist-test-taskjjc8FH/test-tmp/rpc-test.6.Parameters_TestRpc.TestCallWithChainCertAndChainCA_SSL_UnixSocket.1790451099731345-379-0
[ FAILED ] Parameters/TestRpc.TestCallWithChainCertAndChainCA/SSL_UnixSocket, where GetParam() = (true, true) (32 ms)
[ RUN ] Parameters/TestRpc.TestCallWithPasswordProtectedKey/SSL_UnixSocket
I20260926 19:31:39.877350 440 acceptor_pool.cc:254] collecting diagnostics on the listening RPC socket unix:/tmp/dist-test-taskjjc8FH/test-tmp/rpc-test-e95d69152a6b4d05b0f8dbda328f28aa.sock every 8 connection(s)
I20260926 19:31:39.877692 441 acceptor_pool.cc:254] collecting diagnostics on the listening RPC socket unix:/tmp/dist-test-taskjjc8FH/test-tmp/rpc-test-e95d69152a6b4d05b0f8dbda328f28aa.sock every 8 connection(s)
W20260926 19:31:39.910406 437 connection.cc:196] Error closing socket: Network error: TlsSocket::Close: Broken pipe
[ OK ] Parameters/TestRpc.TestCallWithPasswordProtectedKey/SSL_UnixSocket (59 ms)
[ RUN ] Parameters/TestRpc.TestCallToBadServer/SSL_UnixSocket
I20260926 19:31:39.930636 379 rpc-test.cc:394] Status: Network error: Client connection negotiation failed: client connection to 0.0.0.0:0: connect: Connection refused (error 111)
I20260926 19:31:39.931383 379 rpc-test.cc:394] Status: Network error: Client connection negotiation failed: client connection to 0.0.0.0:0: connect: Connection refused (error 111)
I20260926 19:31:39.931959 379 rpc-test.cc:394] Status: Network error: Client connection negotiation failed: client connection to 0.0.0.0:0: connect: Connection refused (error 111)
I20260926 19:31:39.932538 379 rpc-test.cc:394] Status: Network error: Client connection negotiation failed: client connection to 0.0.0.0:0: connect: Connection refused (error 111)
I20260926 19:31:39.933050 379 rpc-test.cc:394] Status: Network error: Client connection negotiation failed: client connection to 0.0.0.0:0: connect: Connection refused (error 111)
[ OK ] Parameters/TestRpc.TestCallToBadServer/SSL_UnixSocket (20 ms)
[ RUN ] Parameters/TestRpc.TestWrongService/SSL_UnixSocket
I20260926 19:31:39.956622 475 acceptor_pool.cc:254] collecting diagnostics on the listening RPC socket unix:/tmp/dist-test-taskjjc8FH/test-tmp/rpc-test-431d5ce53bfe401b9a993fa6d429e3b4.sock every 8 connection(s)
I20260926 19:31:39.956909 476 acceptor_pool.cc:254] collecting diagnostics on the listening RPC socket unix:/tmp/dist-test-taskjjc8FH/test-tmp/rpc-test-431d5ce53bfe401b9a993fa6d429e3b4.sock every 8 connection(s)
I20260926 19:31:39.978114 472 messenger.cc:345] service WrongServiceName not registered on TestServer
W20260926 19:31:39.979491 472 connection.cc:196] Error closing socket: Network error: TlsSocket::Close: Broken pipe
[ OK ] Parameters/TestRpc.TestWrongService/SSL_UnixSocket (51 ms)
[ RUN ] Parameters/TestRpc.TestConnectionKeepalive/SSL_UnixSocket
I20260926 19:31:39.997879 498 acceptor_pool.cc:254] collecting diagnostics on the listening RPC socket unix:/tmp/dist-test-taskjjc8FH/test-tmp/rpc-test-5cdb1f5b0d6d47e4816b7e1d917df81c.sock every 8 connection(s)
I20260926 19:31:39.998174 499 acceptor_pool.cc:254] collecting diagnostics on the listening RPC socket unix:/tmp/dist-test-taskjjc8FH/test-tmp/rpc-test-5cdb1f5b0d6d47e4816b7e1d917df81c.sock every 8 connection(s)
I20260926 19:31:39.999080 379 rpc-test.cc:488] Connecting to unix:/tmp/dist-test-taskjjc8FH/test-tmp/rpc-test-5cdb1f5b0d6d47e4816b7e1d917df81c.sock
W20260926 19:31:40.488642 511 connection.cc:196] Error closing socket: Network error: TlsSocket::Close: Broken pipe
[ OK ] Parameters/TestRpc.TestConnectionKeepalive/SSL_UnixSocket (1045 ms)
[ RUN ] Parameters/TestRpc.TestClientConnectionMetrics/SSL_UnixSocket
I20260926 19:31:41.041584 523 acceptor_pool.cc:254] collecting diagnostics on the listening RPC socket unix:/tmp/dist-test-taskjjc8FH/test-tmp/rpc-test-eb189a05e21d442fa74cf86995f406af.sock every 8 connection(s)
I20260926 19:31:41.041873 524 acceptor_pool.cc:254] collecting diagnostics on the listening RPC socket unix:/tmp/dist-test-taskjjc8FH/test-tmp/rpc-test-eb189a05e21d442fa74cf86995f406af.sock every 8 connection(s)
I20260926 19:31:41.042969 379 rpc-test.cc:569] Connecting to unix:/tmp/dist-test-taskjjc8FH/test-tmp/rpc-test-eb189a05e21d442fa74cf86995f406af.sock
W20260926 19:32:02.359818 520 connection.cc:196] Error closing socket: Network error: TlsSocket::Close: Broken pipe
[ OK ] Parameters/TestRpc.TestClientConnectionMetrics/SSL_UnixSocket (21333 ms)
[ RUN ] Parameters/TestRpc.TestCredentialsPolicy/SSL_UnixSocket
I20260926 19:32:02.376410 546 acceptor_pool.cc:254] collecting diagnostics on the listening RPC socket unix:/tmp/dist-test-taskjjc8FH/test-tmp/rpc-test-f8aca6830630438c9105bf9b54dd539b.sock every 8 connection(s)
I20260926 19:32:02.376628 547 acceptor_pool.cc:254] collecting diagnostics on the listening RPC socket unix:/tmp/dist-test-taskjjc8FH/test-tmp/rpc-test-f8aca6830630438c9105bf9b54dd539b.sock every 8 connection(s)
I20260926 19:32:02.377573 379 rpc-test.cc:700] Connecting to unix:/tmp/dist-test-taskjjc8FH/test-tmp/rpc-test-f8aca6830630438c9105bf9b54dd539b.sock
W20260926 19:32:02.398066 545 connection.cc:196] Error closing socket: Network error: TlsSocket::Close: Broken pipe
W20260926 19:32:02.405053 545 connection.cc:196] Error closing socket: Network error: TlsSocket::Close: Broken pipe
[ OK ] Parameters/TestRpc.TestCredentialsPolicy/SSL_UnixSocket (41 ms)
[ RUN ] Parameters/TestRpc.TestCallLongerThanKeepalive/SSL_UnixSocket
I20260926 19:32:02.424521 571 acceptor_pool.cc:254] collecting diagnostics on the listening RPC socket unix:/tmp/dist-test-taskjjc8FH/test-tmp/rpc-test-1882cfb91be64e05ae407cc328ea753c.sock every 8 connection(s)
I20260926 19:32:02.424738 572 acceptor_pool.cc:254] collecting diagnostics on the listening RPC socket unix:/tmp/dist-test-taskjjc8FH/test-tmp/rpc-test-1882cfb91be64e05ae407cc328ea753c.sock every 8 connection(s)
I20260926 19:32:02.464710 575 rpc-test-base.h:222] got call: sleep_micros: 3000000 deferred: true
I20260926 19:32:05.466451 575 rpcz_store.cc:275] Call kudu.rpc.GenericCalculatorService.Sleep from unix:<unnamed> (request call id 0) took 3001 ms. Trace:
I20260926 19:32:05.466598 575 rpcz_store.cc:276] 0926 19:32:02.464575 (+ 0us) service_pool.cc:170] Inserting onto call queue
0926 19:32:02.464665 (+ 90us) service_pool.cc:227] Handling call
0926 19:32:05.466399 (+3001734us) inbound_call.cc:173] Queueing success response
Metrics: {}
W20260926 19:32:05.468853 568 connection.cc:196] Error closing socket: Network error: TlsSocket::Close: Broken pipe
[ OK ] Parameters/TestRpc.TestCallLongerThanKeepalive/SSL_UnixSocket (3064 ms)
[ RUN ] Parameters/TestRpc.TestRpcSidecar/SSL_UnixSocket
I20260926 19:32:05.496841 596 acceptor_pool.cc:254] collecting diagnostics on the listening RPC socket unix:/tmp/dist-test-taskjjc8FH/test-tmp/rpc-test-86d15d9997b844c2ace3935f5308d8a2.sock every 8 connection(s)
I20260926 19:32:05.497109 597 acceptor_pool.cc:254] collecting diagnostics on the listening RPC socket unix:/tmp/dist-test-taskjjc8FH/test-tmp/rpc-test-86d15d9997b844c2ace3935f5308d8a2.sock every 8 connection(s)
W20260926 19:32:05.604614 593 connection.cc:196] Error closing socket: Network error: TlsSocket::Close: Broken pipe
[ OK ] Parameters/TestRpc.TestRpcSidecar/SSL_UnixSocket (134 ms)
[ RUN ] Parameters/TestRpc.TestRpcSidecarLimits/SSL_UnixSocket
I20260926 19:32:07.722975 621 acceptor_pool.cc:254] collecting diagnostics on the listening RPC socket unix:/tmp/dist-test-taskjjc8FH/test-tmp/rpc-test-2749c10c73f44b68abe2f164eda19404.sock every 8 connection(s)
I20260926 19:32:07.723241 622 acceptor_pool.cc:254] collecting diagnostics on the listening RPC socket unix:/tmp/dist-test-taskjjc8FH/test-tmp/rpc-test-2749c10c73f44b68abe2f164eda19404.sock every 8 connection(s)
W20260926 19:32:07.738219 379 serialization.cc:72] Serialized kudu.rpc_test.PushStringsRequestPB (2147483654 bytes) is larger than the maximum configured RPC message size (52428800 bytes). Sending anyway, but peer may reject the data.
W20260926 19:32:07.744165 618 connection.cc:535] server connection from unix:<unnamed> recv error: Network error: RPC frame had a length of 2147483714, but we only support messages up to 52428800 bytes long.
W20260926 19:32:07.744328 618 connection.cc:158] shutting down server connection from unix:<unnamed> with pending inbound data: 4/2147483714 bytes received; last active 0 ns ago: status Network error: RPC frame had a length of 2147483714, but we only support messages up to 52428800 bytes long.
W20260926 19:32:07.744789 634 connection.cc:196] Error closing socket: Network error: TlsSocket::Close: Broken pipe
I20260926 19:32:07.770932 646 acceptor_pool.cc:254] collecting diagnostics on the listening RPC socket unix:/tmp/dist-test-taskjjc8FH/test-tmp/rpc-test-2749c10c73f44b68abe2f164eda19404.sock every 8 connection(s)
I20260926 19:32:07.771354 647 acceptor_pool.cc:254] collecting diagnostics on the listening RPC socket unix:/tmp/dist-test-taskjjc8FH/test-tmp/rpc-test-2749c10c73f44b68abe2f164eda19404.sock every 8 connection(s)
W20260926 19:32:13.558427 643 connection.cc:577] server connection from unix:<unnamed>: received bad data: 'Corruption: Invalid packet: message had a length of 2147483710, but we only support messages up to 2147483647 bytes
'
W20260926 19:32:13.559469 659 connection.cc:196] Error closing socket: Network error: TlsSocket::Close: Broken pipe
[ OK ] Parameters/TestRpc.TestRpcSidecarLimits/SSL_UnixSocket (8448 ms)
[ RUN ] Parameters/TestRpc.TestCallTimeoutDoesntAffectNegotiation/SSL_UnixSocket
I20260926 19:32:14.075299 671 acceptor_pool.cc:254] collecting diagnostics on the listening RPC socket unix:/tmp/dist-test-taskjjc8FH/test-tmp/rpc-test-4d7236b00e9c4d53900f53c069000ac7.sock every 8 connection(s)
I20260926 19:32:14.075562 672 acceptor_pool.cc:254] collecting diagnostics on the listening RPC socket unix:/tmp/dist-test-taskjjc8FH/test-tmp/rpc-test-4d7236b00e9c4d53900f53c069000ac7.sock every 8 connection(s)
W20260926 19:32:14.103389 667 negotiation.cc:266] Injecting 500ms delay in negotiation
I20260926 19:32:14.153939 379 rpc-test-base.h:595] status: Timed out: connection negotiation to unix:/tmp/dist-test-taskjjc8FH/test-tmp/rpc-test-4d7236b00e9c4d53900f53c069000ac7.sock for RPC Sleep timed out after 0.050s (ON_OUTBOUND_QUEUE), seconds elapsed: 0.0511767
[ OK ] Parameters/TestRpc.TestCallTimeoutDoesntAffectNegotiation/SSL_UnixSocket (557 ms)
[ RUN ] Parameters/TestRpc.TestRpcHandlerLatencyMetric/SSL_UnixSocket
I20260926 19:32:14.632628 696 acceptor_pool.cc:254] collecting diagnostics on the listening RPC socket unix:/tmp/dist-test-taskjjc8FH/test-tmp/rpc-test-45dcd910a8f24c86bff1eb3245d5c29f.sock every 8 connection(s)
I20260926 19:32:14.632889 697 acceptor_pool.cc:254] collecting diagnostics on the listening RPC socket unix:/tmp/dist-test-taskjjc8FH/test-tmp/rpc-test-45dcd910a8f24c86bff1eb3245d5c29f.sock every 8 connection(s)
I20260926 19:32:14.697465 379 rpc-test.cc:1236] Sleep() min lat: 20622
I20260926 19:32:14.697580 379 rpc-test.cc:1237] Sleep() mean lat: 20622
I20260926 19:32:14.697623 379 rpc-test.cc:1238] Sleep() max lat: 20622
I20260926 19:32:14.697643 379 rpc-test.cc:1239] Sleep() #calls: 1
W20260926 19:32:14.698845 693 connection.cc:196] Error closing socket: Network error: TlsSocket::Close: Broken pipe
[ OK ] Parameters/TestRpc.TestRpcHandlerLatencyMetric/SSL_UnixSocket (88 ms)
[ RUN ] Parameters/TestRpc.TimedOutOnResponseMetricServiceQueue/SSL_UnixSocket
I20260926 19:32:14.718570 722 acceptor_pool.cc:254] collecting diagnostics on the listening RPC socket unix:/tmp/dist-test-taskjjc8FH/test-tmp/rpc-test-f3bc2a1b59be4b9ba1601933f88eafe9.sock every 8 connection(s)
I20260926 19:32:14.718782 723 acceptor_pool.cc:254] collecting diagnostics on the listening RPC socket unix:/tmp/dist-test-taskjjc8FH/test-tmp/rpc-test-f3bc2a1b59be4b9ba1601933f88eafe9.sock every 8 connection(s)
W20260926 19:32:14.787748 724 rpcz_store.cc:267] Call kudu.rpc_test.CalculatorService.Sleep from unix:<unnamed> (request call id 2) took 20 ms (client timeout 20 ms). Trace:
W20260926 19:32:14.787890 724 rpcz_store.cc:269] 0926 19:32:14.767283 (+ 0us) service_pool.cc:170] Inserting onto call queue
0926 19:32:14.787659 (+ 20376us) service_pool.cc:214] Skipping call since client already timed out
0926 19:32:14.787713 (+ 54us) inbound_call.cc:173] Queueing failure response
Metrics: {}
[ OK ] Parameters/TestRpc.TimedOutOnResponseMetricServiceQueue/SSL_UnixSocket (89 ms)
[ RUN ] Parameters/TestRpc.RpcPendingConnectionsMetric/SSL_UnixSocket
I20260926 19:32:14.796133 745 acceptor_pool.cc:254] collecting diagnostics on the listening RPC socket 0.0.0.0:43725 every 8 connection(s)
I20260926 19:32:14.796344 746 acceptor_pool.cc:254] collecting diagnostics on the listening RPC socket 0.0.0.0:43725 every 8 connection(s)
W20260926 19:32:14.808141 741 negotiation.cc:337] Failed RPC negotiation. Trace:
0926 19:32:14.807274 (+ 0us) reactor.cc:625] Submitting negotiation task for server connection from 127.0.0.1:47950 (local address 127.0.0.1:43725)
0926 19:32:14.807466 (+ 192us) server_negotiation.cc:206] Beginning negotiation
0926 19:32:14.807474 (+ 8us) server_negotiation.cc:399] Waiting for connection header
0926 19:32:14.807672 (+ 198us) negotiation.cc:327] Negotiation complete: Network error: Server connection negotiation failed: server connection from 127.0.0.1:47950: BlockingRecv error: recv got EOF from 127.0.0.1:47950 (error 108)
Metrics: {"server-negotiator.queue_time_us":51}
[ OK ] Parameters/TestRpc.RpcPendingConnectionsMetric/SSL_UnixSocket (28 ms)
[ RUN ] Parameters/TestRpc.TestRpcContextClientDeadline/SSL_UnixSocket
I20260926 19:32:14.832813 761 acceptor_pool.cc:254] collecting diagnostics on the listening RPC socket unix:/tmp/dist-test-taskjjc8FH/test-tmp/rpc-test-cbe0b4db30af48b2ad136701257a0242.sock every 8 connection(s)
I20260926 19:32:14.833096 762 acceptor_pool.cc:254] collecting diagnostics on the listening RPC socket unix:/tmp/dist-test-taskjjc8FH/test-tmp/rpc-test-cbe0b4db30af48b2ad136701257a0242.sock every 8 connection(s)
[ OK ] Parameters/TestRpc.TestRpcContextClientDeadline/SSL_UnixSocket (76 ms)
[ RUN ] Parameters/TestRpc.TestApplicationFeatureFlagUnsupportedServer/SSL_UnixSocket
I20260926 19:32:14.913810 786 acceptor_pool.cc:254] collecting diagnostics on the listening RPC socket unix:/tmp/dist-test-taskjjc8FH/test-tmp/rpc-test-d1a9c1b6c7ee4658b264a00f948a2371.sock every 8 connection(s)
I20260926 19:32:14.914022 787 acceptor_pool.cc:254] collecting diagnostics on the listening RPC socket unix:/tmp/dist-test-taskjjc8FH/test-tmp/rpc-test-d1a9c1b6c7ee4658b264a00f948a2371.sock every 8 connection(s)
[ OK ] Parameters/TestRpc.TestApplicationFeatureFlagUnsupportedServer/SSL_UnixSocket (52 ms)
[ RUN ] Parameters/TestRpc.TestCancellationAsync/SSL_UnixSocket
I20260926 19:32:14.962273 811 acceptor_pool.cc:254] collecting diagnostics on the listening RPC socket unix:/tmp/dist-test-taskjjc8FH/test-tmp/rpc-test-f5caf98620f644cf932636664d0897a7.sock every 8 connection(s)
I20260926 19:32:14.962515 812 acceptor_pool.cc:254] collecting diagnostics on the listening RPC socket unix:/tmp/dist-test-taskjjc8FH/test-tmp/rpc-test-f5caf98620f644cf932636664d0897a7.sock every 8 connection(s)
I20260926 19:32:14.963459 379 rpc-test.cc:1716] Connecting to unix:/tmp/dist-test-taskjjc8FH/test-tmp/rpc-test-f5caf98620f644cf932636664d0897a7.sock
I20260926 19:32:14.981946 379 test_util.cc:268] Using random seed: -471636186
I20260926 19:32:15.017181 815 rpc-test-base.h:240] got call: sleep_micros: 500 pattern: 4294967295 num_repetitions: 2097152 sidecar_idx: 0
I20260926 19:32:15.037038 814 rpc-test-base.h:240] got call: sleep_micros: 500 pattern: 4294967295 num_repetitions: 2097152 sidecar_idx: 0
I20260926 19:32:15.065912 813 rpc-test-base.h:240] got call: sleep_micros: 500 pattern: 4294967295 num_repetitions: 2097152 sidecar_idx: 0
I20260926 19:32:15.102316 814 rpc-test-base.h:240] got call: sleep_micros: 500 pattern: 4294967295 num_repetitions: 2097152 sidecar_idx: 0
I20260926 19:32:15.134464 813 rpc-test-base.h:240] got call: sleep_micros: 500 pattern: 4294967295 num_repetitions: 2097152 sidecar_idx: 0
I20260926 19:32:15.165541 814 rpc-test-base.h:240] got call: sleep_micros: 500 pattern: 4294967295 num_repetitions: 2097152 sidecar_idx: 0
I20260926 19:32:15.193712 813 rpc-test-base.h:240] got call: sleep_micros: 500 pattern: 4294967295 num_repetitions: 2097152 sidecar_idx: 0
W20260926 19:32:15.195766 808 connection.cc:196] Error closing socket: Network error: TlsSocket::Close: Broken pipe
W20260926 19:32:15.211360 808 connection.cc:441] server connection from unix:<unnamed> torn down before Call kudu.rpc.GenericCalculatorService.SleepWithSidecar from unix:<unnamed> (request call id 8) could send its response
W20260926 19:32:15.228866 808 connection.cc:441] server connection from unix:<unnamed> torn down before Call kudu.rpc.GenericCalculatorService.SleepWithSidecar from unix:<unnamed> (request call id 9) could send its response
[ OK ] Parameters/TestRpc.TestCancellationAsync/SSL_UnixSocket (281 ms)
[ RUN ] Parameters/TestRpc.TestPerformanceBySocketType/SSL_UnixSocket
I20260926 19:32:15.250839 836 acceptor_pool.cc:254] collecting diagnostics on the listening RPC socket unix:/tmp/dist-test-taskjjc8FH/test-tmp/rpc-test-8cfb13518b20445cb2b39196342310a5.sock every 8 connection(s)
I20260926 19:32:15.251045 837 acceptor_pool.cc:254] collecting diagnostics on the listening RPC socket unix:/tmp/dist-test-taskjjc8FH/test-tmp/rpc-test-8cfb13518b20445cb2b39196342310a5.sock every 8 connection(s)
I20260926 19:32:15.251919 379 rpc-test.cc:1846] Connecting to unix:/tmp/dist-test-taskjjc8FH/test-tmp/rpc-test-8cfb13518b20445cb2b39196342310a5.sock
I20260926 19:32:18.469551 379 rpc-test.cc:1859] Sending 1024MB via ssl-enabled unix socket: real 3.207s user 3.173s sys 2.284s
I20260926 19:32:21.608945 379 rpc-test.cc:1859] Sending 1024MB via ssl-enabled unix socket: real 3.139s user 3.050s sys 2.245s
I20260926 19:32:24.807159 379 rpc-test.cc:1859] Sending 1024MB via ssl-enabled unix socket: real 3.198s user 3.239s sys 2.189s
I20260926 19:32:27.991380 379 rpc-test.cc:1859] Sending 1024MB via ssl-enabled unix socket: real 3.184s user 3.167s sys 2.247s
I20260926 19:32:31.239115 379 rpc-test.cc:1859] Sending 1024MB via ssl-enabled unix socket: real 3.248s user 3.187s sys 2.318s
W20260926 19:32:31.241339 833 connection.cc:196] Error closing socket: Network error: TlsSocket::Close: Broken pipe
[ OK ] Parameters/TestRpc.TestPerformanceBySocketType/SSL_UnixSocket (16018 ms)
[----------] 20 tests from Parameters/TestRpc (51499 ms total)
[----------] 1 test from Parameters/TestRpcSocketTxRxQueue
[ RUN ] Parameters/TestRpcSocketTxRxQueue.AcceptorRxQueueSizeMetric/0
I20260926 19:32:31.256220 861 acceptor_pool.cc:254] collecting diagnostics on the listening RPC socket 0.0.0.0:44859 every 1 connection(s)
I20260926 19:32:31.256445 862 acceptor_pool.cc:254] collecting diagnostics on the listening RPC socket 0.0.0.0:44859 every 1 connection(s)
W20260926 19:32:31.258090 857 negotiation.cc:337] Failed RPC negotiation. Trace:
0926 19:32:31.257690 (+ 0us) reactor.cc:625] Submitting negotiation task for server connection from 127.0.0.1:35724 (local address 127.0.0.1:44859)
0926 19:32:31.257866 (+ 176us) server_negotiation.cc:206] Beginning negotiation
0926 19:32:31.257870 (+ 4us) server_negotiation.cc:399] Waiting for connection header
0926 19:32:31.257984 (+ 114us) negotiation.cc:327] Negotiation complete: Network error: Server connection negotiation failed: server connection from 127.0.0.1:35724: BlockingRecv error: recv got EOF from 127.0.0.1:35724 (error 108)
Metrics: {"server-negotiator.queue_time_us":55}
[ OK ] Parameters/TestRpcSocketTxRxQueue.AcceptorRxQueueSizeMetric/0 (10 ms)
[----------] 1 test from Parameters/TestRpcSocketTxRxQueue (10 ms total)
[----------] Global test environment tear-down
[==========] 21 tests from 2 test suites ran. (51510 ms total)
[ PASSED ] 20 tests.
[ FAILED ] 1 test, listed below:
[ FAILED ] Parameters/TestRpc.TestCallWithChainCertAndChainCA/SSL_UnixSocket, where GetParam() = (true, true)
1 FAILED TEST