Parameters/TestRpc.TestCallWithChainCertAndRootCA/SSL_UnixSocket: /data0/somelongdirectorytoavoidrpathissues/src/kudu/src/kudu/rpc/rpc-test.cc:303: Failure
Failed
Bad status: Runtime error: could not verify certificate chain (error with cert: subject=CN = localhost, ST = sadfjas, C = AS, emailAddress = sdflkdsajf, O = lskdfjlsad, OU = sldfkja, issuer=C = AS, ST = ASDfkjdhf, L = lskdjf, O = saldfja, OU = skdjf, CN = localhost, emailAddress = sadjflkadsj): : certificate has expired
Google Test trace:
/data0/somelongdirectorytoavoidrpathissues/src/kudu/src/kudu/rpc/rpc-test.cc:300: Connecting to unix:/tmp/dist-test-taskQTi7tq/test-tmp/rpc-test-8e18afb47d1649b5b49734616c848214.sock
I20260928 03:44:36.651240 8798 test_util.cc:175] -----------------------------------------------
I20260928 03:44:36.651409 8798 test_util.cc:176] Had fatal failures, leaving test files at /tmp/dist-test-taskQTi7tq/test-tmp/rpc-test.2.Parameters_TestRpc.TestCallWithChainCertAndRootCA_SSL_UnixSocket.1790567073231504-8798-0
Note: This is test shard 3 of 8.
[==========] Running 21 tests from 2 test suites.
[----------] Global test environment set-up.
[----------] 1 test from TestRpc
[ RUN ] TestRpc.TestNegotiationTimeout
WARNING: Logging before InitGoogleLogging() is written to STDERR
I20260928 03:44:33.418514 8798 rpc-test-base.h:595] status: Timed out: connection negotiation to 0.0.0.0:42175 for RPC Sleep timed out after 0.100s (ON_OUTBOUND_QUEUE), seconds elapsed: 0.100699
W20260928 03:44:36.346197 8808 negotiation.cc:337] Failed RPC negotiation. Trace:
0928 03:44:33.318648 (+ 0us) reactor.cc:625] Submitting negotiation task for client connection to 0.0.0.0:42175 (local address 127.0.0.1:49352)
0928 03:44:33.319469 (+ 821us) negotiation.cc:107] Waiting for socket to connect
0928 03:44:33.319520 (+ 51us) client_negotiation.cc:174] Beginning negotiation
0928 03:44:33.331694 (+ 12174us) client_negotiation.cc:252] Sending NEGOTIATE NegotiatePB request
0928 03:44:36.345129 (+3013435us) negotiation.cc:327] Negotiation complete: Timed out: Client connection negotiation failed: client connection to 0.0.0.0:42175: received 0 of 4 requested bytes
Metrics: {"client-negotiator.queue_time_us":239}
[ OK ] TestRpc.TestNegotiationTimeout (3066 ms)
[----------] 1 test from TestRpc (3066 ms total)
[----------] 20 tests from Parameters/TestRpc
[ RUN ] Parameters/TestRpc.TestAcceptorPoolStartStop/SSL_UnixSocket
I20260928 03:44:36.389958 8824 acceptor_pool.cc:254] collecting diagnostics on the listening RPC socket unix:/tmp/dist-test-taskQTi7tq/test-tmp/rpc-test-af5d6a9ced6c42898dd226a0b97e448f.sock every 8 connection(s)
I20260928 03:44:36.391456 8825 acceptor_pool.cc:254] collecting diagnostics on the listening RPC socket unix:/tmp/dist-test-taskQTi7tq/test-tmp/rpc-test-af5d6a9ced6c42898dd226a0b97e448f.sock every 8 connection(s)
I20260928 03:44:36.427819 8835 acceptor_pool.cc:254] collecting diagnostics on the listening RPC socket unix:/tmp/dist-test-taskQTi7tq/test-tmp/rpc-test-af5d6a9ced6c42898dd226a0b97e448f.sock every 8 connection(s)
I20260928 03:44:36.429108 8836 acceptor_pool.cc:254] collecting diagnostics on the listening RPC socket unix:/tmp/dist-test-taskQTi7tq/test-tmp/rpc-test-af5d6a9ced6c42898dd226a0b97e448f.sock every 8 connection(s)
I20260928 03:44:36.455842 8846 acceptor_pool.cc:254] collecting diagnostics on the listening RPC socket unix:/tmp/dist-test-taskQTi7tq/test-tmp/rpc-test-af5d6a9ced6c42898dd226a0b97e448f.sock every 8 connection(s)
I20260928 03:44:36.456542 8847 acceptor_pool.cc:254] collecting diagnostics on the listening RPC socket unix:/tmp/dist-test-taskQTi7tq/test-tmp/rpc-test-af5d6a9ced6c42898dd226a0b97e448f.sock every 8 connection(s)
I20260928 03:44:36.473649 8857 acceptor_pool.cc:254] collecting diagnostics on the listening RPC socket unix:/tmp/dist-test-taskQTi7tq/test-tmp/rpc-test-af5d6a9ced6c42898dd226a0b97e448f.sock every 8 connection(s)
I20260928 03:44:36.474357 8858 acceptor_pool.cc:254] collecting diagnostics on the listening RPC socket unix:/tmp/dist-test-taskQTi7tq/test-tmp/rpc-test-af5d6a9ced6c42898dd226a0b97e448f.sock every 8 connection(s)
I20260928 03:44:36.506561 8868 acceptor_pool.cc:254] collecting diagnostics on the listening RPC socket unix:/tmp/dist-test-taskQTi7tq/test-tmp/rpc-test-af5d6a9ced6c42898dd226a0b97e448f.sock every 8 connection(s)
I20260928 03:44:36.507243 8869 acceptor_pool.cc:254] collecting diagnostics on the listening RPC socket unix:/tmp/dist-test-taskQTi7tq/test-tmp/rpc-test-af5d6a9ced6c42898dd226a0b97e448f.sock every 8 connection(s)
[ OK ] Parameters/TestRpc.TestAcceptorPoolStartStop/SSL_UnixSocket (161 ms)
[ RUN ] Parameters/TestRpc.TestCall/SSL_UnixSocket
I20260928 03:44:36.542804 8881 acceptor_pool.cc:254] collecting diagnostics on the listening RPC socket unix:/tmp/dist-test-taskQTi7tq/test-tmp/rpc-test-3c8fabd50c70455c9f0b80a53b93614d.sock every 8 connection(s)
I20260928 03:44:36.544698 8882 acceptor_pool.cc:254] collecting diagnostics on the listening RPC socket unix:/tmp/dist-test-taskQTi7tq/test-tmp/rpc-test-3c8fabd50c70455c9f0b80a53b93614d.sock every 8 connection(s)
I20260928 03:44:36.549330 8798 rpc-test.cc:234] Connecting to unix:/tmp/dist-test-taskQTi7tq/test-tmp/rpc-test-3c8fabd50c70455c9f0b80a53b93614d.sock
W20260928 03:44:36.594292 8878 connection.cc:196] Error closing socket: Network error: TlsSocket::Close: Broken pipe
[ OK ] Parameters/TestRpc.TestCall/SSL_UnixSocket (91 ms)
[ RUN ] Parameters/TestRpc.TestCallWithChainCertAndRootCA/SSL_UnixSocket
I20260928 03:44:36.631867 8906 acceptor_pool.cc:254] collecting diagnostics on the listening RPC socket unix:/tmp/dist-test-taskQTi7tq/test-tmp/rpc-test-8e18afb47d1649b5b49734616c848214.sock every 8 connection(s)
I20260928 03:44:36.632531 8907 acceptor_pool.cc:254] collecting diagnostics on the listening RPC socket unix:/tmp/dist-test-taskQTi7tq/test-tmp/rpc-test-8e18afb47d1649b5b49734616c848214.sock every 8 connection(s)
/data0/somelongdirectorytoavoidrpathissues/src/kudu/src/kudu/rpc/rpc-test.cc:303: Failure
Failed
Bad status: Runtime error: could not verify certificate chain (error with cert: subject=CN = localhost, ST = sadfjas, C = AS, emailAddress = sdflkdsajf, O = lskdfjlsad, OU = sldfkja, issuer=C = AS, ST = ASDfkjdhf, L = lskdjf, O = saldfja, OU = skdjf, CN = localhost, emailAddress = sadjflkadsj): : certificate has expired
Google Test trace:
/data0/somelongdirectorytoavoidrpathissues/src/kudu/src/kudu/rpc/rpc-test.cc:300: Connecting to unix:/tmp/dist-test-taskQTi7tq/test-tmp/rpc-test-8e18afb47d1649b5b49734616c848214.sock
I20260928 03:44:36.651240 8798 test_util.cc:175] -----------------------------------------------
I20260928 03:44:36.651409 8798 test_util.cc:176] Had fatal failures, leaving test files at /tmp/dist-test-taskQTi7tq/test-tmp/rpc-test.2.Parameters_TestRpc.TestCallWithChainCertAndRootCA_SSL_UnixSocket.1790567073231504-8798-0
[ FAILED ] Parameters/TestRpc.TestCallWithChainCertAndRootCA/SSL_UnixSocket, where GetParam() = (true, true) (48 ms)
[ RUN ] Parameters/TestRpc.TestCallWithBadPasswordProtectedKey/SSL_UnixSocket
[ OK ] Parameters/TestRpc.TestCallWithBadPasswordProtectedKey/SSL_UnixSocket (29 ms)
[ RUN ] Parameters/TestRpc.TestInvalidMethodCall/SSL_UnixSocket
I20260928 03:44:36.698652 8943 acceptor_pool.cc:254] collecting diagnostics on the listening RPC socket unix:/tmp/dist-test-taskQTi7tq/test-tmp/rpc-test-17bc9727b73c4950a295b4fb67c72d0e.sock every 8 connection(s)
I20260928 03:44:36.699426 8944 acceptor_pool.cc:254] collecting diagnostics on the listening RPC socket unix:/tmp/dist-test-taskQTi7tq/test-tmp/rpc-test-17bc9727b73c4950a295b4fb67c72d0e.sock every 8 connection(s)
I20260928 03:44:36.702818 8798 rpc-test.cc:406] Connecting to unix:/tmp/dist-test-taskQTi7tq/test-tmp/rpc-test-17bc9727b73c4950a295b4fb67c72d0e.sock
W20260928 03:44:36.728663 8940 connection.cc:196] Error closing socket: Network error: TlsSocket::Close: Broken pipe
[ OK ] Parameters/TestRpc.TestInvalidMethodCall/SSL_UnixSocket (53 ms)
[ RUN ] Parameters/TestRpc.TestHighFDs/SSL_UnixSocket
I20260928 03:44:36.953703 8968 acceptor_pool.cc:254] collecting diagnostics on the listening RPC socket unix:/tmp/dist-test-taskQTi7tq/test-tmp/rpc-test-16c44f11196c488daf40b1d4ca627669.sock every 8 connection(s)
I20260928 03:44:36.954558 8969 acceptor_pool.cc:254] collecting diagnostics on the listening RPC socket unix:/tmp/dist-test-taskQTi7tq/test-tmp/rpc-test-16c44f11196c488daf40b1d4ca627669.sock every 8 connection(s)
W20260928 03:44:36.995266 8965 connection.cc:196] Error closing socket: Network error: TlsSocket::Close: Broken pipe
[ OK ] Parameters/TestRpc.TestHighFDs/SSL_UnixSocket (273 ms)
[ RUN ] Parameters/TestRpc.TestConnectionAlwaysKeepalive/SSL_UnixSocket
I20260928 03:44:37.031862 8991 acceptor_pool.cc:254] collecting diagnostics on the listening RPC socket unix:/tmp/dist-test-taskQTi7tq/test-tmp/rpc-test-d003767cf31241cb8fd49c25faa2ee95.sock every 8 connection(s)
I20260928 03:44:37.032601 8992 acceptor_pool.cc:254] collecting diagnostics on the listening RPC socket unix:/tmp/dist-test-taskQTi7tq/test-tmp/rpc-test-d003767cf31241cb8fd49c25faa2ee95.sock every 8 connection(s)
I20260928 03:44:37.035612 8798 rpc-test.cc:532] Connecting to unix:/tmp/dist-test-taskQTi7tq/test-tmp/rpc-test-d003767cf31241cb8fd49c25faa2ee95.sock
W20260928 03:44:40.067709 8990 connection.cc:196] Error closing socket: Network error: TlsSocket::Close: Broken pipe
[ OK ] Parameters/TestRpc.TestConnectionAlwaysKeepalive/SSL_UnixSocket (3064 ms)
[ RUN ] Parameters/TestRpc.TestReopenOutboundConnections/SSL_UnixSocket
I20260928 03:44:40.100852 9014 acceptor_pool.cc:254] collecting diagnostics on the listening RPC socket unix:/tmp/dist-test-taskQTi7tq/test-tmp/rpc-test-7ade8d4eccc3429bae1336a65dd9ee60.sock every 8 connection(s)
I20260928 03:44:40.101550 9015 acceptor_pool.cc:254] collecting diagnostics on the listening RPC socket unix:/tmp/dist-test-taskQTi7tq/test-tmp/rpc-test-7ade8d4eccc3429bae1336a65dd9ee60.sock every 8 connection(s)
I20260928 03:44:40.104616 8798 rpc-test.cc:658] Connecting to unix:/tmp/dist-test-taskQTi7tq/test-tmp/rpc-test-7ade8d4eccc3429bae1336a65dd9ee60.sock
W20260928 03:44:40.134001 9013 connection.cc:196] Error closing socket: Network error: TlsSocket::Close: Broken pipe
W20260928 03:44:40.143255 9013 connection.cc:196] Error closing socket: Network error: TlsSocket::Close: Broken pipe
W20260928 03:44:40.152380 9013 connection.cc:196] Error closing socket: Network error: TlsSocket::Close: Broken pipe
W20260928 03:44:40.162360 9013 connection.cc:196] Error closing socket: Network error: TlsSocket::Close: Broken pipe
W20260928 03:44:40.172015 9013 connection.cc:196] Error closing socket: Network error: TlsSocket::Close: Broken pipe
W20260928 03:44:40.181473 9013 connection.cc:196] Error closing socket: Network error: TlsSocket::Close: Broken pipe
W20260928 03:44:40.191231 9013 connection.cc:196] Error closing socket: Network error: TlsSocket::Close: Broken pipe
W20260928 03:44:40.200700 9013 connection.cc:196] Error closing socket: Network error: TlsSocket::Close: Broken pipe
W20260928 03:44:40.210642 9013 connection.cc:196] Error closing socket: Network error: TlsSocket::Close: Broken pipe
W20260928 03:44:40.221366 9013 connection.cc:196] Error closing socket: Network error: TlsSocket::Close: Broken pipe
W20260928 03:44:40.231279 9013 connection.cc:196] Error closing socket: Network error: TlsSocket::Close: Broken pipe
W20260928 03:44:40.241140 9013 connection.cc:196] Error closing socket: Network error: TlsSocket::Close: Broken pipe
W20260928 03:44:40.251269 9013 connection.cc:196] Error closing socket: Network error: TlsSocket::Close: Broken pipe
W20260928 03:44:40.261173 9013 connection.cc:196] Error closing socket: Network error: TlsSocket::Close: Broken pipe
W20260928 03:44:40.261236 9014 acceptor_pool.cc:285] unable to collect diagnostics on RPC socket unix:/tmp/dist-test-taskQTi7tq/test-tmp/rpc-test-7ade8d4eccc3429bae1336a65dd9ee60.sock: Not implemented: netlink diagnostics is currently supported only on IPv4 TCP sockets
W20260928 03:44:40.270901 9013 connection.cc:196] Error closing socket: Network error: TlsSocket::Close: Broken pipe
W20260928 03:44:40.280299 9013 connection.cc:196] Error closing socket: Network error: TlsSocket::Close: Broken pipe
W20260928 03:44:40.289937 9013 connection.cc:196] Error closing socket: Network error: TlsSocket::Close: Broken pipe
W20260928 03:44:40.299609 9013 connection.cc:196] Error closing socket: Network error: TlsSocket::Close: Broken pipe
W20260928 03:44:40.309270 9013 connection.cc:196] Error closing socket: Network error: TlsSocket::Close: Broken pipe
W20260928 03:44:40.319185 9013 connection.cc:196] Error closing socket: Network error: TlsSocket::Close: Broken pipe
W20260928 03:44:40.329054 9013 connection.cc:196] Error closing socket: Network error: TlsSocket::Close: Broken pipe
W20260928 03:44:40.338470 9013 connection.cc:196] Error closing socket: Network error: TlsSocket::Close: Broken pipe
W20260928 03:44:40.347882 9013 connection.cc:196] Error closing socket: Network error: TlsSocket::Close: Broken pipe
W20260928 03:44:40.357213 9013 connection.cc:196] Error closing socket: Network error: TlsSocket::Close: Broken pipe
W20260928 03:44:40.366129 9013 connection.cc:196] Error closing socket: Network error: TlsSocket::Close: Broken pipe
W20260928 03:44:40.374570 9013 connection.cc:196] Error closing socket: Network error: TlsSocket::Close: Broken pipe
W20260928 03:44:40.383052 9013 connection.cc:196] Error closing socket: Network error: TlsSocket::Close: Broken pipe
W20260928 03:44:40.391620 9013 connection.cc:196] Error closing socket: Network error: TlsSocket::Close: Broken pipe
W20260928 03:44:40.400738 9013 connection.cc:196] Error closing socket: Network error: TlsSocket::Close: Broken pipe
W20260928 03:44:40.409736 9013 connection.cc:196] Error closing socket: Network error: TlsSocket::Close: Broken pipe
W20260928 03:44:40.418620 9013 connection.cc:196] Error closing socket: Network error: TlsSocket::Close: Broken pipe
W20260928 03:44:40.428761 9013 connection.cc:196] Error closing socket: Network error: TlsSocket::Close: Broken pipe
[ OK ] Parameters/TestRpc.TestReopenOutboundConnections/SSL_UnixSocket (360 ms)
[ RUN ] Parameters/TestRpc.TestConnectionNetworkPlane/SSL_UnixSocket
I20260928 03:44:40.456207 9037 acceptor_pool.cc:254] collecting diagnostics on the listening RPC socket unix:/tmp/dist-test-taskQTi7tq/test-tmp/rpc-test-0f4dd92d9f584e22b944ae3a8a921dde.sock every 8 connection(s)
I20260928 03:44:40.456946 9038 acceptor_pool.cc:254] collecting diagnostics on the listening RPC socket unix:/tmp/dist-test-taskQTi7tq/test-tmp/rpc-test-0f4dd92d9f584e22b944ae3a8a921dde.sock every 8 connection(s)
I20260928 03:44:40.460045 8798 rpc-test.cc:772] Connecting to unix:/tmp/dist-test-taskQTi7tq/test-tmp/rpc-test-0f4dd92d9f584e22b944ae3a8a921dde.sock
W20260928 03:44:40.506091 9036 connection.cc:196] Error closing socket: Network error: TlsSocket::Close: Broken pipe
[ OK ] Parameters/TestRpc.TestConnectionNetworkPlane/SSL_UnixSocket (77 ms)
[ RUN ] Parameters/TestRpc.TestTCPKeepalive/SSL_UnixSocket
I20260928 03:44:40.540587 9062 acceptor_pool.cc:254] collecting diagnostics on the listening RPC socket unix:/tmp/dist-test-taskQTi7tq/test-tmp/rpc-test-e9f3988c2c9b430e9eb550ac783ffdff.sock every 8 connection(s)
I20260928 03:44:40.541231 9063 acceptor_pool.cc:254] collecting diagnostics on the listening RPC socket unix:/tmp/dist-test-taskQTi7tq/test-tmp/rpc-test-e9f3988c2c9b430e9eb550ac783ffdff.sock every 8 connection(s)
I20260928 03:44:40.569911 9066 rpc-test-base.h:222] got call: sleep_micros: 8000000 deferred: true
I20260928 03:44:48.574043 9066 rpcz_store.cc:275] Call kudu.rpc.GenericCalculatorService.Sleep from unix:<unnamed> (request call id 0) took 8004 ms. Trace:
I20260928 03:44:48.574442 9066 rpcz_store.cc:276] 0928 03:44:40.569728 (+ 0us) service_pool.cc:170] Inserting onto call queue
0928 03:44:40.569854 (+ 126us) service_pool.cc:227] Handling call
0928 03:44:48.573874 (+8004020us) inbound_call.cc:173] Queueing success response
Metrics: {}
W20260928 03:44:48.580328 9059 connection.cc:196] Error closing socket: Network error: TlsSocket::Close: Broken pipe
[ OK ] Parameters/TestRpc.TestTCPKeepalive/SSL_UnixSocket (8075 ms)
[ RUN ] Parameters/TestRpc.TestMaxSmallSidecars/SSL_UnixSocket
I20260928 03:44:48.621183 9088 acceptor_pool.cc:254] collecting diagnostics on the listening RPC socket unix:/tmp/dist-test-taskQTi7tq/test-tmp/rpc-test-1f0e0dc944d14eb996a62f347e1eb288.sock every 8 connection(s)
I20260928 03:44:48.622040 9089 acceptor_pool.cc:254] collecting diagnostics on the listening RPC socket unix:/tmp/dist-test-taskQTi7tq/test-tmp/rpc-test-1f0e0dc944d14eb996a62f347e1eb288.sock every 8 connection(s)
W20260928 03:44:48.781105 9085 connection.cc:196] Error closing socket: Network error: TlsSocket::Close: Broken pipe
[ OK ] Parameters/TestRpc.TestMaxSmallSidecars/SSL_UnixSocket (198 ms)
[ RUN ] Parameters/TestRpc.TestCallTimeout/SSL_UnixSocket
I20260928 03:44:48.809005 9113 acceptor_pool.cc:254] collecting diagnostics on the listening RPC socket unix:/tmp/dist-test-taskQTi7tq/test-tmp/rpc-test-35f332fe87f94d0bac87e2e3a658be93.sock every 8 connection(s)
I20260928 03:44:48.809685 9114 acceptor_pool.cc:254] collecting diagnostics on the listening RPC socket unix:/tmp/dist-test-taskQTi7tq/test-tmp/rpc-test-35f332fe87f94d0bac87e2e3a658be93.sock every 8 connection(s)
I20260928 03:44:48.836782 8798 rpc-test-base.h:595] status: Timed out: connection negotiation to unix:/tmp/dist-test-taskQTi7tq/test-tmp/rpc-test-35f332fe87f94d0bac87e2e3a658be93.sock for RPC Sleep timed out after 0.000s (ON_OUTBOUND_QUEUE), seconds elapsed: 0.00229075
I20260928 03:44:48.843951 9117 rpc-test-base.h:222] got call: sleep_micros: 700000
I20260928 03:44:49.037925 8798 rpc-test-base.h:595] status: Timed out: Sleep RPC to unix:/tmp/dist-test-taskQTi7tq/test-tmp/rpc-test-35f332fe87f94d0bac87e2e3a658be93.sock timed out after 0.200s (SENT), seconds elapsed: 0.200835
I20260928 03:44:49.039372 9116 rpc-test-base.h:222] got call: sleep_micros: 2000000
W20260928 03:44:49.544600 9117 rpcz_store.cc:267] Call kudu.rpc.GenericCalculatorService.Sleep from unix:<unnamed> (request call id 1) took 700 ms (client timeout 200 ms). Trace:
W20260928 03:44:49.544926 9117 rpcz_store.cc:269] 0928 03:44:48.843806 (+ 0us) service_pool.cc:170] Inserting onto call queue
0928 03:44:48.843908 (+ 102us) service_pool.cc:227] Handling call
0928 03:44:49.544544 (+700636us) inbound_call.cc:173] Queueing success response
Metrics: {}
I20260928 03:44:50.540127 8798 rpc-test-base.h:595] status: Timed out: Sleep RPC to unix:/tmp/dist-test-taskQTi7tq/test-tmp/rpc-test-35f332fe87f94d0bac87e2e3a658be93.sock timed out after 1.500s (SENT), seconds elapsed: 1.50187
W20260928 03:44:51.040040 9116 rpcz_store.cc:267] Call kudu.rpc.GenericCalculatorService.Sleep from unix:<unnamed> (request call id 2) took 2001 ms (client timeout 1500 ms). Trace:
W20260928 03:44:51.040349 9116 rpcz_store.cc:269] 0928 03:44:49.039053 (+ 0us) service_pool.cc:170] Inserting onto call queue
0928 03:44:49.039212 (+ 159us) service_pool.cc:227] Handling call
0928 03:44:51.039979 (+2000767us) inbound_call.cc:173] Queueing success response
Metrics: {}
W20260928 03:44:51.040992 9110 connection.cc:441] server connection from unix:<unnamed> torn down before Call kudu.rpc.GenericCalculatorService.Sleep from unix:<unnamed> (request call id 2) could send its response
[ OK ] Parameters/TestRpc.TestCallTimeout/SSL_UnixSocket (2260 ms)
[ RUN ] Parameters/TestRpc.TestServerShutsDown/SSL_UnixSocket
I20260928 03:44:51.047865 8798 rpc-test.cc:1125] Connecting to 0.0.0.0:41747
W20260928 03:44:51.056591 9130 negotiation.cc:337] Failed RPC negotiation. Trace:
0928 03:44:51.055077 (+ 0us) reactor.cc:625] Submitting negotiation task for client connection to 0.0.0.0:41747 (local address 127.0.0.1:45926)
0928 03:44:51.055537 (+ 460us) negotiation.cc:107] Waiting for socket to connect
0928 03:44:51.055569 (+ 32us) client_negotiation.cc:174] Beginning negotiation
0928 03:44:51.055797 (+ 228us) client_negotiation.cc:252] Sending NEGOTIATE NegotiatePB request
0928 03:44:51.056050 (+ 253us) negotiation.cc:327] Negotiation complete: Network error: Client connection negotiation failed: client connection to 0.0.0.0:41747: BlockingWrite error: write error: Broken pipe (error 32)
Metrics: {"client-negotiator.queue_time_us":121}
[ OK ] Parameters/TestRpc.TestServerShutsDown/SSL_UnixSocket (12 ms)
[ RUN ] Parameters/TestRpc.TimedOutOnResponseMetric/SSL_UnixSocket
I20260928 03:44:51.083384 9147 acceptor_pool.cc:254] collecting diagnostics on the listening RPC socket unix:/tmp/dist-test-taskQTi7tq/test-tmp/rpc-test-91b84eccd2c44ffa9ec6951e306c95d2.sock every 8 connection(s)
I20260928 03:44:51.084044 9148 acceptor_pool.cc:254] collecting diagnostics on the listening RPC socket unix:/tmp/dist-test-taskQTi7tq/test-tmp/rpc-test-91b84eccd2c44ffa9ec6951e306c95d2.sock every 8 connection(s)
W20260928 03:44:51.316847 9151 rpcz_store.cc:267] Call kudu.rpc_test.CalculatorService.Sleep from unix:<unnamed> (request call id 3) took 50 ms (client timeout 25 ms). Trace:
W20260928 03:44:51.317186 9151 rpcz_store.cc:269] 0928 03:44:51.266185 (+ 0us) service_pool.cc:170] Inserting onto call queue
0928 03:44:51.266316 (+ 131us) service_pool.cc:227] Handling call
0928 03:44:51.316768 (+ 50452us) inbound_call.cc:173] Queueing success response
Related trace 'test_child':
Metrics: {"test_sleep_us":50000,"child_traces":[["test_child",{"related_trace_metric":1}]]}
W20260928 03:44:51.376575 9151 rpcz_store.cc:267] Call kudu.rpc_test.CalculatorService.Sleep from unix:<unnamed> (request call id 4) took 50 ms (client timeout 50 ms). Trace:
W20260928 03:44:51.376861 9151 rpcz_store.cc:269] 0928 03:44:51.325920 (+ 0us) service_pool.cc:170] Inserting onto call queue
0928 03:44:51.326048 (+ 128us) service_pool.cc:227] Handling call
0928 03:44:51.376451 (+ 50403us) inbound_call.cc:173] Queueing success response
Related trace 'test_child':
Metrics: {"test_sleep_us":50000,"child_traces":[["test_child",{"related_trace_metric":1}]]}
W20260928 03:44:51.380906 9144 connection.cc:196] Error closing socket: Network error: TlsSocket::Close: Broken pipe
[ OK ] Parameters/TestRpc.TimedOutOnResponseMetric/SSL_UnixSocket (328 ms)
[ RUN ] Parameters/TestRpc.AcceptorDispatchingTimesMetric/SSL_UnixSocket
I20260928 03:44:51.399276 9172 acceptor_pool.cc:254] collecting diagnostics on the listening RPC socket 0.0.0.0:42339 every 8 connection(s)
I20260928 03:44:51.399993 9173 acceptor_pool.cc:254] collecting diagnostics on the listening RPC socket 0.0.0.0:42339 every 8 connection(s)
W20260928 03:44:51.405959 9168 negotiation.cc:337] Failed RPC negotiation. Trace:
0928 03:44:51.403596 (+ 0us) reactor.cc:625] Submitting negotiation task for server connection from 127.0.0.1:49118 (local address 127.0.0.1:42339)
0928 03:44:51.404156 (+ 560us) server_negotiation.cc:206] Beginning negotiation
0928 03:44:51.404185 (+ 29us) server_negotiation.cc:399] Waiting for connection header
0928 03:44:51.404549 (+ 364us) negotiation.cc:327] Negotiation complete: Network error: Server connection negotiation failed: server connection from 127.0.0.1:49118: BlockingRecv error: recv got EOF from 127.0.0.1:49118 (error 108)
Metrics: {"server-negotiator.queue_time_us":126}
[ OK ] Parameters/TestRpc.AcceptorDispatchingTimesMetric/SSL_UnixSocket (21 ms)
[ RUN ] Parameters/TestRpc.TestRpcCallbackDestroysMessenger/SSL_UnixSocket
[ OK ] Parameters/TestRpc.TestRpcCallbackDestroysMessenger/SSL_UnixSocket (19 ms)
[ RUN ] Parameters/TestRpc.TestApplicationFeatureFlag/SSL_UnixSocket
I20260928 03:44:51.445429 9197 acceptor_pool.cc:254] collecting diagnostics on the listening RPC socket unix:/tmp/dist-test-taskQTi7tq/test-tmp/rpc-test-10f783c4f3d348c6bf0a7f6c453f0ab2.sock every 8 connection(s)
I20260928 03:44:51.446105 9198 acceptor_pool.cc:254] collecting diagnostics on the listening RPC socket unix:/tmp/dist-test-taskQTi7tq/test-tmp/rpc-test-10f783c4f3d348c6bf0a7f6c453f0ab2.sock every 8 connection(s)
W20260928 03:44:51.493422 9194 messenger.cc:357] Unable to handle RPC call: Not implemented: call requires unsupported application feature flags: 99
[ OK ] Parameters/TestRpc.TestApplicationFeatureFlag/SSL_UnixSocket (72 ms)
[ RUN ] Parameters/TestRpc.TestCancellation/SSL_UnixSocket
I20260928 03:44:51.521181 9222 acceptor_pool.cc:254] collecting diagnostics on the listening RPC socket unix:/tmp/dist-test-taskQTi7tq/test-tmp/rpc-test-78a9ddb54fed44cf88ab5741d2920923.sock every 8 connection(s)
I20260928 03:44:51.522054 9223 acceptor_pool.cc:254] collecting diagnostics on the listening RPC socket unix:/tmp/dist-test-taskQTi7tq/test-tmp/rpc-test-78a9ddb54fed44cf88ab5741d2920923.sock every 8 connection(s)
I20260928 03:44:51.525307 8798 rpc-test.cc:1648] Connecting to unix:/tmp/dist-test-taskQTi7tq/test-tmp/rpc-test-78a9ddb54fed44cf88ab5741d2920923.sock
I20260928 03:44:51.622808 8798 rpc-test-base.h:595] status: Aborted: Sleep RPC to unix:/tmp/dist-test-taskQTi7tq/test-tmp/rpc-test-78a9ddb54fed44cf88ab5741d2920923.sock is cancelled in state READY, seconds elapsed: 0.000498783
I20260928 03:44:51.797912 8798 rpc-test-base.h:595] status: Aborted: Sleep RPC to unix:/tmp/dist-test-taskQTi7tq/test-tmp/rpc-test-78a9ddb54fed44cf88ab5741d2920923.sock is cancelled in state SENT, seconds elapsed: 0.000893434
I20260928 03:44:51.798113 9225 rpc-test-base.h:222] got call: sleep_micros: 510000
I20260928 03:44:51.973163 8798 rpc-test-base.h:595] status: Aborted: Sleep RPC to unix:/tmp/dist-test-taskQTi7tq/test-tmp/rpc-test-78a9ddb54fed44cf88ab5741d2920923.sock is cancelled in state SENT, seconds elapsed: 0.000717992
I20260928 03:44:51.973472 9224 rpc-test-base.h:222] got call: sleep_micros: 510000
I20260928 03:44:52.139957 8798 rpc-test-base.h:595] status: Aborted: Sleep RPC to unix:/tmp/dist-test-taskQTi7tq/test-tmp/rpc-test-78a9ddb54fed44cf88ab5741d2920923.sock is cancelled in state SENT, seconds elapsed: 0.00088496
W20260928 03:44:52.151131 9226 rpcz_store.cc:267] Call kudu.rpc.GenericCalculatorService.Sleep from unix:<unnamed> (request call id 11) took 11 ms (client timeout 10 ms). Trace:
W20260928 03:44:52.151441 9226 rpcz_store.cc:269] 0928 03:44:52.139920 (+ 0us) service_pool.cc:170] Inserting onto call queue
0928 03:44:52.150880 (+ 10960us) service_pool.cc:214] Skipping call since client already timed out
0928 03:44:52.150962 (+ 82us) inbound_call.cc:173] Queueing failure response
Metrics: {}
I20260928 03:44:52.151935 9226 rpc-test-base.h:222] got call: sleep_micros: 1500000
W20260928 03:44:52.308684 9225 rpcz_store.cc:267] Call kudu.rpc.GenericCalculatorService.Sleep from unix:<unnamed> (request call id 3) took 510 ms (client timeout 10 ms). Trace:
W20260928 03:44:52.308987 9225 rpcz_store.cc:269] 0928 03:44:51.797961 (+ 0us) service_pool.cc:170] Inserting onto call queue
0928 03:44:51.798070 (+ 109us) service_pool.cc:227] Handling call
0928 03:44:52.308627 (+510557us) inbound_call.cc:173] Queueing success response
Metrics: {}
W20260928 03:44:52.484033 9224 rpcz_store.cc:267] Call kudu.rpc.GenericCalculatorService.Sleep from unix:<unnamed> (request call id 7) took 510 ms (client timeout 10 ms). Trace:
W20260928 03:44:52.484367 9224 rpcz_store.cc:269] 0928 03:44:51.973294 (+ 0us) service_pool.cc:170] Inserting onto call queue
0928 03:44:51.973421 (+ 127us) service_pool.cc:227] Handling call
0928 03:44:52.483977 (+510556us) inbound_call.cc:173] Queueing success response
Metrics: {}
I20260928 03:44:53.141525 8798 rpc-test-base.h:595] status: Timed out: Sleep RPC to unix:/tmp/dist-test-taskQTi7tq/test-tmp/rpc-test-78a9ddb54fed44cf88ab5741d2920923.sock timed out after 1.000s (SENT), seconds elapsed: 1.00124
I20260928 03:44:53.142709 9224 rpc-test-base.h:222] got call: sleep_micros: 1500000
W20260928 03:44:53.652662 9226 rpcz_store.cc:267] Call kudu.rpc.GenericCalculatorService.Sleep from unix:<unnamed> (request call id 12) took 1511 ms (client timeout 1000 ms). Trace:
W20260928 03:44:53.653083 9226 rpcz_store.cc:269] 0928 03:44:52.140969 (+ 0us) service_pool.cc:170] Inserting onto call queue
0928 03:44:52.151898 (+ 10929us) service_pool.cc:227] Handling call
0928 03:44:53.652486 (+1500588us) inbound_call.cc:173] Queueing success response
Metrics: {}
I20260928 03:44:54.143975 8798 rpc-test-base.h:595] status: Timed out: Sleep RPC to unix:/tmp/dist-test-taskQTi7tq/test-tmp/rpc-test-78a9ddb54fed44cf88ab5741d2920923.sock timed out after 1.000s (SENT), seconds elapsed: 1.00202
W20260928 03:44:54.145551 9219 messenger.cc:357] Unable to handle RPC call: Not implemented: call requires unsupported application feature flags: 99, 1
W20260928 03:44:54.146934 9219 messenger.cc:357] Unable to handle RPC call: Not implemented: call requires unsupported application feature flags: 99, 1
W20260928 03:44:54.352675 9219 connection.cc:196] Error closing socket: Network error: TlsSocket::Close: Broken pipe
W20260928 03:44:54.643337 9224 rpcz_store.cc:267] Call kudu.rpc.GenericCalculatorService.Sleep from unix:<unnamed> (request call id 13) took 1500 ms (client timeout 1000 ms). Trace:
W20260928 03:44:54.643653 9224 rpcz_store.cc:269] 0928 03:44:53.142519 (+ 0us) service_pool.cc:170] Inserting onto call queue
0928 03:44:53.142664 (+ 145us) service_pool.cc:227] Handling call
0928 03:44:54.643191 (+1500527us) inbound_call.cc:173] Queueing success response
Metrics: {}
W20260928 03:44:54.644224 9219 connection.cc:441] server connection from unix:<unnamed> torn down before Call kudu.rpc.GenericCalculatorService.Sleep from unix:<unnamed> (request call id 13) could send its response
[ OK ] Parameters/TestRpc.TestCancellation/SSL_UnixSocket (3150 ms)
[ RUN ] Parameters/TestRpc.TestCancellationMultiThreads/SSL_UnixSocket
I20260928 03:44:54.673853 9248 acceptor_pool.cc:254] collecting diagnostics on the listening RPC socket unix:/tmp/dist-test-taskQTi7tq/test-tmp/rpc-test-3a765936928541e28edcfde1e06de967.sock every 8 connection(s)
I20260928 03:44:54.674681 9249 acceptor_pool.cc:254] collecting diagnostics on the listening RPC socket unix:/tmp/dist-test-taskQTi7tq/test-tmp/rpc-test-3a765936928541e28edcfde1e06de967.sock every 8 connection(s)
I20260928 03:44:54.677766 8798 rpc-test.cc:1808] Connecting to unix:/tmp/dist-test-taskQTi7tq/test-tmp/rpc-test-3a765936928541e28edcfde1e06de967.sock
I20260928 03:44:54.831136 9262 test_util.cc:268] Using random seed: -475904075
I20260928 03:44:54.832103 9263 test_util.cc:268] Using random seed: -475903024
I20260928 03:44:54.833447 9264 test_util.cc:268] Using random seed: -475901686
I20260928 03:44:54.834946 9265 test_util.cc:268] Using random seed: -475900302
I20260928 03:44:54.836429 9266 test_util.cc:268] Using random seed: -475898847
I20260928 03:44:54.837795 9267 test_util.cc:268] Using random seed: -475897457
I20260928 03:44:54.839385 9268 test_util.cc:268] Using random seed: -475895897
I20260928 03:44:54.840799 9269 test_util.cc:268] Using random seed: -475894454
I20260928 03:44:54.842355 9270 test_util.cc:268] Using random seed: -475892897
I20260928 03:44:54.844323 9271 test_util.cc:268] Using random seed: -475890901
I20260928 03:44:54.845654 9272 test_util.cc:268] Using random seed: -475889601
I20260928 03:44:54.847066 9273 test_util.cc:268] Using random seed: -475888196
I20260928 03:44:54.848664 9274 test_util.cc:268] Using random seed: -475886638
I20260928 03:44:54.850207 9275 test_util.cc:268] Using random seed: -475885097
I20260928 03:44:54.851822 9276 test_util.cc:268] Using random seed: -475883492
I20260928 03:44:54.853394 9277 test_util.cc:268] Using random seed: -475881887
I20260928 03:44:54.855147 9278 test_util.cc:268] Using random seed: -475880151
I20260928 03:44:54.856953 9279 test_util.cc:268] Using random seed: -475878369
I20260928 03:44:54.858457 9280 test_util.cc:268] Using random seed: -475876813
I20260928 03:44:54.860047 9281 test_util.cc:268] Using random seed: -475875234
I20260928 03:44:54.861447 9282 test_util.cc:268] Using random seed: -475873813
I20260928 03:44:54.862784 9283 test_util.cc:268] Using random seed: -475872478
I20260928 03:44:54.864619 9284 test_util.cc:268] Using random seed: -475870700
I20260928 03:44:54.866101 9285 test_util.cc:268] Using random seed: -475869162
I20260928 03:44:54.867453 9286 test_util.cc:268] Using random seed: -475867806
I20260928 03:44:54.870343 9287 test_util.cc:268] Using random seed: -475864954
I20260928 03:44:54.871794 9288 test_util.cc:268] Using random seed: -475863491
I20260928 03:44:54.873278 9289 test_util.cc:268] Using random seed: -475861988
I20260928 03:44:54.874845 9290 test_util.cc:268] Using random seed: -475860447
I20260928 03:44:54.876390 9291 test_util.cc:268] Using random seed: -475858904
W20260928 03:45:13.862949 9245 connection.cc:196] Error closing socket: Network error: TlsSocket::Close: Broken pipe
[ OK ] Parameters/TestRpc.TestCancellationMultiThreads/SSL_UnixSocket (19228 ms)
[ RUN ] Parameters/TestRpc.TestCallId/SSL_UnixSocket
I20260928 03:45:13.900624 9305 acceptor_pool.cc:254] collecting diagnostics on the listening RPC socket unix:/tmp/dist-test-taskQTi7tq/test-tmp/rpc-test-f413a156f4d74963ba497073cb1e3e8a.sock every 8 connection(s)
I20260928 03:45:13.901405 9306 acceptor_pool.cc:254] collecting diagnostics on the listening RPC socket unix:/tmp/dist-test-taskQTi7tq/test-tmp/rpc-test-f413a156f4d74963ba497073cb1e3e8a.sock every 8 connection(s)
[ OK ] Parameters/TestRpc.TestCallId/SSL_UnixSocket (71 ms)
[----------] 20 tests from Parameters/TestRpc (37603 ms total)
[----------] Global test environment tear-down
[==========] 21 tests from 2 test suites ran. (40670 ms total)
[ PASSED ] 20 tests.
[ FAILED ] 1 test, listed below:
[ FAILED ] Parameters/TestRpc.TestCallWithChainCertAndRootCA/SSL_UnixSocket, where GetParam() = (true, true)
1 FAILED TEST
I20260928 03:45:13.969908 8798 logging.cc:424] LogThrottler /data0/somelongdirectorytoavoidrpathissues/src/kudu/src/kudu/rpc/acceptor_pool.cc:285: suppressed but not reported on 3 messages since previous log ~33 seconds ago