Diagnosed failure

Parameters/TestRpc.TestCallWithChainCertAndChainCA/SSL_UnixSocket: /data0/somelongdirectorytoavoidrpathissues/src/kudu/src/kudu/rpc/rpc-test.cc:270: Failure
Failed
Bad status: Runtime error: could not verify certificate chain (error with cert: subject=CN = localhost, ST = sadfjas, C = AS, emailAddress = sdflkdsajf, O = lskdfjlsad, OU = sldfkja, issuer=C = AS, ST = ASDfkjdhf, L = lskdjf, O = saldfja, OU = skdjf, CN = localhost, emailAddress = sadjflkadsj): : certificate has expired
Google Test trace:
/data0/somelongdirectorytoavoidrpathissues/src/kudu/src/kudu/rpc/rpc-test.cc:267: Connecting to unix:/tmp/dist-test-taskPhKq8o/test-tmp/rpc-test-1cc7e2a8294148ca9d6f6aa816e0abcc.sock
I20260927 18:33:37.978451  3579 test_util.cc:175] -----------------------------------------------
I20260927 18:33:37.978492  3579 test_util.cc:176] Had fatal failures, leaving test files at /tmp/dist-test-taskPhKq8o/test-tmp/rpc-test.6.Parameters_TestRpc.TestCallWithChainCertAndChainCA_SSL_UnixSocket.1790534017928725-3579-0

Full log

Note: This is test shard 7 of 8.
[==========] Running 21 tests from 2 test suites.
[----------] Global test environment set-up.
[----------] 20 tests from Parameters/TestRpc
[ RUN      ] Parameters/TestRpc.TestMessengerCreateDestroy/SSL_UnixSocket
WARNING: Logging before InitGoogleLogging() is written to STDERR
I20260927 18:33:37.950834  3579 rpc-test.cc:169] started messenger TestCreateDestroy
[       OK ] Parameters/TestRpc.TestMessengerCreateDestroy/SSL_UnixSocket (20 ms)
[ RUN      ] Parameters/TestRpc.TestNegotiationDeadlock/SSL_UnixSocket
I20260927 18:33:37.964499  3599 acceptor_pool.cc:254] collecting diagnostics on the listening RPC socket unix:/tmp/dist-test-taskPhKq8o/test-tmp/rpc-test-18434a3962b84fc4bb05d8fd54b458f6.sock every 8 connection(s)
I20260927 18:33:37.964521  3600 acceptor_pool.cc:254] collecting diagnostics on the listening RPC socket unix:/tmp/dist-test-taskPhKq8o/test-tmp/rpc-test-18434a3962b84fc4bb05d8fd54b458f6.sock every 8 connection(s)
[       OK ] Parameters/TestRpc.TestNegotiationDeadlock/SSL_UnixSocket (19 ms)
[ RUN      ] Parameters/TestRpc.TestCallWithChainCertAndChainCA/SSL_UnixSocket
I20260927 18:33:37.975122  3615 acceptor_pool.cc:254] collecting diagnostics on the listening RPC socket unix:/tmp/dist-test-taskPhKq8o/test-tmp/rpc-test-1cc7e2a8294148ca9d6f6aa816e0abcc.sock every 8 connection(s)
I20260927 18:33:37.975169  3616 acceptor_pool.cc:254] collecting diagnostics on the listening RPC socket unix:/tmp/dist-test-taskPhKq8o/test-tmp/rpc-test-1cc7e2a8294148ca9d6f6aa816e0abcc.sock every 8 connection(s)
/data0/somelongdirectorytoavoidrpathissues/src/kudu/src/kudu/rpc/rpc-test.cc:270: Failure
Failed
Bad status: Runtime error: could not verify certificate chain (error with cert: subject=CN = localhost, ST = sadfjas, C = AS, emailAddress = sdflkdsajf, O = lskdfjlsad, OU = sldfkja, issuer=C = AS, ST = ASDfkjdhf, L = lskdjf, O = saldfja, OU = skdjf, CN = localhost, emailAddress = sadjflkadsj): : certificate has expired
Google Test trace:
/data0/somelongdirectorytoavoidrpathissues/src/kudu/src/kudu/rpc/rpc-test.cc:267: Connecting to unix:/tmp/dist-test-taskPhKq8o/test-tmp/rpc-test-1cc7e2a8294148ca9d6f6aa816e0abcc.sock
I20260927 18:33:37.978451  3579 test_util.cc:175] -----------------------------------------------
I20260927 18:33:37.978492  3579 test_util.cc:176] Had fatal failures, leaving test files at /tmp/dist-test-taskPhKq8o/test-tmp/rpc-test.6.Parameters_TestRpc.TestCallWithChainCertAndChainCA_SSL_UnixSocket.1790534017928725-3579-0
[  FAILED  ] Parameters/TestRpc.TestCallWithChainCertAndChainCA/SSL_UnixSocket, where GetParam() = (true, true) (7 ms)
[ RUN      ] Parameters/TestRpc.TestCallWithPasswordProtectedKey/SSL_UnixSocket
I20260927 18:33:37.994856  3640 acceptor_pool.cc:254] collecting diagnostics on the listening RPC socket unix:/tmp/dist-test-taskPhKq8o/test-tmp/rpc-test-7c67491c61ee4f01a54405bba012a1a3.sock every 8 connection(s)
I20260927 18:33:37.994886  3641 acceptor_pool.cc:254] collecting diagnostics on the listening RPC socket unix:/tmp/dist-test-taskPhKq8o/test-tmp/rpc-test-7c67491c61ee4f01a54405bba012a1a3.sock every 8 connection(s)
W20260927 18:33:38.005249  3637 connection.cc:196] Error closing socket: Network error: TlsSocket::Close: Broken pipe
[       OK ] Parameters/TestRpc.TestCallWithPasswordProtectedKey/SSL_UnixSocket (27 ms)
[ RUN      ] Parameters/TestRpc.TestCallToBadServer/SSL_UnixSocket
I20260927 18:33:38.019906  3579 rpc-test.cc:394] Status: Network error: Client connection negotiation failed: client connection to 0.0.0.0:0: connect: Connection refused (error 111)
I20260927 18:33:38.020241  3579 rpc-test.cc:394] Status: Network error: Client connection negotiation failed: client connection to 0.0.0.0:0: connect: Connection refused (error 111)
I20260927 18:33:38.020547  3579 rpc-test.cc:394] Status: Network error: Client connection negotiation failed: client connection to 0.0.0.0:0: connect: Connection refused (error 111)
I20260927 18:33:38.020748  3579 rpc-test.cc:394] Status: Network error: Client connection negotiation failed: client connection to 0.0.0.0:0: connect: Connection refused (error 111)
I20260927 18:33:38.020925  3579 rpc-test.cc:394] Status: Network error: Client connection negotiation failed: client connection to 0.0.0.0:0: connect: Connection refused (error 111)
[       OK ] Parameters/TestRpc.TestCallToBadServer/SSL_UnixSocket (14 ms)
[ RUN      ] Parameters/TestRpc.TestWrongService/SSL_UnixSocket
I20260927 18:33:38.031076  3675 acceptor_pool.cc:254] collecting diagnostics on the listening RPC socket unix:/tmp/dist-test-taskPhKq8o/test-tmp/rpc-test-de9d1c74ab8c44e9ad50f3ec2d3ec693.sock every 8 connection(s)
I20260927 18:33:38.031121  3676 acceptor_pool.cc:254] collecting diagnostics on the listening RPC socket unix:/tmp/dist-test-taskPhKq8o/test-tmp/rpc-test-de9d1c74ab8c44e9ad50f3ec2d3ec693.sock every 8 connection(s)
I20260927 18:33:38.046164  3672 messenger.cc:345] service WrongServiceName not registered on TestServer
[       OK ] Parameters/TestRpc.TestWrongService/SSL_UnixSocket (26 ms)
[ RUN      ] Parameters/TestRpc.TestConnectionKeepalive/SSL_UnixSocket
I20260927 18:33:38.059559  3698 acceptor_pool.cc:254] collecting diagnostics on the listening RPC socket unix:/tmp/dist-test-taskPhKq8o/test-tmp/rpc-test-8f95c759441d4a2fa1a1380a801498d9.sock every 8 connection(s)
I20260927 18:33:38.059559  3699 acceptor_pool.cc:254] collecting diagnostics on the listening RPC socket unix:/tmp/dist-test-taskPhKq8o/test-tmp/rpc-test-8f95c759441d4a2fa1a1380a801498d9.sock every 8 connection(s)
I20260927 18:33:38.059710  3579 rpc-test.cc:488] Connecting to unix:/tmp/dist-test-taskPhKq8o/test-tmp/rpc-test-8f95c759441d4a2fa1a1380a801498d9.sock
W20260927 18:33:38.548650  3711 connection.cc:196] Error closing socket: Network error: TlsSocket::Close: Broken pipe
[       OK ] Parameters/TestRpc.TestConnectionKeepalive/SSL_UnixSocket (1040 ms)
[ RUN      ] Parameters/TestRpc.TestClientConnectionMetrics/SSL_UnixSocket
I20260927 18:33:39.097375  3723 acceptor_pool.cc:254] collecting diagnostics on the listening RPC socket unix:/tmp/dist-test-taskPhKq8o/test-tmp/rpc-test-2abdb10069df47e7992d7c2106f065fa.sock every 8 connection(s)
I20260927 18:33:39.097417  3724 acceptor_pool.cc:254] collecting diagnostics on the listening RPC socket unix:/tmp/dist-test-taskPhKq8o/test-tmp/rpc-test-2abdb10069df47e7992d7c2106f065fa.sock every 8 connection(s)
I20260927 18:33:39.097548  3579 rpc-test.cc:569] Connecting to unix:/tmp/dist-test-taskPhKq8o/test-tmp/rpc-test-2abdb10069df47e7992d7c2106f065fa.sock
W20260927 18:33:47.201848  3720 connection.cc:196] Error closing socket: Network error: TlsSocket::Close: Broken pipe
[       OK ] Parameters/TestRpc.TestClientConnectionMetrics/SSL_UnixSocket (8115 ms)
[ RUN      ] Parameters/TestRpc.TestCredentialsPolicy/SSL_UnixSocket
I20260927 18:33:47.226717  3746 acceptor_pool.cc:254] collecting diagnostics on the listening RPC socket unix:/tmp/dist-test-taskPhKq8o/test-tmp/rpc-test-baf3edf3552a4822b59886b387f80e34.sock every 8 connection(s)
I20260927 18:33:47.226758  3747 acceptor_pool.cc:254] collecting diagnostics on the listening RPC socket unix:/tmp/dist-test-taskPhKq8o/test-tmp/rpc-test-baf3edf3552a4822b59886b387f80e34.sock every 8 connection(s)
I20260927 18:33:47.226868  3579 rpc-test.cc:700] Connecting to unix:/tmp/dist-test-taskPhKq8o/test-tmp/rpc-test-baf3edf3552a4822b59886b387f80e34.sock
W20260927 18:33:47.245924  3745 connection.cc:196] Error closing socket: Network error: TlsSocket::Close: Broken pipe
W20260927 18:33:47.249114  3745 connection.cc:196] Error closing socket: Network error: TlsSocket::Close: Broken pipe
[       OK ] Parameters/TestRpc.TestCredentialsPolicy/SSL_UnixSocket (47 ms)
[ RUN      ] Parameters/TestRpc.TestCallLongerThanKeepalive/SSL_UnixSocket
I20260927 18:33:47.259038  3771 acceptor_pool.cc:254] collecting diagnostics on the listening RPC socket unix:/tmp/dist-test-taskPhKq8o/test-tmp/rpc-test-870c85b2d68d47f1ae0ef5cd184b1af4.sock every 8 connection(s)
I20260927 18:33:47.259081  3772 acceptor_pool.cc:254] collecting diagnostics on the listening RPC socket unix:/tmp/dist-test-taskPhKq8o/test-tmp/rpc-test-870c85b2d68d47f1ae0ef5cd184b1af4.sock every 8 connection(s)
I20260927 18:33:47.275614  3775 rpc-test-base.h:222] got call: sleep_micros: 3000000 deferred: true
I20260927 18:33:50.276296  3775 rpcz_store.cc:275] Call kudu.rpc.GenericCalculatorService.Sleep from unix:<unnamed> (request call id 0) took 3000 ms. Trace:
I20260927 18:33:50.276405  3775 rpcz_store.cc:276] 0927 18:33:47.275572 (+     0us) service_pool.cc:170] Inserting onto call queue
0927 18:33:47.275601 (+    29us) service_pool.cc:227] Handling call
0927 18:33:50.276280 (+3000679us) inbound_call.cc:173] Queueing success response
Metrics: {}
[       OK ] Parameters/TestRpc.TestCallLongerThanKeepalive/SSL_UnixSocket (3028 ms)
[ RUN      ] Parameters/TestRpc.TestRpcSidecar/SSL_UnixSocket
I20260927 18:33:50.302752  3796 acceptor_pool.cc:254] collecting diagnostics on the listening RPC socket unix:/tmp/dist-test-taskPhKq8o/test-tmp/rpc-test-392192c6b973450db834a933e8b5a242.sock every 8 connection(s)
I20260927 18:33:50.302786  3797 acceptor_pool.cc:254] collecting diagnostics on the listening RPC socket unix:/tmp/dist-test-taskPhKq8o/test-tmp/rpc-test-392192c6b973450db834a933e8b5a242.sock every 8 connection(s)
W20260927 18:33:50.356323  3793 connection.cc:196] Error closing socket: Network error: TlsSocket::Close: Broken pipe
[       OK ] Parameters/TestRpc.TestRpcSidecar/SSL_UnixSocket (78 ms)
[ RUN      ] Parameters/TestRpc.TestRpcSidecarLimits/SSL_UnixSocket
I20260927 18:33:51.863135  3822 acceptor_pool.cc:254] collecting diagnostics on the listening RPC socket unix:/tmp/dist-test-taskPhKq8o/test-tmp/rpc-test-358b3ff321a34e54a596c4ca09af2eed.sock every 8 connection(s)
I20260927 18:33:51.863130  3821 acceptor_pool.cc:254] collecting diagnostics on the listening RPC socket unix:/tmp/dist-test-taskPhKq8o/test-tmp/rpc-test-358b3ff321a34e54a596c4ca09af2eed.sock every 8 connection(s)
W20260927 18:33:51.880221  3579 serialization.cc:72] Serialized kudu.rpc_test.PushStringsRequestPB (2147483654 bytes) is larger than the maximum configured RPC message size (52428800 bytes). Sending anyway, but peer may reject the data.
W20260927 18:33:51.883329  3818 connection.cc:535] server connection from unix:<unnamed> recv error: Network error: RPC frame had a length of 2147483714, but we only support messages up to 52428800 bytes long.
W20260927 18:33:51.883401  3818 connection.cc:158] shutting down server connection from unix:<unnamed> with pending inbound data: 4/2147483714 bytes received; last active 0 ns ago: status Network error: RPC frame had a length of 2147483714, but we only support messages up to 52428800 bytes long.
W20260927 18:33:51.883577  3834 connection.cc:196] Error closing socket: Network error: TlsSocket::Close: Broken pipe
I20260927 18:33:51.892854  3846 acceptor_pool.cc:254] collecting diagnostics on the listening RPC socket unix:/tmp/dist-test-taskPhKq8o/test-tmp/rpc-test-358b3ff321a34e54a596c4ca09af2eed.sock every 8 connection(s)
I20260927 18:33:51.892861  3847 acceptor_pool.cc:254] collecting diagnostics on the listening RPC socket unix:/tmp/dist-test-taskPhKq8o/test-tmp/rpc-test-358b3ff321a34e54a596c4ca09af2eed.sock every 8 connection(s)
W20260927 18:33:56.123456  3843 connection.cc:577] server connection from unix:<unnamed>: received bad data: 'Corruption: Invalid packet: message had a length of 2147483710, but we only support messages up to 2147483647 bytes
'
W20260927 18:33:56.123714  3859 connection.cc:196] Error closing socket: Network error: TlsSocket::Close: Broken pipe
[       OK ] Parameters/TestRpc.TestRpcSidecarLimits/SSL_UnixSocket (5767 ms)
[ RUN      ] Parameters/TestRpc.TestCallTimeoutDoesntAffectNegotiation/SSL_UnixSocket
I20260927 18:33:56.145051  3871 acceptor_pool.cc:254] collecting diagnostics on the listening RPC socket unix:/tmp/dist-test-taskPhKq8o/test-tmp/rpc-test-7f6854e479ad459ebc9d05e7896b0ff9.sock every 8 connection(s)
I20260927 18:33:56.145108  3872 acceptor_pool.cc:254] collecting diagnostics on the listening RPC socket unix:/tmp/dist-test-taskPhKq8o/test-tmp/rpc-test-7f6854e479ad459ebc9d05e7896b0ff9.sock every 8 connection(s)
W20260927 18:33:56.164137  3867 negotiation.cc:266] Injecting 500ms delay in negotiation
I20260927 18:33:56.214391  3579 rpc-test-base.h:595] status: Timed out: connection negotiation to unix:/tmp/dist-test-taskPhKq8o/test-tmp/rpc-test-7f6854e479ad459ebc9d05e7896b0ff9.sock for RPC Sleep timed out after 0.050s (ON_OUTBOUND_QUEUE), seconds elapsed: 0.0505282
[       OK ] Parameters/TestRpc.TestCallTimeoutDoesntAffectNegotiation/SSL_UnixSocket (543 ms)
[ RUN      ] Parameters/TestRpc.TestRpcHandlerLatencyMetric/SSL_UnixSocket
I20260927 18:33:56.678131  3896 acceptor_pool.cc:254] collecting diagnostics on the listening RPC socket unix:/tmp/dist-test-taskPhKq8o/test-tmp/rpc-test-1441f77d0ff84f8faff890c49d34bf9e.sock every 8 connection(s)
I20260927 18:33:56.678194  3897 acceptor_pool.cc:254] collecting diagnostics on the listening RPC socket unix:/tmp/dist-test-taskPhKq8o/test-tmp/rpc-test-1441f77d0ff84f8faff890c49d34bf9e.sock every 8 connection(s)
I20260927 18:33:56.726356  3579 rpc-test.cc:1236] Sleep() min lat: 20262
I20260927 18:33:56.726423  3579 rpc-test.cc:1237] Sleep() mean lat: 20262
I20260927 18:33:56.726446  3579 rpc-test.cc:1238] Sleep() max lat: 20262
I20260927 18:33:56.726459  3579 rpc-test.cc:1239] Sleep() #calls: 1
[       OK ] Parameters/TestRpc.TestRpcHandlerLatencyMetric/SSL_UnixSocket (59 ms)
[ RUN      ] Parameters/TestRpc.TimedOutOnResponseMetricServiceQueue/SSL_UnixSocket
I20260927 18:33:56.735383  3922 acceptor_pool.cc:254] collecting diagnostics on the listening RPC socket unix:/tmp/dist-test-taskPhKq8o/test-tmp/rpc-test-8c0b060c1e8d4d209acead73c40344c2.sock every 8 connection(s)
I20260927 18:33:56.735419  3923 acceptor_pool.cc:254] collecting diagnostics on the listening RPC socket unix:/tmp/dist-test-taskPhKq8o/test-tmp/rpc-test-8c0b060c1e8d4d209acead73c40344c2.sock every 8 connection(s)
W20260927 18:33:56.789767  3924 rpcz_store.cc:267] Call kudu.rpc_test.CalculatorService.Sleep from unix:<unnamed> (request call id 2) took 20 ms (client timeout 20 ms). Trace:
W20260927 18:33:56.789866  3924 rpcz_store.cc:269] 0927 18:33:56.769535 (+     0us) service_pool.cc:170] Inserting onto call queue
0927 18:33:56.789739 (+ 20204us) service_pool.cc:214] Skipping call since client already timed out
0927 18:33:56.789752 (+    13us) inbound_call.cc:173] Queueing failure response
Metrics: {}
[       OK ] Parameters/TestRpc.TimedOutOnResponseMetricServiceQueue/SSL_UnixSocket (63 ms)
[ RUN      ] Parameters/TestRpc.RpcPendingConnectionsMetric/SSL_UnixSocket
I20260927 18:33:56.792789  3945 acceptor_pool.cc:254] collecting diagnostics on the listening RPC socket 0.0.0.0:39085 every 8 connection(s)
I20260927 18:33:56.792853  3946 acceptor_pool.cc:254] collecting diagnostics on the listening RPC socket 0.0.0.0:39085 every 8 connection(s)
W20260927 18:33:56.793380  3941 negotiation.cc:337] Failed RPC negotiation. Trace:
0927 18:33:56.793221 (+     0us) reactor.cc:625] Submitting negotiation task for server connection from 127.0.0.1:35752 (local address 127.0.0.1:39085)
0927 18:33:56.793265 (+    44us) server_negotiation.cc:206] Beginning negotiation
0927 18:33:56.793267 (+     2us) server_negotiation.cc:399] Waiting for connection header
0927 18:33:56.793332 (+    65us) negotiation.cc:327] Negotiation complete: Network error: Server connection negotiation failed: server connection from 127.0.0.1:35752: BlockingRecv error: recv got EOF from 127.0.0.1:35752 (error 108)
Metrics: {"server-negotiator.queue_time_us":14}
[       OK ] Parameters/TestRpc.RpcPendingConnectionsMetric/SSL_UnixSocket (12 ms)
[ RUN      ] Parameters/TestRpc.TestRpcContextClientDeadline/SSL_UnixSocket
I20260927 18:33:56.834096  3961 acceptor_pool.cc:254] collecting diagnostics on the listening RPC socket unix:/tmp/dist-test-taskPhKq8o/test-tmp/rpc-test-7ebccb030ad643549481e0cf4e125c7c.sock every 8 connection(s)
I20260927 18:33:56.834121  3962 acceptor_pool.cc:254] collecting diagnostics on the listening RPC socket unix:/tmp/dist-test-taskPhKq8o/test-tmp/rpc-test-7ebccb030ad643549481e0cf4e125c7c.sock every 8 connection(s)
[       OK ] Parameters/TestRpc.TestRpcContextClientDeadline/SSL_UnixSocket (71 ms)
[ RUN      ] Parameters/TestRpc.TestApplicationFeatureFlagUnsupportedServer/SSL_UnixSocket
I20260927 18:33:56.888931  3986 acceptor_pool.cc:254] collecting diagnostics on the listening RPC socket unix:/tmp/dist-test-taskPhKq8o/test-tmp/rpc-test-ed1b69c6891742c1a4711bf8455c05ba.sock every 8 connection(s)
I20260927 18:33:56.888993  3987 acceptor_pool.cc:254] collecting diagnostics on the listening RPC socket unix:/tmp/dist-test-taskPhKq8o/test-tmp/rpc-test-ed1b69c6891742c1a4711bf8455c05ba.sock every 8 connection(s)
W20260927 18:33:56.906910  3983 connection.cc:196] Error closing socket: Network error: TlsSocket::Close: Broken pipe
[       OK ] Parameters/TestRpc.TestApplicationFeatureFlagUnsupportedServer/SSL_UnixSocket (31 ms)
[ RUN      ] Parameters/TestRpc.TestCancellationAsync/SSL_UnixSocket
I20260927 18:33:56.912510  4011 acceptor_pool.cc:254] collecting diagnostics on the listening RPC socket unix:/tmp/dist-test-taskPhKq8o/test-tmp/rpc-test-c844572efab140309f26a2b1f1b12f09.sock every 8 connection(s)
I20260927 18:33:56.912546  4012 acceptor_pool.cc:254] collecting diagnostics on the listening RPC socket unix:/tmp/dist-test-taskPhKq8o/test-tmp/rpc-test-c844572efab140309f26a2b1f1b12f09.sock every 8 connection(s)
I20260927 18:33:56.912699  3579 rpc-test.cc:1716] Connecting to unix:/tmp/dist-test-taskPhKq8o/test-tmp/rpc-test-c844572efab140309f26a2b1f1b12f09.sock
I20260927 18:33:56.921731  3579 test_util.cc:268] Using random seed: 825924993
I20260927 18:33:56.934634  4015 rpc-test-base.h:240] got call: sleep_micros: 500 pattern: 4294967295 num_repetitions: 2097152 sidecar_idx: 0
I20260927 18:33:56.944887  4015 rpc-test-base.h:240] got call: sleep_micros: 500 pattern: 4294967295 num_repetitions: 2097152 sidecar_idx: 0
I20260927 18:33:56.954802  4015 rpc-test-base.h:240] got call: sleep_micros: 500 pattern: 4294967295 num_repetitions: 2097152 sidecar_idx: 0
I20260927 18:33:56.965226  4015 rpc-test-base.h:240] got call: sleep_micros: 500 pattern: 4294967295 num_repetitions: 2097152 sidecar_idx: 0
I20260927 18:33:56.976747  4015 rpc-test-base.h:240] got call: sleep_micros: 500 pattern: 4294967295 num_repetitions: 2097152 sidecar_idx: 0
I20260927 18:33:56.987962  4015 rpc-test-base.h:240] got call: sleep_micros: 500 pattern: 4294967295 num_repetitions: 2097152 sidecar_idx: 0
I20260927 18:33:56.999132  4015 rpc-test-base.h:240] got call: sleep_micros: 500 pattern: 4294967295 num_repetitions: 2097152 sidecar_idx: 0
I20260927 18:33:57.010468  4015 rpc-test-base.h:240] got call: sleep_micros: 500 pattern: 4294967295 num_repetitions: 2097152 sidecar_idx: 0
W20260927 18:33:57.011979  4008 connection.cc:196] Error closing socket: Network error: TlsSocket::Close: Broken pipe
W20260927 18:33:57.013427  4008 connection.cc:441] server connection from unix:<unnamed> torn down before Call kudu.rpc.GenericCalculatorService.SleepWithSidecar from unix:<unnamed> (request call id 9) could send its response
[       OK ] Parameters/TestRpc.TestCancellationAsync/SSL_UnixSocket (106 ms)
[ RUN      ] Parameters/TestRpc.TestPerformanceBySocketType/SSL_UnixSocket
I20260927 18:33:57.040860  4037 acceptor_pool.cc:254] collecting diagnostics on the listening RPC socket unix:/tmp/dist-test-taskPhKq8o/test-tmp/rpc-test-e6cd89a650ab438aaa687861cd390656.sock every 8 connection(s)
I20260927 18:33:57.040979  3579 rpc-test.cc:1846] Connecting to unix:/tmp/dist-test-taskPhKq8o/test-tmp/rpc-test-e6cd89a650ab438aaa687861cd390656.sock
I20260927 18:33:57.040843  4036 acceptor_pool.cc:254] collecting diagnostics on the listening RPC socket unix:/tmp/dist-test-taskPhKq8o/test-tmp/rpc-test-e6cd89a650ab438aaa687861cd390656.sock every 8 connection(s)
I20260927 18:33:58.299332  3579 rpc-test.cc:1859] Sending 1024MB via ssl-enabled unix socket: real 1.230s	user 1.411s	sys 0.797s
I20260927 18:33:59.450335  3579 rpc-test.cc:1859] Sending 1024MB via ssl-enabled unix socket: real 1.151s	user 1.365s	sys 0.716s
I20260927 18:34:00.645386  3579 rpc-test.cc:1859] Sending 1024MB via ssl-enabled unix socket: real 1.195s	user 1.351s	sys 0.796s
I20260927 18:34:01.801563  3579 rpc-test.cc:1859] Sending 1024MB via ssl-enabled unix socket: real 1.156s	user 1.307s	sys 0.777s
I20260927 18:34:02.971338  3579 rpc-test.cc:1859] Sending 1024MB via ssl-enabled unix socket: real 1.170s	user 1.228s	sys 0.864s
W20260927 18:34:02.971906  4033 connection.cc:196] Error closing socket: Network error: TlsSocket::Close: Broken pipe
[       OK ] Parameters/TestRpc.TestPerformanceBySocketType/SSL_UnixSocket (5958 ms)
[----------] 20 tests from Parameters/TestRpc (25041 ms total)

[----------] 1 test from Parameters/TestRpcSocketTxRxQueue
[ RUN      ] Parameters/TestRpcSocketTxRxQueue.AcceptorRxQueueSizeMetric/0
I20260927 18:34:02.977747  4061 acceptor_pool.cc:254] collecting diagnostics on the listening RPC socket 0.0.0.0:37519 every 1 connection(s)
I20260927 18:34:02.977813  4062 acceptor_pool.cc:254] collecting diagnostics on the listening RPC socket 0.0.0.0:37519 every 1 connection(s)
W20260927 18:34:02.978317  4057 negotiation.cc:337] Failed RPC negotiation. Trace:
0927 18:34:02.978184 (+     0us) reactor.cc:625] Submitting negotiation task for server connection from 127.0.0.1:43626 (local address 127.0.0.1:37519)
0927 18:34:02.978231 (+    47us) server_negotiation.cc:206] Beginning negotiation
0927 18:34:02.978233 (+     2us) server_negotiation.cc:399] Waiting for connection header
0927 18:34:02.978289 (+    56us) negotiation.cc:327] Negotiation complete: Network error: Server connection negotiation failed: server connection from 127.0.0.1:43626: BlockingRecv error: recv got EOF from 127.0.0.1:43626 (error 108)
Metrics: {"server-negotiator.queue_time_us":18}
[       OK ] Parameters/TestRpcSocketTxRxQueue.AcceptorRxQueueSizeMetric/0 (7 ms)
[----------] 1 test from Parameters/TestRpcSocketTxRxQueue (7 ms total)

[----------] Global test environment tear-down
[==========] 21 tests from 2 test suites ran. (25049 ms total)
[  PASSED  ] 20 tests.
[  FAILED  ] 1 test, listed below:
[  FAILED  ] Parameters/TestRpc.TestCallWithChainCertAndChainCA/SSL_UnixSocket, where GetParam() = (true, true)

 1 FAILED TEST