Diagnosed failure

Parameters/TestRpc.TestCallWithChainCertAndChainCA/SSL_TCP: /data0/somelongdirectorytoavoidrpathissues/src/kudu/src/kudu/rpc/rpc-test.cc:270: Failure
Failed
Bad status: Runtime error: could not verify certificate chain (error with cert: subject=CN = localhost, ST = sadfjas, C = AS, emailAddress = sdflkdsajf, O = lskdfjlsad, OU = sldfkja, issuer=C = AS, ST = ASDfkjdhf, L = lskdjf, O = saldfja, OU = skdjf, CN = localhost, emailAddress = sadjflkadsj): : certificate has expired
Google Test trace:
/data0/somelongdirectorytoavoidrpathissues/src/kudu/src/kudu/rpc/rpc-test.cc:267: Connecting to 0.0.0.0:45857
I20260927 18:33:35.149154 16287 test_util.cc:175] -----------------------------------------------
I20260927 18:33:35.149204 16287 test_util.cc:176] Had fatal failures, leaving test files at /tmp/dist-test-taskxASVBz/test-tmp/rpc-test.5.Parameters_TestRpc.TestCallWithChainCertAndChainCA_SSL_TCP.1790534015090699-16287-0

Full log

Note: This is test shard 6 of 8.
[==========] Running 21 tests from 2 test suites.
[----------] Global test environment set-up.
[----------] 20 tests from Parameters/TestRpc
[ RUN      ] Parameters/TestRpc.TestMessengerCreateDestroy/SSL_TCP
WARNING: Logging before InitGoogleLogging() is written to STDERR
I20260927 18:33:35.113871 16287 rpc-test.cc:169] started messenger TestCreateDestroy
[       OK ] Parameters/TestRpc.TestMessengerCreateDestroy/SSL_TCP (21 ms)
[ RUN      ] Parameters/TestRpc.TestNegotiationDeadlock/SSL_TCP
I20260927 18:33:35.122694 16307 acceptor_pool.cc:254] collecting diagnostics on the listening RPC socket 0.0.0.0:36803 every 8 connection(s)
I20260927 18:33:35.122714 16308 acceptor_pool.cc:254] collecting diagnostics on the listening RPC socket 0.0.0.0:36803 every 8 connection(s)
[       OK ] Parameters/TestRpc.TestNegotiationDeadlock/SSL_TCP (14 ms)
[ RUN      ] Parameters/TestRpc.TestCallWithChainCertAndChainCA/SSL_TCP
I20260927 18:33:35.145401 16323 acceptor_pool.cc:254] collecting diagnostics on the listening RPC socket 0.0.0.0:45857 every 8 connection(s)
I20260927 18:33:35.145428 16324 acceptor_pool.cc:254] collecting diagnostics on the listening RPC socket 0.0.0.0:45857 every 8 connection(s)
/data0/somelongdirectorytoavoidrpathissues/src/kudu/src/kudu/rpc/rpc-test.cc:270: Failure
Failed
Bad status: Runtime error: could not verify certificate chain (error with cert: subject=CN = localhost, ST = sadfjas, C = AS, emailAddress = sdflkdsajf, O = lskdfjlsad, OU = sldfkja, issuer=C = AS, ST = ASDfkjdhf, L = lskdjf, O = saldfja, OU = skdjf, CN = localhost, emailAddress = sadjflkadsj): : certificate has expired
Google Test trace:
/data0/somelongdirectorytoavoidrpathissues/src/kudu/src/kudu/rpc/rpc-test.cc:267: Connecting to 0.0.0.0:45857
I20260927 18:33:35.149154 16287 test_util.cc:175] -----------------------------------------------
I20260927 18:33:35.149204 16287 test_util.cc:176] Had fatal failures, leaving test files at /tmp/dist-test-taskxASVBz/test-tmp/rpc-test.5.Parameters_TestRpc.TestCallWithChainCertAndChainCA_SSL_TCP.1790534015090699-16287-0
[  FAILED  ] Parameters/TestRpc.TestCallWithChainCertAndChainCA/SSL_TCP, where GetParam() = (true, false) (19 ms)
[ RUN      ] Parameters/TestRpc.TestCallWithPasswordProtectedKey/SSL_TCP
I20260927 18:33:35.165724 16348 acceptor_pool.cc:254] collecting diagnostics on the listening RPC socket 0.0.0.0:45197 every 8 connection(s)
I20260927 18:33:35.165745 16349 acceptor_pool.cc:254] collecting diagnostics on the listening RPC socket 0.0.0.0:45197 every 8 connection(s)
[       OK ] Parameters/TestRpc.TestCallWithPasswordProtectedKey/SSL_TCP (28 ms)
[ RUN      ] Parameters/TestRpc.TestCallToBadServer/SSL_TCP
I20260927 18:33:35.187915 16287 rpc-test.cc:394] Status: Network error: Client connection negotiation failed: client connection to 0.0.0.0:0: connect: Connection refused (error 111)
I20260927 18:33:35.188176 16287 rpc-test.cc:394] Status: Network error: Client connection negotiation failed: client connection to 0.0.0.0:0: connect: Connection refused (error 111)
I20260927 18:33:35.188355 16287 rpc-test.cc:394] Status: Network error: Client connection negotiation failed: client connection to 0.0.0.0:0: connect: Connection refused (error 111)
I20260927 18:33:35.188517 16287 rpc-test.cc:394] Status: Network error: Client connection negotiation failed: client connection to 0.0.0.0:0: connect: Connection refused (error 111)
I20260927 18:33:35.188673 16287 rpc-test.cc:394] Status: Network error: Client connection negotiation failed: client connection to 0.0.0.0:0: connect: Connection refused (error 111)
[       OK ] Parameters/TestRpc.TestCallToBadServer/SSL_TCP (11 ms)
[ RUN      ] Parameters/TestRpc.TestWrongService/SSL_TCP
I20260927 18:33:35.198936 16384 acceptor_pool.cc:254] collecting diagnostics on the listening RPC socket 0.0.0.0:36539 every 8 connection(s)
I20260927 18:33:35.198910 16383 acceptor_pool.cc:254] collecting diagnostics on the listening RPC socket 0.0.0.0:36539 every 8 connection(s)
I20260927 18:33:35.216495 16380 messenger.cc:345] service WrongServiceName not registered on TestServer
[       OK ] Parameters/TestRpc.TestWrongService/SSL_TCP (28 ms)
[ RUN      ] Parameters/TestRpc.TestConnectionKeepalive/SSL_TCP
I20260927 18:33:35.252069 16406 acceptor_pool.cc:254] collecting diagnostics on the listening RPC socket 0.0.0.0:44253 every 8 connection(s)
I20260927 18:33:35.252094 16407 acceptor_pool.cc:254] collecting diagnostics on the listening RPC socket 0.0.0.0:44253 every 8 connection(s)
I20260927 18:33:35.252229 16287 rpc-test.cc:488] Connecting to 0.0.0.0:44253
[       OK ] Parameters/TestRpc.TestConnectionKeepalive/SSL_TCP (1072 ms)
[ RUN      ] Parameters/TestRpc.TestClientConnectionMetrics/SSL_TCP
I20260927 18:33:36.305091 16431 acceptor_pool.cc:254] collecting diagnostics on the listening RPC socket 0.0.0.0:34965 every 8 connection(s)
I20260927 18:33:36.305130 16432 acceptor_pool.cc:254] collecting diagnostics on the listening RPC socket 0.0.0.0:34965 every 8 connection(s)
I20260927 18:33:36.305254 16287 rpc-test.cc:569] Connecting to 0.0.0.0:34965
[       OK ] Parameters/TestRpc.TestClientConnectionMetrics/SSL_TCP (7941 ms)
[ RUN      ] Parameters/TestRpc.TestCredentialsPolicy/SSL_TCP
I20260927 18:33:44.243973 16454 acceptor_pool.cc:254] collecting diagnostics on the listening RPC socket 0.0.0.0:32791 every 8 connection(s)
I20260927 18:33:44.244014 16455 acceptor_pool.cc:254] collecting diagnostics on the listening RPC socket 0.0.0.0:32791 every 8 connection(s)
I20260927 18:33:44.244146 16287 rpc-test.cc:700] Connecting to 0.0.0.0:32791
[       OK ] Parameters/TestRpc.TestCredentialsPolicy/SSL_TCP (44 ms)
[ RUN      ] Parameters/TestRpc.TestCallLongerThanKeepalive/SSL_TCP
I20260927 18:33:44.286341 16479 acceptor_pool.cc:254] collecting diagnostics on the listening RPC socket 0.0.0.0:41433 every 8 connection(s)
I20260927 18:33:44.286388 16480 acceptor_pool.cc:254] collecting diagnostics on the listening RPC socket 0.0.0.0:41433 every 8 connection(s)
I20260927 18:33:44.309748 16483 rpc-test-base.h:222] got call: sleep_micros: 3000000 deferred: true
I20260927 18:33:47.310403 16483 rpcz_store.cc:275] Call kudu.rpc.GenericCalculatorService.Sleep from 127.0.0.1:34596 (request call id 0) took 3000 ms. Trace:
I20260927 18:33:47.310503 16483 rpcz_store.cc:276] 0927 18:33:44.309693 (+     0us) service_pool.cc:170] Inserting onto call queue
0927 18:33:44.309723 (+    30us) service_pool.cc:227] Handling call
0927 18:33:47.310386 (+3000663us) inbound_call.cc:173] Queueing success response
Metrics: {}
[       OK ] Parameters/TestRpc.TestCallLongerThanKeepalive/SSL_TCP (3035 ms)
[ RUN      ] Parameters/TestRpc.TestRpcSidecar/SSL_TCP
I20260927 18:33:47.319339 16504 acceptor_pool.cc:254] collecting diagnostics on the listening RPC socket 0.0.0.0:36769 every 8 connection(s)
I20260927 18:33:47.319389 16505 acceptor_pool.cc:254] collecting diagnostics on the listening RPC socket 0.0.0.0:36769 every 8 connection(s)
[       OK ] Parameters/TestRpc.TestRpcSidecar/SSL_TCP (63 ms)
[ RUN      ] Parameters/TestRpc.TestRpcSidecarLimits/SSL_TCP
I20260927 18:33:49.015141 16529 acceptor_pool.cc:254] collecting diagnostics on the listening RPC socket 0.0.0.0:33599 every 8 connection(s)
I20260927 18:33:49.015147 16530 acceptor_pool.cc:254] collecting diagnostics on the listening RPC socket 0.0.0.0:33599 every 8 connection(s)
W20260927 18:33:49.031246 16287 serialization.cc:72] Serialized kudu.rpc_test.PushStringsRequestPB (2147483654 bytes) is larger than the maximum configured RPC message size (52428800 bytes). Sending anyway, but peer may reject the data.
W20260927 18:33:49.034395 16528 connection.cc:535] server connection from 127.0.0.1:41404 recv error: Network error: RPC frame had a length of 2147483714, but we only support messages up to 52428800 bytes long.
W20260927 18:33:49.034477 16528 connection.cc:158] shutting down server connection from 127.0.0.1:41404 with pending inbound data: 4/2147483714 bytes received; last active 0 ns ago: status Network error: RPC frame had a length of 2147483714, but we only support messages up to 52428800 bytes long.
W20260927 18:33:49.034677 16542 connection.cc:698] client connection to 0.0.0.0:33599 send error: Network error: failed to write to TLS socket: Connection reset by peer
W20260927 18:33:49.034773 16542 connection.cc:196] Error closing socket: Network error: TlsSocket::Close: Success
I20260927 18:33:49.045982 16554 acceptor_pool.cc:254] collecting diagnostics on the listening RPC socket 0.0.0.0:46825 every 8 connection(s)
I20260927 18:33:49.046062 16555 acceptor_pool.cc:254] collecting diagnostics on the listening RPC socket 0.0.0.0:46825 every 8 connection(s)
W20260927 18:33:52.657399 16551 connection.cc:577] server connection from 127.0.0.1:48866: received bad data: 'Corruption: Invalid packet: message had a length of 2147483710, but we only support messages up to 2147483647 bytes
'
[       OK ] Parameters/TestRpc.TestRpcSidecarLimits/SSL_TCP (5283 ms)
[ RUN      ] Parameters/TestRpc.TestCallTimeoutDoesntAffectNegotiation/SSL_TCP
I20260927 18:33:52.687235 16579 acceptor_pool.cc:254] collecting diagnostics on the listening RPC socket 0.0.0.0:46111 every 8 connection(s)
I20260927 18:33:52.687264 16580 acceptor_pool.cc:254] collecting diagnostics on the listening RPC socket 0.0.0.0:46111 every 8 connection(s)
W20260927 18:33:52.713685 16575 negotiation.cc:266] Injecting 500ms delay in negotiation
I20260927 18:33:52.763950 16287 rpc-test-base.h:595] status: Timed out: connection negotiation to 0.0.0.0:46111 for RPC Sleep timed out after 0.050s (ON_OUTBOUND_QUEUE), seconds elapsed: 0.0506456
[       OK ] Parameters/TestRpc.TestCallTimeoutDoesntAffectNegotiation/SSL_TCP (558 ms)
[ RUN      ] Parameters/TestRpc.TestRpcHandlerLatencyMetric/SSL_TCP
I20260927 18:33:53.228381 16604 acceptor_pool.cc:254] collecting diagnostics on the listening RPC socket 0.0.0.0:44371 every 8 connection(s)
I20260927 18:33:53.228430 16605 acceptor_pool.cc:254] collecting diagnostics on the listening RPC socket 0.0.0.0:44371 every 8 connection(s)
I20260927 18:33:53.259822 16287 rpc-test.cc:1236] Sleep() min lat: 20296
I20260927 18:33:53.259900 16287 rpc-test.cc:1237] Sleep() mean lat: 20296
I20260927 18:33:53.259924 16287 rpc-test.cc:1238] Sleep() max lat: 20296
I20260927 18:33:53.259943 16287 rpc-test.cc:1239] Sleep() #calls: 1
[       OK ] Parameters/TestRpc.TestRpcHandlerLatencyMetric/SSL_TCP (42 ms)
[ RUN      ] Parameters/TestRpc.TimedOutOnResponseMetricServiceQueue/SSL_TCP
I20260927 18:33:53.273758 16630 acceptor_pool.cc:254] collecting diagnostics on the listening RPC socket 0.0.0.0:41781 every 8 connection(s)
I20260927 18:33:53.273800 16631 acceptor_pool.cc:254] collecting diagnostics on the listening RPC socket 0.0.0.0:41781 every 8 connection(s)
W20260927 18:33:53.347049 16632 rpcz_store.cc:267] Call kudu.rpc_test.CalculatorService.Sleep from 127.0.0.1:34506 (request call id 2) took 20 ms (client timeout 20 ms). Trace:
W20260927 18:33:53.347151 16632 rpcz_store.cc:269] 0927 18:33:53.326804 (+     0us) service_pool.cc:170] Inserting onto call queue
0927 18:33:53.347025 (+ 20221us) service_pool.cc:214] Skipping call since client already timed out
0927 18:33:53.347034 (+     9us) inbound_call.cc:173] Queueing failure response
Metrics: {}
[       OK ] Parameters/TestRpc.TimedOutOnResponseMetricServiceQueue/SSL_TCP (87 ms)
[ RUN      ] Parameters/TestRpc.RpcPendingConnectionsMetric/SSL_TCP
I20260927 18:33:53.350212 16654 acceptor_pool.cc:254] collecting diagnostics on the listening RPC socket 0.0.0.0:32907 every 8 connection(s)
I20260927 18:33:53.350584 16653 acceptor_pool.cc:254] collecting diagnostics on the listening RPC socket 0.0.0.0:32907 every 8 connection(s)
W20260927 18:33:53.350771 16649 negotiation.cc:337] Failed RPC negotiation. Trace:
0927 18:33:53.350598 (+     0us) reactor.cc:625] Submitting negotiation task for server connection from 127.0.0.1:56228 (local address 127.0.0.1:32907)
0927 18:33:53.350645 (+    47us) server_negotiation.cc:206] Beginning negotiation
0927 18:33:53.350647 (+     2us) server_negotiation.cc:399] Waiting for connection header
0927 18:33:53.350713 (+    66us) negotiation.cc:327] Negotiation complete: Network error: Server connection negotiation failed: server connection from 127.0.0.1:56228: BlockingRecv error: recv got EOF from 127.0.0.1:56228 (error 108)
Metrics: {"server-negotiator.queue_time_us":20}
[       OK ] Parameters/TestRpc.RpcPendingConnectionsMetric/SSL_TCP (12 ms)
[ RUN      ] Parameters/TestRpc.TestRpcContextClientDeadline/SSL_TCP
I20260927 18:33:53.372821 16669 acceptor_pool.cc:254] collecting diagnostics on the listening RPC socket 0.0.0.0:45771 every 8 connection(s)
I20260927 18:33:53.372845 16670 acceptor_pool.cc:254] collecting diagnostics on the listening RPC socket 0.0.0.0:45771 every 8 connection(s)
[       OK ] Parameters/TestRpc.TestRpcContextClientDeadline/SSL_TCP (48 ms)
[ RUN      ] Parameters/TestRpc.TestApplicationFeatureFlagUnsupportedServer/SSL_TCP
I20260927 18:33:53.425871 16694 acceptor_pool.cc:254] collecting diagnostics on the listening RPC socket 0.0.0.0:43133 every 8 connection(s)
I20260927 18:33:53.425902 16695 acceptor_pool.cc:254] collecting diagnostics on the listening RPC socket 0.0.0.0:43133 every 8 connection(s)
[       OK ] Parameters/TestRpc.TestApplicationFeatureFlagUnsupportedServer/SSL_TCP (28 ms)
[ RUN      ] Parameters/TestRpc.TestCancellationAsync/SSL_TCP
I20260927 18:33:53.454783 16719 acceptor_pool.cc:254] collecting diagnostics on the listening RPC socket 0.0.0.0:41267 every 8 connection(s)
I20260927 18:33:53.454811 16720 acceptor_pool.cc:254] collecting diagnostics on the listening RPC socket 0.0.0.0:41267 every 8 connection(s)
I20260927 18:33:53.454927 16287 rpc-test.cc:1716] Connecting to 0.0.0.0:41267
I20260927 18:33:53.474388 16287 test_util.cc:268] Using random seed: 822477648
I20260927 18:33:53.489806 16723 rpc-test-base.h:240] got call: sleep_micros: 500 pattern: 4294967295 num_repetitions: 2097152 sidecar_idx: 0
I20260927 18:33:53.503589 16723 rpc-test-base.h:240] got call: sleep_micros: 500 pattern: 4294967295 num_repetitions: 2097152 sidecar_idx: 0
I20260927 18:33:53.515777 16723 rpc-test-base.h:240] got call: sleep_micros: 500 pattern: 4294967295 num_repetitions: 2097152 sidecar_idx: 0
I20260927 18:33:53.528290 16723 rpc-test-base.h:240] got call: sleep_micros: 500 pattern: 4294967295 num_repetitions: 2097152 sidecar_idx: 0
I20260927 18:33:53.540933 16723 rpc-test-base.h:240] got call: sleep_micros: 500 pattern: 4294967295 num_repetitions: 2097152 sidecar_idx: 0
I20260927 18:33:53.553750 16723 rpc-test-base.h:240] got call: sleep_micros: 500 pattern: 4294967295 num_repetitions: 2097152 sidecar_idx: 0
I20260927 18:33:53.566229 16723 rpc-test-base.h:240] got call: sleep_micros: 500 pattern: 4294967295 num_repetitions: 2097152 sidecar_idx: 0
I20260927 18:33:53.578164 16723 rpc-test-base.h:240] got call: sleep_micros: 500 pattern: 4294967295 num_repetitions: 2097152 sidecar_idx: 0
W20260927 18:33:53.581355 16717 connection.cc:441] server connection from 127.0.0.1:32834 torn down before Call kudu.rpc.GenericCalculatorService.SleepWithSidecar from 127.0.0.1:32834 (request call id 9) could send its response
[       OK ] Parameters/TestRpc.TestCancellationAsync/SSL_TCP (143 ms)
[ RUN      ] Parameters/TestRpc.TestPerformanceBySocketType/SSL_TCP
I20260927 18:33:53.599298 16744 acceptor_pool.cc:254] collecting diagnostics on the listening RPC socket 0.0.0.0:39441 every 8 connection(s)
I20260927 18:33:53.599326 16745 acceptor_pool.cc:254] collecting diagnostics on the listening RPC socket 0.0.0.0:39441 every 8 connection(s)
I20260927 18:33:53.599426 16287 rpc-test.cc:1846] Connecting to 0.0.0.0:39441
I20260927 18:33:55.078794 16287 rpc-test.cc:1859] Sending 1024MB via ssl-enabled tcp socket: real 1.452s	user 1.426s	sys 1.157s
I20260927 18:33:56.572865 16287 rpc-test.cc:1859] Sending 1024MB via ssl-enabled tcp socket: real 1.494s	user 1.494s	sys 1.161s
I20260927 18:33:58.127381 16287 rpc-test.cc:1859] Sending 1024MB via ssl-enabled tcp socket: real 1.554s	user 1.516s	sys 1.254s
I20260927 18:33:59.656893 16287 rpc-test.cc:1859] Sending 1024MB via ssl-enabled tcp socket: real 1.529s	user 1.482s	sys 1.221s
I20260927 18:34:01.288968 16287 rpc-test.cc:1859] Sending 1024MB via ssl-enabled tcp socket: real 1.632s	user 1.540s	sys 1.334s
[       OK ] Parameters/TestRpc.TestPerformanceBySocketType/SSL_TCP (7708 ms)
[----------] 20 tests from Parameters/TestRpc (26197 ms total)

[----------] 1 test from Parameters/TestRpcSocketTxRxQueue
[ RUN      ] Parameters/TestRpcSocketTxRxQueue.OverCapacity/0
W20260927 18:34:01.564761 16787 negotiation.cc:337] Failed RPC negotiation. Trace:
0927 18:34:01.304914 (+     0us) reactor.cc:625] Submitting negotiation task for client connection to 0.0.0.0:40269 (local address 127.0.0.1:33954)
0927 18:34:01.304948 (+    34us) negotiation.cc:107] Waiting for socket to connect
0927 18:34:01.304957 (+     9us) client_negotiation.cc:174] Beginning negotiation
0927 18:34:01.305000 (+    43us) client_negotiation.cc:252] Sending NEGOTIATE NegotiatePB request
0927 18:34:01.564667 (+259667us) negotiation.cc:327] Negotiation complete: Network error: Client connection negotiation failed: client connection to 0.0.0.0:40269: BlockingRecv error: recv error from unknown peer: Transport endpoint is not connected (error 107)
Metrics: {"client-negotiator.queue_time_us":17}
W20260927 18:34:01.564764 16779 negotiation.cc:337] Failed RPC negotiation. Trace:
0927 18:34:01.303967 (+     0us) reactor.cc:625] Submitting negotiation task for client connection to 0.0.0.0:40269 (local address 127.0.0.1:33940)
0927 18:34:01.304004 (+    37us) negotiation.cc:107] Waiting for socket to connect
0927 18:34:01.304011 (+     7us) client_negotiation.cc:174] Beginning negotiation
0927 18:34:01.304046 (+    35us) client_negotiation.cc:252] Sending NEGOTIATE NegotiatePB request
0927 18:34:01.564630 (+260584us) negotiation.cc:327] Negotiation complete: Network error: Client connection negotiation failed: client connection to 0.0.0.0:40269: BlockingRecv error: recv error from unknown peer: Transport endpoint is not connected (error 107)
Metrics: {"client-negotiator.queue_time_us":15}
W20260927 18:34:01.564765 16806 negotiation.cc:337] Failed RPC negotiation. Trace:
0927 18:34:01.306419 (+     0us) reactor.cc:625] Submitting negotiation task for client connection to 0.0.0.0:40269 (local address 127.0.0.1:33974)
0927 18:34:01.306453 (+    34us) negotiation.cc:107] Waiting for socket to connect
0927 18:34:01.306460 (+     7us) client_negotiation.cc:174] Beginning negotiation
0927 18:34:01.306493 (+    33us) client_negotiation.cc:252] Sending NEGOTIATE NegotiatePB request
0927 18:34:01.564727 (+258234us) negotiation.cc:327] Negotiation complete: Network error: Client connection negotiation failed: client connection to 0.0.0.0:40269: BlockingRecv error: recv error from unknown peer: Transport endpoint is not connected (error 107)
Metrics: {"client-negotiator.queue_time_us":18}
W20260927 18:34:01.564848 16761 negotiation.cc:337] Failed RPC negotiation. Trace:
0927 18:34:01.302369 (+     0us) reactor.cc:625] Submitting negotiation task for client connection to 0.0.0.0:40269 (local address 127.0.0.1:33930)
0927 18:34:01.302419 (+    50us) negotiation.cc:107] Waiting for socket to connect
0927 18:34:01.302429 (+    10us) client_negotiation.cc:174] Beginning negotiation
0927 18:34:01.302480 (+    51us) client_negotiation.cc:252] Sending NEGOTIATE NegotiatePB request
0927 18:34:01.564617 (+262137us) negotiation.cc:327] Negotiation complete: Network error: Client connection negotiation failed: client connection to 0.0.0.0:40269: BlockingRecv error: recv error from unknown peer: Transport endpoint is not connected (error 107)
Metrics: {"client-negotiator.queue_time_us":29}
W20260927 18:34:01.564993 16797 negotiation.cc:337] Failed RPC negotiation. Trace:
0927 18:34:01.305633 (+     0us) reactor.cc:625] Submitting negotiation task for client connection to 0.0.0.0:40269 (local address 127.0.0.1:33958)
0927 18:34:01.305691 (+    58us) negotiation.cc:107] Waiting for socket to connect
0927 18:34:01.305700 (+     9us) client_negotiation.cc:174] Beginning negotiation
0927 18:34:01.305737 (+    37us) client_negotiation.cc:252] Sending NEGOTIATE NegotiatePB request
0927 18:34:01.564871 (+259134us) negotiation.cc:327] Negotiation complete: Network error: Client connection negotiation failed: client connection to 0.0.0.0:40269: BlockingRecv error: recv error from unknown peer: Transport endpoint is not connected (error 107)
Metrics: {"client-negotiator.queue_time_us":36}
W20260927 18:34:01.565092 16770 negotiation.cc:337] Failed RPC negotiation. Trace:
0927 18:34:01.303205 (+     0us) reactor.cc:625] Submitting negotiation task for client connection to 0.0.0.0:40269 (local address 127.0.0.1:33934)
0927 18:34:01.303248 (+    43us) negotiation.cc:107] Waiting for socket to connect
0927 18:34:01.303255 (+     7us) client_negotiation.cc:174] Beginning negotiation
0927 18:34:01.303292 (+    37us) client_negotiation.cc:252] Sending NEGOTIATE NegotiatePB request
0927 18:34:01.564617 (+261325us) negotiation.cc:327] Negotiation complete: Network error: Client connection negotiation failed: client connection to 0.0.0.0:40269: BlockingRecv error: recv error from unknown peer: Transport endpoint is not connected (error 107)
Metrics: {"client-negotiator.queue_time_us":17}
[       OK ] Parameters/TestRpcSocketTxRxQueue.OverCapacity/0 (1049 ms)
[----------] 1 test from Parameters/TestRpcSocketTxRxQueue (1049 ms total)

[----------] Global test environment tear-down
[==========] 21 tests from 2 test suites ran. (27247 ms total)
[  PASSED  ] 20 tests.
[  FAILED  ] 1 test, listed below:
[  FAILED  ] Parameters/TestRpc.TestCallWithChainCertAndChainCA/SSL_TCP, where GetParam() = (true, false)

 1 FAILED TEST