Diagnosed failure

Parameters/TestRpc.TestCallWithChainCertAndChainCA/SSL_TCP: /data0/somelongdirectorytoavoidrpathissues/src/kudu/src/kudu/rpc/rpc-test.cc:270: Failure
Failed
Bad status: Runtime error: could not verify certificate chain (error with cert: subject=CN = localhost, ST = sadfjas, C = AS, emailAddress = sdflkdsajf, O = lskdfjlsad, OU = sldfkja, issuer=C = AS, ST = ASDfkjdhf, L = lskdjf, O = saldfja, OU = skdjf, CN = localhost, emailAddress = sadjflkadsj): : certificate has expired
Google Test trace:
/data0/somelongdirectorytoavoidrpathissues/src/kudu/src/kudu/rpc/rpc-test.cc:267: Connecting to 0.0.0.0:36699
I20260924 15:59:10.598661 15404 test_util.cc:175] -----------------------------------------------
I20260924 15:59:10.598752 15404 test_util.cc:176] Had fatal failures, leaving test files at /tmp/dist-test-taskS_Q46E/test-tmp/rpc-test.5.Parameters_TestRpc.TestCallWithChainCertAndChainCA_SSL_TCP.1790265550469526-15404-0

Full log

Note: This is test shard 6 of 8.
[==========] Running 21 tests from 2 test suites.
[----------] Global test environment set-up.
[----------] 20 tests from Parameters/TestRpc
[ RUN      ] Parameters/TestRpc.TestMessengerCreateDestroy/SSL_TCP
WARNING: Logging before InitGoogleLogging() is written to STDERR
I20260924 15:59:10.517805 15404 rpc-test.cc:169] started messenger TestCreateDestroy
[       OK ] Parameters/TestRpc.TestMessengerCreateDestroy/SSL_TCP (28 ms)
[ RUN      ] Parameters/TestRpc.TestNegotiationDeadlock/SSL_TCP
I20260924 15:59:10.537340 15424 acceptor_pool.cc:254] collecting diagnostics on the listening RPC socket 0.0.0.0:45321 every 8 connection(s)
I20260924 15:59:10.537703 15425 acceptor_pool.cc:254] collecting diagnostics on the listening RPC socket 0.0.0.0:45321 every 8 connection(s)
[       OK ] Parameters/TestRpc.TestNegotiationDeadlock/SSL_TCP (38 ms)
[ RUN      ] Parameters/TestRpc.TestCallWithChainCertAndChainCA/SSL_TCP
I20260924 15:59:10.585892 15440 acceptor_pool.cc:254] collecting diagnostics on the listening RPC socket 0.0.0.0:36699 every 8 connection(s)
I20260924 15:59:10.586350 15441 acceptor_pool.cc:254] collecting diagnostics on the listening RPC socket 0.0.0.0:36699 every 8 connection(s)
/data0/somelongdirectorytoavoidrpathissues/src/kudu/src/kudu/rpc/rpc-test.cc:270: Failure
Failed
Bad status: Runtime error: could not verify certificate chain (error with cert: subject=CN = localhost, ST = sadfjas, C = AS, emailAddress = sdflkdsajf, O = lskdfjlsad, OU = sldfkja, issuer=C = AS, ST = ASDfkjdhf, L = lskdjf, O = saldfja, OU = skdjf, CN = localhost, emailAddress = sadjflkadsj): : certificate has expired
Google Test trace:
/data0/somelongdirectorytoavoidrpathissues/src/kudu/src/kudu/rpc/rpc-test.cc:267: Connecting to 0.0.0.0:36699
I20260924 15:59:10.598661 15404 test_util.cc:175] -----------------------------------------------
I20260924 15:59:10.598752 15404 test_util.cc:176] Had fatal failures, leaving test files at /tmp/dist-test-taskS_Q46E/test-tmp/rpc-test.5.Parameters_TestRpc.TestCallWithChainCertAndChainCA_SSL_TCP.1790265550469526-15404-0
[  FAILED  ] Parameters/TestRpc.TestCallWithChainCertAndChainCA/SSL_TCP, where GetParam() = (true, false) (38 ms)
[ RUN      ] Parameters/TestRpc.TestCallWithPasswordProtectedKey/SSL_TCP
I20260924 15:59:10.633096 15465 acceptor_pool.cc:254] collecting diagnostics on the listening RPC socket 0.0.0.0:45921 every 8 connection(s)
I20260924 15:59:10.633433 15466 acceptor_pool.cc:254] collecting diagnostics on the listening RPC socket 0.0.0.0:45921 every 8 connection(s)
[       OK ] Parameters/TestRpc.TestCallWithPasswordProtectedKey/SSL_TCP (73 ms)
[ RUN      ] Parameters/TestRpc.TestCallToBadServer/SSL_TCP
I20260924 15:59:10.682077 15404 rpc-test.cc:394] Status: Network error: Client connection negotiation failed: client connection to 0.0.0.0:0: connect: Connection refused (error 111)
I20260924 15:59:10.682729 15404 rpc-test.cc:394] Status: Network error: Client connection negotiation failed: client connection to 0.0.0.0:0: connect: Connection refused (error 111)
I20260924 15:59:10.683341 15404 rpc-test.cc:394] Status: Network error: Client connection negotiation failed: client connection to 0.0.0.0:0: connect: Connection refused (error 111)
I20260924 15:59:10.683917 15404 rpc-test.cc:394] Status: Network error: Client connection negotiation failed: client connection to 0.0.0.0:0: connect: Connection refused (error 111)
I20260924 15:59:10.684490 15404 rpc-test.cc:394] Status: Network error: Client connection negotiation failed: client connection to 0.0.0.0:0: connect: Connection refused (error 111)
[       OK ] Parameters/TestRpc.TestCallToBadServer/SSL_TCP (13 ms)
[ RUN      ] Parameters/TestRpc.TestWrongService/SSL_TCP
I20260924 15:59:10.722839 15500 acceptor_pool.cc:254] collecting diagnostics on the listening RPC socket 0.0.0.0:39273 every 8 connection(s)
I20260924 15:59:10.723197 15501 acceptor_pool.cc:254] collecting diagnostics on the listening RPC socket 0.0.0.0:39273 every 8 connection(s)
I20260924 15:59:10.746706 15497 messenger.cc:345] service WrongServiceName not registered on TestServer
[       OK ] Parameters/TestRpc.TestWrongService/SSL_TCP (65 ms)
[ RUN      ] Parameters/TestRpc.TestConnectionKeepalive/SSL_TCP
I20260924 15:59:10.776929 15524 acceptor_pool.cc:254] collecting diagnostics on the listening RPC socket 0.0.0.0:44655 every 8 connection(s)
I20260924 15:59:10.777195 15525 acceptor_pool.cc:254] collecting diagnostics on the listening RPC socket 0.0.0.0:44655 every 8 connection(s)
I20260924 15:59:10.778077 15404 rpc-test.cc:488] Connecting to 0.0.0.0:44655
[       OK ] Parameters/TestRpc.TestConnectionKeepalive/SSL_TCP (1055 ms)
[ RUN      ] Parameters/TestRpc.TestClientConnectionMetrics/SSL_TCP
I20260924 15:59:11.836181 15549 acceptor_pool.cc:254] collecting diagnostics on the listening RPC socket 0.0.0.0:34903 every 8 connection(s)
I20260924 15:59:11.836537 15550 acceptor_pool.cc:254] collecting diagnostics on the listening RPC socket 0.0.0.0:34903 every 8 connection(s)
I20260924 15:59:11.837479 15404 rpc-test.cc:569] Connecting to 0.0.0.0:34903
[       OK ] Parameters/TestRpc.TestClientConnectionMetrics/SSL_TCP (21122 ms)
[ RUN      ] Parameters/TestRpc.TestCredentialsPolicy/SSL_TCP
I20260924 15:59:32.981299 15572 acceptor_pool.cc:254] collecting diagnostics on the listening RPC socket 0.0.0.0:33097 every 8 connection(s)
I20260924 15:59:32.981549 15573 acceptor_pool.cc:254] collecting diagnostics on the listening RPC socket 0.0.0.0:33097 every 8 connection(s)
I20260924 15:59:32.982607 15404 rpc-test.cc:700] Connecting to 0.0.0.0:33097
[       OK ] Parameters/TestRpc.TestCredentialsPolicy/SSL_TCP (102 ms)
[ RUN      ] Parameters/TestRpc.TestCallLongerThanKeepalive/SSL_TCP
I20260924 15:59:33.051301 15597 acceptor_pool.cc:254] collecting diagnostics on the listening RPC socket 0.0.0.0:33477 every 8 connection(s)
I20260924 15:59:33.051556 15598 acceptor_pool.cc:254] collecting diagnostics on the listening RPC socket 0.0.0.0:33477 every 8 connection(s)
I20260924 15:59:33.066560 15601 rpc-test-base.h:222] got call: sleep_micros: 3000000 deferred: true
I20260924 15:59:36.068794 15601 rpcz_store.cc:275] Call kudu.rpc.GenericCalculatorService.Sleep from 127.0.0.1:38902 (request call id 0) took 3002 ms. Trace:
I20260924 15:59:36.069020 15601 rpcz_store.cc:276] 0924 15:59:33.066378 (+     0us) service_pool.cc:170] Inserting onto call queue
0924 15:59:33.066499 (+   121us) service_pool.cc:227] Handling call
0924 15:59:36.068747 (+3002248us) inbound_call.cc:173] Queueing success response
Metrics: {}
[       OK ] Parameters/TestRpc.TestCallLongerThanKeepalive/SSL_TCP (3041 ms)
[ RUN      ] Parameters/TestRpc.TestRpcSidecar/SSL_TCP
I20260924 15:59:36.084228 15623 acceptor_pool.cc:254] collecting diagnostics on the listening RPC socket 0.0.0.0:36911 every 8 connection(s)
I20260924 15:59:36.084487 15624 acceptor_pool.cc:254] collecting diagnostics on the listening RPC socket 0.0.0.0:36911 every 8 connection(s)
[       OK ] Parameters/TestRpc.TestRpcSidecar/SSL_TCP (138 ms)
[ RUN      ] Parameters/TestRpc.TestRpcSidecarLimits/SSL_TCP
I20260924 15:59:40.185412 15648 acceptor_pool.cc:254] collecting diagnostics on the listening RPC socket 0.0.0.0:34131 every 8 connection(s)
I20260924 15:59:40.185760 15649 acceptor_pool.cc:254] collecting diagnostics on the listening RPC socket 0.0.0.0:34131 every 8 connection(s)
W20260924 15:59:40.206516 15404 serialization.cc:72] Serialized kudu.rpc_test.PushStringsRequestPB (2147483654 bytes) is larger than the maximum configured RPC message size (52428800 bytes). Sending anyway, but peer may reject the data.
W20260924 15:59:40.214048 15645 connection.cc:535] server connection from 127.0.0.1:41590 recv error: Network error: RPC frame had a length of 2147483714, but we only support messages up to 52428800 bytes long.
W20260924 15:59:40.214260 15645 connection.cc:158] shutting down server connection from 127.0.0.1:41590 with pending inbound data: 4/2147483714 bytes received; last active 0 ns ago: status Network error: RPC frame had a length of 2147483714, but we only support messages up to 52428800 bytes long.
W20260924 15:59:40.214921 15661 connection.cc:196] Error closing socket: Network error: TlsSocket::Close: Connection reset by peer
I20260924 15:59:40.255493 15673 acceptor_pool.cc:254] collecting diagnostics on the listening RPC socket 0.0.0.0:39471 every 8 connection(s)
I20260924 15:59:40.256304 15674 acceptor_pool.cc:254] collecting diagnostics on the listening RPC socket 0.0.0.0:39471 every 8 connection(s)
W20260924 15:59:48.902100 15672 connection.cc:577] server connection from 127.0.0.1:40728: received bad data: 'Corruption: Invalid packet: message had a length of 2147483710, but we only support messages up to 2147483647 bytes
'
[       OK ] Parameters/TestRpc.TestRpcSidecarLimits/SSL_TCP (13200 ms)
[ RUN      ] Parameters/TestRpc.TestCallTimeoutDoesntAffectNegotiation/SSL_TCP
I20260924 15:59:49.448076 15698 acceptor_pool.cc:254] collecting diagnostics on the listening RPC socket 0.0.0.0:38555 every 8 connection(s)
I20260924 15:59:49.448349 15699 acceptor_pool.cc:254] collecting diagnostics on the listening RPC socket 0.0.0.0:38555 every 8 connection(s)
W20260924 15:59:49.466960 15694 negotiation.cc:266] Injecting 500ms delay in negotiation
I20260924 15:59:49.517382 15404 rpc-test-base.h:595] status: Timed out: connection negotiation to 0.0.0.0:38555 for RPC Sleep timed out after 0.050s (ON_OUTBOUND_QUEUE), seconds elapsed: 0.0510848
[       OK ] Parameters/TestRpc.TestCallTimeoutDoesntAffectNegotiation/SSL_TCP (564 ms)
[ RUN      ] Parameters/TestRpc.TestRpcHandlerLatencyMetric/SSL_TCP
I20260924 15:59:49.991109 15723 acceptor_pool.cc:254] collecting diagnostics on the listening RPC socket 0.0.0.0:39867 every 8 connection(s)
I20260924 15:59:49.991401 15724 acceptor_pool.cc:254] collecting diagnostics on the listening RPC socket 0.0.0.0:39867 every 8 connection(s)
I20260924 15:59:50.041622 15404 rpc-test.cc:1236] Sleep() min lat: 20615
I20260924 15:59:50.041716 15404 rpc-test.cc:1237] Sleep() mean lat: 20615
I20260924 15:59:50.041755 15404 rpc-test.cc:1238] Sleep() max lat: 20615
I20260924 15:59:50.041775 15404 rpc-test.cc:1239] Sleep() #calls: 1
[       OK ] Parameters/TestRpc.TestRpcHandlerLatencyMetric/SSL_TCP (68 ms)
[ RUN      ] Parameters/TestRpc.TimedOutOnResponseMetricServiceQueue/SSL_TCP
I20260924 15:59:50.068703 15750 acceptor_pool.cc:254] collecting diagnostics on the listening RPC socket 0.0.0.0:35489 every 8 connection(s)
I20260924 15:59:50.068945 15751 acceptor_pool.cc:254] collecting diagnostics on the listening RPC socket 0.0.0.0:35489 every 8 connection(s)
W20260924 15:59:50.130250 15752 rpcz_store.cc:267] Call kudu.rpc_test.CalculatorService.Sleep from 127.0.0.1:49140 (request call id 2) took 20 ms (client timeout 20 ms). Trace:
W20260924 15:59:50.130434 15752 rpcz_store.cc:269] 0924 15:59:50.109823 (+     0us) service_pool.cc:170] Inserting onto call queue
0924 15:59:50.130174 (+ 20351us) service_pool.cc:214] Skipping call since client already timed out
0924 15:59:50.130231 (+    57us) inbound_call.cc:173] Queueing failure response
Metrics: {}
[       OK ] Parameters/TestRpc.TimedOutOnResponseMetricServiceQueue/SSL_TCP (88 ms)
[ RUN      ] Parameters/TestRpc.RpcPendingConnectionsMetric/SSL_TCP
I20260924 15:59:50.139662 15773 acceptor_pool.cc:254] collecting diagnostics on the listening RPC socket 0.0.0.0:41013 every 8 connection(s)
I20260924 15:59:50.139904 15774 acceptor_pool.cc:254] collecting diagnostics on the listening RPC socket 0.0.0.0:41013 every 8 connection(s)
W20260924 15:59:50.141942 15769 negotiation.cc:337] Failed RPC negotiation. Trace:
0924 15:59:50.141334 (+     0us) reactor.cc:625] Submitting negotiation task for server connection from 127.0.0.1:42772 (local address 127.0.0.1:41013)
0924 15:59:50.141470 (+   136us) server_negotiation.cc:206] Beginning negotiation
0924 15:59:50.141474 (+     4us) server_negotiation.cc:399] Waiting for connection header
0924 15:59:50.141619 (+   145us) negotiation.cc:327] Negotiation complete: Network error: Server connection negotiation failed: server connection from 127.0.0.1:42772: BlockingRecv error: recv got EOF from 127.0.0.1:42772 (error 108)
Metrics: {"server-negotiator.queue_time_us":40}
[       OK ] Parameters/TestRpc.RpcPendingConnectionsMetric/SSL_TCP (19 ms)
[ RUN      ] Parameters/TestRpc.TestRpcContextClientDeadline/SSL_TCP
I20260924 15:59:50.163146 15789 acceptor_pool.cc:254] collecting diagnostics on the listening RPC socket 0.0.0.0:40533 every 8 connection(s)
I20260924 15:59:50.163326 15790 acceptor_pool.cc:254] collecting diagnostics on the listening RPC socket 0.0.0.0:40533 every 8 connection(s)
[       OK ] Parameters/TestRpc.TestRpcContextClientDeadline/SSL_TCP (63 ms)
[ RUN      ] Parameters/TestRpc.TestApplicationFeatureFlagUnsupportedServer/SSL_TCP
I20260924 15:59:50.231109 15814 acceptor_pool.cc:254] collecting diagnostics on the listening RPC socket 0.0.0.0:37241 every 8 connection(s)
I20260924 15:59:50.231353 15815 acceptor_pool.cc:254] collecting diagnostics on the listening RPC socket 0.0.0.0:37241 every 8 connection(s)
[       OK ] Parameters/TestRpc.TestApplicationFeatureFlagUnsupportedServer/SSL_TCP (37 ms)
[ RUN      ] Parameters/TestRpc.TestCancellationAsync/SSL_TCP
I20260924 15:59:50.274700 15839 acceptor_pool.cc:254] collecting diagnostics on the listening RPC socket 0.0.0.0:43425 every 8 connection(s)
I20260924 15:59:50.274982 15840 acceptor_pool.cc:254] collecting diagnostics on the listening RPC socket 0.0.0.0:43425 every 8 connection(s)
I20260924 15:59:50.275926 15404 rpc-test.cc:1716] Connecting to 0.0.0.0:43425
I20260924 15:59:50.285778 15404 test_util.cc:268] Using random seed: -1332738636
I20260924 15:59:50.321518 15843 rpc-test-base.h:240] got call: sleep_micros: 500 pattern: 4294967295 num_repetitions: 2097152 sidecar_idx: 0
I20260924 15:59:50.347271 15842 rpc-test-base.h:240] got call: sleep_micros: 500 pattern: 4294967295 num_repetitions: 2097152 sidecar_idx: 0
I20260924 15:59:50.373107 15841 rpc-test-base.h:240] got call: sleep_micros: 500 pattern: 4294967295 num_repetitions: 2097152 sidecar_idx: 0
I20260924 15:59:50.398628 15843 rpc-test-base.h:240] got call: sleep_micros: 500 pattern: 4294967295 num_repetitions: 2097152 sidecar_idx: 0
I20260924 15:59:50.428207 15841 rpc-test-base.h:240] got call: sleep_micros: 500 pattern: 4294967295 num_repetitions: 2097152 sidecar_idx: 0
I20260924 15:59:50.458213 15842 rpc-test-base.h:240] got call: sleep_micros: 500 pattern: 4294967295 num_repetitions: 2097152 sidecar_idx: 0
W20260924 15:59:50.493567 15836 connection.cc:698] server connection from 127.0.0.1:41122 send error: Network error: failed to write to TLS socket: Broken pipe
W20260924 15:59:50.493733 15836 connection.cc:441] server connection from 127.0.0.1:41122 torn down before Call kudu.rpc.GenericCalculatorService.SleepWithSidecar from 127.0.0.1:41122 (request call id 9) could send its response
W20260924 15:59:50.494076 15836 connection.cc:196] Error closing socket: Network error: TlsSocket::Close: Success
W20260924 15:59:50.508190 15836 connection.cc:441] server connection from 127.0.0.1:41122 torn down before Call kudu.rpc.GenericCalculatorService.SleepWithSidecar from 127.0.0.1:41122 (request call id 8) could send its response
[       OK ] Parameters/TestRpc.TestCancellationAsync/SSL_TCP (255 ms)
[ RUN      ] Parameters/TestRpc.TestPerformanceBySocketType/SSL_TCP
I20260924 15:59:50.525090 15864 acceptor_pool.cc:254] collecting diagnostics on the listening RPC socket 0.0.0.0:40499 every 8 connection(s)
I20260924 15:59:50.525332 15865 acceptor_pool.cc:254] collecting diagnostics on the listening RPC socket 0.0.0.0:40499 every 8 connection(s)
I20260924 15:59:50.526216 15404 rpc-test.cc:1846] Connecting to 0.0.0.0:40499
I20260924 15:59:53.533941 15404 rpc-test.cc:1859] Sending 1024MB via ssl-enabled tcp socket: real 2.988s	user 2.639s	sys 2.247s
I20260924 15:59:56.551326 15404 rpc-test.cc:1859] Sending 1024MB via ssl-enabled tcp socket: real 3.017s	user 2.612s	sys 2.301s
I20260924 15:59:59.671475 15404 rpc-test.cc:1859] Sending 1024MB via ssl-enabled tcp socket: real 3.120s	user 2.764s	sys 2.344s
I20260924 16:00:02.674252 15404 rpc-test.cc:1859] Sending 1024MB via ssl-enabled tcp socket: real 3.003s	user 2.649s	sys 2.261s
I20260924 16:00:05.760659 15404 rpc-test.cc:1859] Sending 1024MB via ssl-enabled tcp socket: real 3.086s	user 2.737s	sys 2.299s
[       OK ] Parameters/TestRpc.TestPerformanceBySocketType/SSL_TCP (15261 ms)
[----------] 20 tests from Parameters/TestRpc (55280 ms total)

[----------] 1 test from Parameters/TestRpcSocketTxRxQueue
[ RUN      ] Parameters/TestRpcSocketTxRxQueue.OverCapacity/0
W20260924 16:00:06.071102 15891 negotiation.cc:337] Failed RPC negotiation. Trace:
0924 16:00:05.780100 (+     0us) reactor.cc:625] Submitting negotiation task for client connection to 0.0.0.0:35165 (local address 127.0.0.1:37538)
0924 16:00:05.780292 (+   192us) negotiation.cc:107] Waiting for socket to connect
0924 16:00:05.780313 (+    21us) client_negotiation.cc:174] Beginning negotiation
0924 16:00:05.780421 (+   108us) client_negotiation.cc:252] Sending NEGOTIATE NegotiatePB request
0924 16:00:06.070653 (+290232us) negotiation.cc:327] Negotiation complete: Network error: Client connection negotiation failed: client connection to 0.0.0.0:35165: BlockingRecv error: recv error from unknown peer: Transport endpoint is not connected (error 107)
Metrics: {"client-negotiator.queue_time_us":54}
W20260924 16:00:06.071251 15909 negotiation.cc:337] Failed RPC negotiation. Trace:
0924 16:00:05.785122 (+     0us) reactor.cc:625] Submitting negotiation task for client connection to 0.0.0.0:35165 (local address 127.0.0.1:37562)
0924 16:00:05.785350 (+   228us) negotiation.cc:107] Waiting for socket to connect
0924 16:00:05.785370 (+    20us) client_negotiation.cc:174] Beginning negotiation
0924 16:00:05.785490 (+   120us) client_negotiation.cc:252] Sending NEGOTIATE NegotiatePB request
0924 16:00:06.070653 (+285163us) negotiation.cc:327] Negotiation complete: Network error: Client connection negotiation failed: client connection to 0.0.0.0:35165: BlockingRecv error: recv error from unknown peer: Transport endpoint is not connected (error 107)
Metrics: {"client-negotiator.queue_time_us":75}
W20260924 16:00:06.072624 15918 negotiation.cc:337] Failed RPC negotiation. Trace:
0924 16:00:05.788155 (+     0us) reactor.cc:625] Submitting negotiation task for client connection to 0.0.0.0:35165 (local address 127.0.0.1:37566)
0924 16:00:05.788350 (+   195us) negotiation.cc:107] Waiting for socket to connect
0924 16:00:05.788374 (+    24us) client_negotiation.cc:174] Beginning negotiation
0924 16:00:05.788491 (+   117us) client_negotiation.cc:252] Sending NEGOTIATE NegotiatePB request
0924 16:00:06.071018 (+282527us) negotiation.cc:327] Negotiation complete: Network error: Client connection negotiation failed: client connection to 0.0.0.0:35165: BlockingRecv error: recv error from unknown peer: Transport endpoint is not connected (error 107)
Metrics: {"client-negotiator.queue_time_us":54}
W20260924 16:00:06.072724 15927 negotiation.cc:337] Failed RPC negotiation. Trace:
0924 16:00:05.791412 (+     0us) reactor.cc:625] Submitting negotiation task for client connection to 0.0.0.0:35165 (local address 127.0.0.1:37578)
0924 16:00:05.791618 (+   206us) negotiation.cc:107] Waiting for socket to connect
0924 16:00:05.791643 (+    25us) client_negotiation.cc:174] Beginning negotiation
0924 16:00:05.791772 (+   129us) client_negotiation.cc:252] Sending NEGOTIATE NegotiatePB request
0924 16:00:06.071028 (+279256us) negotiation.cc:327] Negotiation complete: Network error: Client connection negotiation failed: client connection to 0.0.0.0:35165: BlockingRecv error: recv error from unknown peer: Transport endpoint is not connected (error 107)
Metrics: {"client-negotiator.queue_time_us":53}
W20260924 16:00:06.072819 15882 negotiation.cc:337] Failed RPC negotiation. Trace:
0924 16:00:05.776987 (+     0us) reactor.cc:625] Submitting negotiation task for client connection to 0.0.0.0:35165 (local address 127.0.0.1:37532)
0924 16:00:05.777223 (+   236us) negotiation.cc:107] Waiting for socket to connect
0924 16:00:05.777242 (+    19us) client_negotiation.cc:174] Beginning negotiation
0924 16:00:05.777373 (+   131us) client_negotiation.cc:252] Sending NEGOTIATE NegotiatePB request
0924 16:00:06.070653 (+293280us) negotiation.cc:327] Negotiation complete: Network error: Client connection negotiation failed: client connection to 0.0.0.0:35165: BlockingRecv error: recv error from unknown peer: Transport endpoint is not connected (error 107)
Metrics: {"client-negotiator.queue_time_us":62}
W20260924 16:00:06.072870 15900 negotiation.cc:337] Failed RPC negotiation. Trace:
0924 16:00:05.782442 (+     0us) reactor.cc:625] Submitting negotiation task for client connection to 0.0.0.0:35165 (local address 127.0.0.1:37550)
0924 16:00:05.782622 (+   180us) negotiation.cc:107] Waiting for socket to connect
0924 16:00:05.782640 (+    18us) client_negotiation.cc:174] Beginning negotiation
0924 16:00:05.782784 (+   144us) client_negotiation.cc:252] Sending NEGOTIATE NegotiatePB request
0924 16:00:06.072002 (+289218us) negotiation.cc:327] Negotiation complete: Network error: Client connection negotiation failed: client connection to 0.0.0.0:35165: BlockingRecv error: recv error from unknown peer: Transport endpoint is not connected (error 107)
Metrics: {"client-negotiator.queue_time_us":34}
[       OK ] Parameters/TestRpcSocketTxRxQueue.OverCapacity/0 (1077 ms)
[----------] 1 test from Parameters/TestRpcSocketTxRxQueue (1077 ms total)

[----------] Global test environment tear-down
[==========] 21 tests from 2 test suites ran. (56358 ms total)
[  PASSED  ] 20 tests.
[  FAILED  ] 1 test, listed below:
[  FAILED  ] Parameters/TestRpc.TestCallWithChainCertAndChainCA/SSL_TCP, where GetParam() = (true, false)

 1 FAILED TEST