Diagnosed failure
Parameters/TestRpc.TestCallWithChainCertAndChainCA/SSL_TCP: /data0/somelongdirectorytoavoidrpathissues/src/kudu/src/kudu/rpc/rpc-test.cc:270: Failure
Failed
Bad status: Runtime error: could not verify certificate chain (error with cert: subject=CN = localhost, ST = sadfjas, C = AS, emailAddress = sdflkdsajf, O = lskdfjlsad, OU = sldfkja, issuer=C = AS, ST = ASDfkjdhf, L = lskdjf, O = saldfja, OU = skdjf, CN = localhost, emailAddress = sadjflkadsj): : certificate has expired
Google Test trace:
/data0/somelongdirectorytoavoidrpathissues/src/kudu/src/kudu/rpc/rpc-test.cc:267: Connecting to 0.0.0.0:44165
I20260927 18:33:11.998512 5382 test_util.cc:175] -----------------------------------------------
I20260927 18:33:11.998613 5382 test_util.cc:176] Had fatal failures, leaving test files at /tmp/dist-test-task84KxJY/test-tmp/rpc-test.5.Parameters_TestRpc.TestCallWithChainCertAndChainCA_SSL_TCP.1790533991883115-5382-0
Full log
Note: This is test shard 6 of 8.
[==========] Running 21 tests from 2 test suites.
[----------] Global test environment set-up.
[----------] 20 tests from Parameters/TestRpc
[ RUN ] Parameters/TestRpc.TestMessengerCreateDestroy/SSL_TCP
WARNING: Logging before InitGoogleLogging() is written to STDERR
I20260927 18:33:11.924501 5382 rpc-test.cc:169] started messenger TestCreateDestroy
[ OK ] Parameters/TestRpc.TestMessengerCreateDestroy/SSL_TCP (25 ms)
[ RUN ] Parameters/TestRpc.TestNegotiationDeadlock/SSL_TCP
I20260927 18:33:11.948819 5402 acceptor_pool.cc:254] collecting diagnostics on the listening RPC socket 0.0.0.0:37793 every 8 connection(s)
I20260927 18:33:11.949025 5403 acceptor_pool.cc:254] collecting diagnostics on the listening RPC socket 0.0.0.0:37793 every 8 connection(s)
[ OK ] Parameters/TestRpc.TestNegotiationDeadlock/SSL_TCP (42 ms)
[ RUN ] Parameters/TestRpc.TestCallWithChainCertAndChainCA/SSL_TCP
I20260927 18:33:11.986599 5418 acceptor_pool.cc:254] collecting diagnostics on the listening RPC socket 0.0.0.0:44165 every 8 connection(s)
I20260927 18:33:11.986917 5419 acceptor_pool.cc:254] collecting diagnostics on the listening RPC socket 0.0.0.0:44165 every 8 connection(s)
/data0/somelongdirectorytoavoidrpathissues/src/kudu/src/kudu/rpc/rpc-test.cc:270: Failure
Failed
Bad status: Runtime error: could not verify certificate chain (error with cert: subject=CN = localhost, ST = sadfjas, C = AS, emailAddress = sdflkdsajf, O = lskdfjlsad, OU = sldfkja, issuer=C = AS, ST = ASDfkjdhf, L = lskdjf, O = saldfja, OU = skdjf, CN = localhost, emailAddress = sadjflkadsj): : certificate has expired
Google Test trace:
/data0/somelongdirectorytoavoidrpathissues/src/kudu/src/kudu/rpc/rpc-test.cc:267: Connecting to 0.0.0.0:44165
I20260927 18:33:11.998512 5382 test_util.cc:175] -----------------------------------------------
I20260927 18:33:11.998613 5382 test_util.cc:176] Had fatal failures, leaving test files at /tmp/dist-test-task84KxJY/test-tmp/rpc-test.5.Parameters_TestRpc.TestCallWithChainCertAndChainCA_SSL_TCP.1790533991883115-5382-0
[ FAILED ] Parameters/TestRpc.TestCallWithChainCertAndChainCA/SSL_TCP, where GetParam() = (true, false) (28 ms)
[ RUN ] Parameters/TestRpc.TestCallWithPasswordProtectedKey/SSL_TCP
I20260927 18:33:12.015492 5443 acceptor_pool.cc:254] collecting diagnostics on the listening RPC socket 0.0.0.0:41907 every 8 connection(s)
I20260927 18:33:12.015735 5444 acceptor_pool.cc:254] collecting diagnostics on the listening RPC socket 0.0.0.0:41907 every 8 connection(s)
[ OK ] Parameters/TestRpc.TestCallWithPasswordProtectedKey/SSL_TCP (52 ms)
[ RUN ] Parameters/TestRpc.TestCallToBadServer/SSL_TCP
I20260927 18:33:12.085122 5382 rpc-test.cc:394] Status: Network error: Client connection negotiation failed: client connection to 0.0.0.0:0: connect: Connection refused (error 111)
I20260927 18:33:12.085893 5382 rpc-test.cc:394] Status: Network error: Client connection negotiation failed: client connection to 0.0.0.0:0: connect: Connection refused (error 111)
I20260927 18:33:12.086508 5382 rpc-test.cc:394] Status: Network error: Client connection negotiation failed: client connection to 0.0.0.0:0: connect: Connection refused (error 111)
I20260927 18:33:12.087082 5382 rpc-test.cc:394] Status: Network error: Client connection negotiation failed: client connection to 0.0.0.0:0: connect: Connection refused (error 111)
I20260927 18:33:12.087634 5382 rpc-test.cc:394] Status: Network error: Client connection negotiation failed: client connection to 0.0.0.0:0: connect: Connection refused (error 111)
[ OK ] Parameters/TestRpc.TestCallToBadServer/SSL_TCP (38 ms)
[ RUN ] Parameters/TestRpc.TestWrongService/SSL_TCP
I20260927 18:33:12.100077 5478 acceptor_pool.cc:254] collecting diagnostics on the listening RPC socket 0.0.0.0:32835 every 8 connection(s)
I20260927 18:33:12.100307 5479 acceptor_pool.cc:254] collecting diagnostics on the listening RPC socket 0.0.0.0:32835 every 8 connection(s)
I20260927 18:33:12.123281 5475 messenger.cc:345] service WrongServiceName not registered on TestServer
[ OK ] Parameters/TestRpc.TestWrongService/SSL_TCP (38 ms)
[ RUN ] Parameters/TestRpc.TestConnectionKeepalive/SSL_TCP
I20260927 18:33:12.143649 5501 acceptor_pool.cc:254] collecting diagnostics on the listening RPC socket 0.0.0.0:41131 every 8 connection(s)
I20260927 18:33:12.143908 5502 acceptor_pool.cc:254] collecting diagnostics on the listening RPC socket 0.0.0.0:41131 every 8 connection(s)
I20260927 18:33:12.144881 5382 rpc-test.cc:488] Connecting to 0.0.0.0:41131
[ OK ] Parameters/TestRpc.TestConnectionKeepalive/SSL_TCP (1082 ms)
[ RUN ] Parameters/TestRpc.TestClientConnectionMetrics/SSL_TCP
I20260927 18:33:13.222611 5526 acceptor_pool.cc:254] collecting diagnostics on the listening RPC socket 0.0.0.0:42441 every 8 connection(s)
I20260927 18:33:13.222877 5527 acceptor_pool.cc:254] collecting diagnostics on the listening RPC socket 0.0.0.0:42441 every 8 connection(s)
I20260927 18:33:13.223804 5382 rpc-test.cc:569] Connecting to 0.0.0.0:42441
[ OK ] Parameters/TestRpc.TestClientConnectionMetrics/SSL_TCP (19839 ms)
[ RUN ] Parameters/TestRpc.TestCredentialsPolicy/SSL_TCP
I20260927 18:33:33.066293 5549 acceptor_pool.cc:254] collecting diagnostics on the listening RPC socket 0.0.0.0:38271 every 8 connection(s)
I20260927 18:33:33.066501 5550 acceptor_pool.cc:254] collecting diagnostics on the listening RPC socket 0.0.0.0:38271 every 8 connection(s)
I20260927 18:33:33.067394 5382 rpc-test.cc:700] Connecting to 0.0.0.0:38271
[ OK ] Parameters/TestRpc.TestCredentialsPolicy/SSL_TCP (75 ms)
[ RUN ] Parameters/TestRpc.TestCallLongerThanKeepalive/SSL_TCP
I20260927 18:33:33.140645 5574 acceptor_pool.cc:254] collecting diagnostics on the listening RPC socket 0.0.0.0:43943 every 8 connection(s)
I20260927 18:33:33.140899 5575 acceptor_pool.cc:254] collecting diagnostics on the listening RPC socket 0.0.0.0:43943 every 8 connection(s)
I20260927 18:33:33.166517 5578 rpc-test-base.h:222] got call: sleep_micros: 3000000 deferred: true
I20260927 18:33:36.168249 5578 rpcz_store.cc:275] Call kudu.rpc.GenericCalculatorService.Sleep from 127.0.0.1:57582 (request call id 0) took 3001 ms. Trace:
I20260927 18:33:36.168413 5578 rpcz_store.cc:276] 0927 18:33:33.166370 (+ 0us) service_pool.cc:170] Inserting onto call queue
0927 18:33:33.166467 (+ 97us) service_pool.cc:227] Handling call
0927 18:33:36.168197 (+3001730us) inbound_call.cc:173] Queueing success response
Metrics: {}
[ OK ] Parameters/TestRpc.TestCallLongerThanKeepalive/SSL_TCP (3049 ms)
[ RUN ] Parameters/TestRpc.TestRpcSidecar/SSL_TCP
I20260927 18:33:36.190680 5599 acceptor_pool.cc:254] collecting diagnostics on the listening RPC socket 0.0.0.0:37957 every 8 connection(s)
I20260927 18:33:36.190929 5600 acceptor_pool.cc:254] collecting diagnostics on the listening RPC socket 0.0.0.0:37957 every 8 connection(s)
[ OK ] Parameters/TestRpc.TestRpcSidecar/SSL_TCP (129 ms)
[ RUN ] Parameters/TestRpc.TestRpcSidecarLimits/SSL_TCP
I20260927 18:33:38.389846 5624 acceptor_pool.cc:254] collecting diagnostics on the listening RPC socket 0.0.0.0:41101 every 8 connection(s)
I20260927 18:33:38.390081 5625 acceptor_pool.cc:254] collecting diagnostics on the listening RPC socket 0.0.0.0:41101 every 8 connection(s)
W20260927 18:33:38.437675 5382 serialization.cc:72] Serialized kudu.rpc_test.PushStringsRequestPB (2147483654 bytes) is larger than the maximum configured RPC message size (52428800 bytes). Sending anyway, but peer may reject the data.
W20260927 18:33:38.444708 5622 connection.cc:535] server connection from 127.0.0.1:37060 recv error: Network error: RPC frame had a length of 2147483714, but we only support messages up to 52428800 bytes long.
W20260927 18:33:38.444900 5622 connection.cc:158] shutting down server connection from 127.0.0.1:37060 with pending inbound data: 4/2147483714 bytes received; last active 0 ns ago: status Network error: RPC frame had a length of 2147483714, but we only support messages up to 52428800 bytes long.
W20260927 18:33:38.445497 5637 connection.cc:196] Error closing socket: Network error: TlsSocket::Close: Connection reset by peer
I20260927 18:33:38.460029 5649 acceptor_pool.cc:254] collecting diagnostics on the listening RPC socket 0.0.0.0:46379 every 8 connection(s)
I20260927 18:33:38.460264 5650 acceptor_pool.cc:254] collecting diagnostics on the listening RPC socket 0.0.0.0:46379 every 8 connection(s)
W20260927 18:33:43.656924 5647 connection.cc:577] server connection from 127.0.0.1:40120: received bad data: 'Corruption: Invalid packet: message had a length of 2147483710, but we only support messages up to 2147483647 bytes
'
[ OK ] Parameters/TestRpc.TestRpcSidecarLimits/SSL_TCP (7807 ms)
[ RUN ] Parameters/TestRpc.TestCallTimeoutDoesntAffectNegotiation/SSL_TCP
I20260927 18:33:44.139344 5674 acceptor_pool.cc:254] collecting diagnostics on the listening RPC socket 0.0.0.0:35189 every 8 connection(s)
I20260927 18:33:44.139621 5675 acceptor_pool.cc:254] collecting diagnostics on the listening RPC socket 0.0.0.0:35189 every 8 connection(s)
W20260927 18:33:44.161255 5670 negotiation.cc:266] Injecting 500ms delay in negotiation
I20260927 18:33:44.211675 5382 rpc-test-base.h:595] status: Timed out: connection negotiation to 0.0.0.0:35189 for RPC Sleep timed out after 0.050s (ON_OUTBOUND_QUEUE), seconds elapsed: 0.0510932
[ OK ] Parameters/TestRpc.TestCallTimeoutDoesntAffectNegotiation/SSL_TCP (559 ms)
[ RUN ] Parameters/TestRpc.TestRpcHandlerLatencyMetric/SSL_TCP
I20260927 18:33:44.688568 5699 acceptor_pool.cc:254] collecting diagnostics on the listening RPC socket 0.0.0.0:42881 every 8 connection(s)
I20260927 18:33:44.688820 5700 acceptor_pool.cc:254] collecting diagnostics on the listening RPC socket 0.0.0.0:42881 every 8 connection(s)
I20260927 18:33:44.739473 5382 rpc-test.cc:1236] Sleep() min lat: 20642
I20260927 18:33:44.739557 5382 rpc-test.cc:1237] Sleep() mean lat: 20642
I20260927 18:33:44.739595 5382 rpc-test.cc:1238] Sleep() max lat: 20642
I20260927 18:33:44.739619 5382 rpc-test.cc:1239] Sleep() #calls: 1
[ OK ] Parameters/TestRpc.TestRpcHandlerLatencyMetric/SSL_TCP (72 ms)
[ RUN ] Parameters/TestRpc.TimedOutOnResponseMetricServiceQueue/SSL_TCP
I20260927 18:33:44.768003 5725 acceptor_pool.cc:254] collecting diagnostics on the listening RPC socket 0.0.0.0:43323 every 8 connection(s)
I20260927 18:33:44.768230 5726 acceptor_pool.cc:254] collecting diagnostics on the listening RPC socket 0.0.0.0:43323 every 8 connection(s)
W20260927 18:33:44.833439 5727 rpcz_store.cc:267] Call kudu.rpc_test.CalculatorService.Sleep from 127.0.0.1:46790 (request call id 2) took 20 ms (client timeout 20 ms). Trace:
W20260927 18:33:44.833614 5727 rpcz_store.cc:269] 0927 18:33:44.813061 (+ 0us) service_pool.cc:170] Inserting onto call queue
0927 18:33:44.833380 (+ 20319us) service_pool.cc:214] Skipping call since client already timed out
0927 18:33:44.833422 (+ 42us) inbound_call.cc:173] Queueing failure response
Metrics: {}
[ OK ] Parameters/TestRpc.TimedOutOnResponseMetricServiceQueue/SSL_TCP (93 ms)
[ RUN ] Parameters/TestRpc.RpcPendingConnectionsMetric/SSL_TCP
I20260927 18:33:44.843304 5748 acceptor_pool.cc:254] collecting diagnostics on the listening RPC socket 0.0.0.0:42535 every 8 connection(s)
I20260927 18:33:44.843542 5749 acceptor_pool.cc:254] collecting diagnostics on the listening RPC socket 0.0.0.0:42535 every 8 connection(s)
W20260927 18:33:44.845628 5744 negotiation.cc:337] Failed RPC negotiation. Trace:
0927 18:33:44.845022 (+ 0us) reactor.cc:625] Submitting negotiation task for server connection from 127.0.0.1:37262 (local address 127.0.0.1:42535)
0927 18:33:44.845171 (+ 149us) server_negotiation.cc:206] Beginning negotiation
0927 18:33:44.845176 (+ 5us) server_negotiation.cc:399] Waiting for connection header
0927 18:33:44.845317 (+ 141us) negotiation.cc:327] Negotiation complete: Network error: Server connection negotiation failed: server connection from 127.0.0.1:37262: BlockingRecv error: recv got EOF from 127.0.0.1:37262 (error 108)
Metrics: {"server-negotiator.queue_time_us":48}
[ OK ] Parameters/TestRpc.RpcPendingConnectionsMetric/SSL_TCP (19 ms)
[ RUN ] Parameters/TestRpc.TestRpcContextClientDeadline/SSL_TCP
I20260927 18:33:44.870844 5764 acceptor_pool.cc:254] collecting diagnostics on the listening RPC socket 0.0.0.0:43493 every 8 connection(s)
I20260927 18:33:44.871057 5765 acceptor_pool.cc:254] collecting diagnostics on the listening RPC socket 0.0.0.0:43493 every 8 connection(s)
[ OK ] Parameters/TestRpc.TestRpcContextClientDeadline/SSL_TCP (61 ms)
[ RUN ] Parameters/TestRpc.TestApplicationFeatureFlagUnsupportedServer/SSL_TCP
I20260927 18:33:44.931151 5789 acceptor_pool.cc:254] collecting diagnostics on the listening RPC socket 0.0.0.0:36303 every 8 connection(s)
I20260927 18:33:44.931380 5790 acceptor_pool.cc:254] collecting diagnostics on the listening RPC socket 0.0.0.0:36303 every 8 connection(s)
[ OK ] Parameters/TestRpc.TestApplicationFeatureFlagUnsupportedServer/SSL_TCP (30 ms)
[ RUN ] Parameters/TestRpc.TestCancellationAsync/SSL_TCP
I20260927 18:33:44.960193 5814 acceptor_pool.cc:254] collecting diagnostics on the listening RPC socket 0.0.0.0:45737 every 8 connection(s)
I20260927 18:33:44.960450 5815 acceptor_pool.cc:254] collecting diagnostics on the listening RPC socket 0.0.0.0:45737 every 8 connection(s)
I20260927 18:33:44.961269 5382 rpc-test.cc:1716] Connecting to 0.0.0.0:45737
I20260927 18:33:44.993019 5382 test_util.cc:268] Using random seed: 813996253
I20260927 18:33:45.025219 5818 rpc-test-base.h:240] got call: sleep_micros: 500 pattern: 4294967295 num_repetitions: 2097152 sidecar_idx: 0
I20260927 18:33:45.044629 5817 rpc-test-base.h:240] got call: sleep_micros: 500 pattern: 4294967295 num_repetitions: 2097152 sidecar_idx: 0
I20260927 18:33:45.070010 5816 rpc-test-base.h:240] got call: sleep_micros: 500 pattern: 4294967295 num_repetitions: 2097152 sidecar_idx: 0
I20260927 18:33:45.101820 5818 rpc-test-base.h:240] got call: sleep_micros: 500 pattern: 4294967295 num_repetitions: 2097152 sidecar_idx: 0
I20260927 18:33:45.121546 5817 rpc-test-base.h:240] got call: sleep_micros: 500 pattern: 4294967295 num_repetitions: 2097152 sidecar_idx: 0
I20260927 18:33:45.154868 5816 rpc-test-base.h:240] got call: sleep_micros: 500 pattern: 4294967295 num_repetitions: 2097152 sidecar_idx: 0
W20260927 18:33:45.186725 5811 connection.cc:698] server connection from 127.0.0.1:43492 send error: Network error: failed to write to TLS socket: Broken pipe
W20260927 18:33:45.186896 5811 connection.cc:441] server connection from 127.0.0.1:43492 torn down before Call kudu.rpc.GenericCalculatorService.SleepWithSidecar from 127.0.0.1:43492 (request call id 9) could send its response
W20260927 18:33:45.187227 5811 connection.cc:196] Error closing socket: Network error: TlsSocket::Close: Success
W20260927 18:33:45.202664 5811 connection.cc:441] server connection from 127.0.0.1:43492 torn down before Call kudu.rpc.GenericCalculatorService.SleepWithSidecar from 127.0.0.1:43492 (request call id 8) could send its response
[ OK ] Parameters/TestRpc.TestCancellationAsync/SSL_TCP (255 ms)
[ RUN ] Parameters/TestRpc.TestPerformanceBySocketType/SSL_TCP
I20260927 18:33:45.230499 5839 acceptor_pool.cc:254] collecting diagnostics on the listening RPC socket 0.0.0.0:38067 every 8 connection(s)
I20260927 18:33:45.230739 5840 acceptor_pool.cc:254] collecting diagnostics on the listening RPC socket 0.0.0.0:38067 every 8 connection(s)
I20260927 18:33:45.231644 5382 rpc-test.cc:1846] Connecting to 0.0.0.0:38067
I20260927 18:33:48.081921 5382 rpc-test.cc:1859] Sending 1024MB via ssl-enabled tcp socket: real 2.821s user 2.681s sys 2.017s
I20260927 18:33:51.054381 5382 rpc-test.cc:1859] Sending 1024MB via ssl-enabled tcp socket: real 2.972s user 2.792s sys 2.157s
I20260927 18:33:53.964674 5382 rpc-test.cc:1859] Sending 1024MB via ssl-enabled tcp socket: real 2.910s user 2.669s sys 2.163s
I20260927 18:33:56.846778 5382 rpc-test.cc:1859] Sending 1024MB via ssl-enabled tcp socket: real 2.882s user 2.543s sys 2.239s
I20260927 18:33:59.721256 5382 rpc-test.cc:1859] Sending 1024MB via ssl-enabled tcp socket: real 2.874s user 2.717s sys 2.027s
[ OK ] Parameters/TestRpc.TestPerformanceBySocketType/SSL_TCP (14522 ms)
[----------] 20 tests from Parameters/TestRpc (47826 ms total)
[----------] 1 test from Parameters/TestRpcSocketTxRxQueue
[ RUN ] Parameters/TestRpcSocketTxRxQueue.OverCapacity/0
W20260927 18:34:00.036053 5865 negotiation.cc:337] Failed RPC negotiation. Trace:
0927 18:33:59.741123 (+ 0us) reactor.cc:625] Submitting negotiation task for client connection to 0.0.0.0:37003 (local address 127.0.0.1:33730)
0927 18:33:59.741409 (+ 286us) negotiation.cc:107] Waiting for socket to connect
0927 18:33:59.741428 (+ 19us) client_negotiation.cc:174] Beginning negotiation
0927 18:33:59.741593 (+ 165us) client_negotiation.cc:252] Sending NEGOTIATE NegotiatePB request
0927 18:34:00.035640 (+294047us) negotiation.cc:327] Negotiation complete: Network error: Client connection negotiation failed: client connection to 0.0.0.0:37003: BlockingRecv error: recv error from unknown peer: Transport endpoint is not connected (error 107)
Metrics: {"client-negotiator.queue_time_us":117}
W20260927 18:34:00.036216 5856 negotiation.cc:337] Failed RPC negotiation. Trace:
0927 18:33:59.738005 (+ 0us) reactor.cc:625] Submitting negotiation task for client connection to 0.0.0.0:37003 (local address 127.0.0.1:33728)
0927 18:33:59.738217 (+ 212us) negotiation.cc:107] Waiting for socket to connect
0927 18:33:59.738237 (+ 20us) client_negotiation.cc:174] Beginning negotiation
0927 18:33:59.738361 (+ 124us) client_negotiation.cc:252] Sending NEGOTIATE NegotiatePB request
0927 18:34:00.035661 (+297300us) negotiation.cc:327] Negotiation complete: Network error: Client connection negotiation failed: client connection to 0.0.0.0:37003: BlockingRecv error: recv error from unknown peer: Transport endpoint is not connected (error 107)
Metrics: {"client-negotiator.queue_time_us":66}
W20260927 18:34:00.036438 5874 negotiation.cc:337] Failed RPC negotiation. Trace:
0927 18:33:59.744540 (+ 0us) reactor.cc:625] Submitting negotiation task for client connection to 0.0.0.0:37003 (local address 127.0.0.1:33732)
0927 18:33:59.744821 (+ 281us) negotiation.cc:107] Waiting for socket to connect
0927 18:33:59.744839 (+ 18us) client_negotiation.cc:174] Beginning negotiation
0927 18:33:59.744957 (+ 118us) client_negotiation.cc:252] Sending NEGOTIATE NegotiatePB request
0927 18:34:00.035661 (+290704us) negotiation.cc:327] Negotiation complete: Network error: Client connection negotiation failed: client connection to 0.0.0.0:37003: BlockingRecv error: recv error from unknown peer: Transport endpoint is not connected (error 107)
Metrics: {"client-negotiator.queue_time_us":147}
W20260927 18:34:00.036810 5901 negotiation.cc:337] Failed RPC negotiation. Trace:
0927 18:33:59.754375 (+ 0us) reactor.cc:625] Submitting negotiation task for client connection to 0.0.0.0:37003 (local address 127.0.0.1:33754)
0927 18:33:59.754642 (+ 267us) negotiation.cc:107] Waiting for socket to connect
0927 18:33:59.754659 (+ 17us) client_negotiation.cc:174] Beginning negotiation
0927 18:33:59.754769 (+ 110us) client_negotiation.cc:252] Sending NEGOTIATE NegotiatePB request
0927 18:34:00.036262 (+281493us) negotiation.cc:327] Negotiation complete: Network error: Client connection negotiation failed: client connection to 0.0.0.0:37003: BlockingRecv error: recv error from unknown peer: Transport endpoint is not connected (error 107)
Metrics: {"client-negotiator.queue_time_us":118}
W20260927 18:34:00.037209 5892 negotiation.cc:337] Failed RPC negotiation. Trace:
0927 18:33:59.750933 (+ 0us) reactor.cc:625] Submitting negotiation task for client connection to 0.0.0.0:37003 (local address 127.0.0.1:33744)
0927 18:33:59.751124 (+ 191us) negotiation.cc:107] Waiting for socket to connect
0927 18:33:59.751142 (+ 18us) client_negotiation.cc:174] Beginning negotiation
0927 18:33:59.751251 (+ 109us) client_negotiation.cc:252] Sending NEGOTIATE NegotiatePB request
0927 18:34:00.036354 (+285103us) negotiation.cc:327] Negotiation complete: Network error: Client connection negotiation failed: client connection to 0.0.0.0:37003: BlockingRecv error: recv error from unknown peer: Transport endpoint is not connected (error 107)
Metrics: {"client-negotiator.queue_time_us":57}
W20260927 18:34:00.037279 5883 negotiation.cc:337] Failed RPC negotiation. Trace:
0927 18:33:59.747723 (+ 0us) reactor.cc:625] Submitting negotiation task for client connection to 0.0.0.0:37003 (local address 127.0.0.1:33738)
0927 18:33:59.747937 (+ 214us) negotiation.cc:107] Waiting for socket to connect
0927 18:33:59.747962 (+ 25us) client_negotiation.cc:174] Beginning negotiation
0927 18:33:59.748069 (+ 107us) client_negotiation.cc:252] Sending NEGOTIATE NegotiatePB request
0927 18:34:00.035770 (+287701us) negotiation.cc:327] Negotiation complete: Network error: Client connection negotiation failed: client connection to 0.0.0.0:37003: BlockingRecv error: recv error from unknown peer: Transport endpoint is not connected (error 107)
Metrics: {"client-negotiator.queue_time_us":56}
[ OK ] Parameters/TestRpcSocketTxRxQueue.OverCapacity/0 (1080 ms)
[----------] 1 test from Parameters/TestRpcSocketTxRxQueue (1080 ms total)
[----------] Global test environment tear-down
[==========] 21 tests from 2 test suites ran. (48906 ms total)
[ PASSED ] 20 tests.
[ FAILED ] 1 test, listed below:
[ FAILED ] Parameters/TestRpc.TestCallWithChainCertAndChainCA/SSL_TCP, where GetParam() = (true, false)
1 FAILED TEST