Diagnosed failure

Parameters/TestRpc.TestCallWithChainCertAndChainCA/SSL_UnixSocket: /data0/somelongdirectorytoavoidrpathissues/src/kudu/src/kudu/rpc/rpc-test.cc:270: Failure
Failed
Bad status: Runtime error: could not verify certificate chain (error with cert: subject=CN = localhost, ST = sadfjas, C = AS, emailAddress = sdflkdsajf, O = lskdfjlsad, OU = sldfkja, issuer=C = AS, ST = ASDfkjdhf, L = lskdjf, O = saldfja, OU = skdjf, CN = localhost, emailAddress = sadjflkadsj): : certificate has expired
Google Test trace:
/data0/somelongdirectorytoavoidrpathissues/src/kudu/src/kudu/rpc/rpc-test.cc:267: Connecting to unix:/tmp/dist-test-taskd9xsWn/test-tmp/rpc-test-d5588b6407cd437080210ee30ff23421.sock
I20260923 23:10:20.782848  2800 test_util.cc:175] -----------------------------------------------
I20260923 23:10:20.782894  2800 test_util.cc:176] Had fatal failures, leaving test files at /tmp/dist-test-taskd9xsWn/test-tmp/rpc-test.6.Parameters_TestRpc.TestCallWithChainCertAndChainCA_SSL_UnixSocket.1790205020713651-2800-0

Full log

Note: This is test shard 7 of 8.
[==========] Running 21 tests from 2 test suites.
[----------] Global test environment set-up.
[----------] 20 tests from Parameters/TestRpc
[ RUN      ] Parameters/TestRpc.TestMessengerCreateDestroy/SSL_UnixSocket
WARNING: Logging before InitGoogleLogging() is written to STDERR
I20260923 23:10:20.752362  2800 rpc-test.cc:169] started messenger TestCreateDestroy
[       OK ] Parameters/TestRpc.TestMessengerCreateDestroy/SSL_UnixSocket (37 ms)
[ RUN      ] Parameters/TestRpc.TestNegotiationDeadlock/SSL_UnixSocket
I20260923 23:10:20.761089  2820 acceptor_pool.cc:254] collecting diagnostics on the listening RPC socket unix:/tmp/dist-test-taskd9xsWn/test-tmp/rpc-test-65d705d9d9cf4a9e83e43a4c273d5452.sock every 8 connection(s)
I20260923 23:10:20.761112  2821 acceptor_pool.cc:254] collecting diagnostics on the listening RPC socket unix:/tmp/dist-test-taskd9xsWn/test-tmp/rpc-test-65d705d9d9cf4a9e83e43a4c273d5452.sock every 8 connection(s)
[       OK ] Parameters/TestRpc.TestNegotiationDeadlock/SSL_UnixSocket (14 ms)
[ RUN      ] Parameters/TestRpc.TestCallWithChainCertAndChainCA/SSL_UnixSocket
I20260923 23:10:20.779093  2837 acceptor_pool.cc:254] collecting diagnostics on the listening RPC socket unix:/tmp/dist-test-taskd9xsWn/test-tmp/rpc-test-d5588b6407cd437080210ee30ff23421.sock every 8 connection(s)
I20260923 23:10:20.779083  2836 acceptor_pool.cc:254] collecting diagnostics on the listening RPC socket unix:/tmp/dist-test-taskd9xsWn/test-tmp/rpc-test-d5588b6407cd437080210ee30ff23421.sock every 8 connection(s)
/data0/somelongdirectorytoavoidrpathissues/src/kudu/src/kudu/rpc/rpc-test.cc:270: Failure
Failed
Bad status: Runtime error: could not verify certificate chain (error with cert: subject=CN = localhost, ST = sadfjas, C = AS, emailAddress = sdflkdsajf, O = lskdfjlsad, OU = sldfkja, issuer=C = AS, ST = ASDfkjdhf, L = lskdjf, O = saldfja, OU = skdjf, CN = localhost, emailAddress = sadjflkadsj): : certificate has expired
Google Test trace:
/data0/somelongdirectorytoavoidrpathissues/src/kudu/src/kudu/rpc/rpc-test.cc:267: Connecting to unix:/tmp/dist-test-taskd9xsWn/test-tmp/rpc-test-d5588b6407cd437080210ee30ff23421.sock
I20260923 23:10:20.782848  2800 test_util.cc:175] -----------------------------------------------
I20260923 23:10:20.782894  2800 test_util.cc:176] Had fatal failures, leaving test files at /tmp/dist-test-taskd9xsWn/test-tmp/rpc-test.6.Parameters_TestRpc.TestCallWithChainCertAndChainCA_SSL_UnixSocket.1790205020713651-2800-0
[  FAILED  ] Parameters/TestRpc.TestCallWithChainCertAndChainCA/SSL_UnixSocket, where GetParam() = (true, true) (14 ms)
[ RUN      ] Parameters/TestRpc.TestCallWithPasswordProtectedKey/SSL_UnixSocket
I20260923 23:10:20.801532  2861 acceptor_pool.cc:254] collecting diagnostics on the listening RPC socket unix:/tmp/dist-test-taskd9xsWn/test-tmp/rpc-test-10d43a3e429f4207a253a15e8007a8fb.sock every 8 connection(s)
I20260923 23:10:20.801589  2862 acceptor_pool.cc:254] collecting diagnostics on the listening RPC socket unix:/tmp/dist-test-taskd9xsWn/test-tmp/rpc-test-10d43a3e429f4207a253a15e8007a8fb.sock every 8 connection(s)
W20260923 23:10:20.813162  2858 connection.cc:196] Error closing socket: Network error: TlsSocket::Close: Broken pipe
[       OK ] Parameters/TestRpc.TestCallWithPasswordProtectedKey/SSL_UnixSocket (31 ms)
[ RUN      ] Parameters/TestRpc.TestCallToBadServer/SSL_UnixSocket
I20260923 23:10:20.826038  2800 rpc-test.cc:394] Status: Network error: Client connection negotiation failed: client connection to 0.0.0.0:0: connect: Connection refused (error 111)
I20260923 23:10:20.826328  2800 rpc-test.cc:394] Status: Network error: Client connection negotiation failed: client connection to 0.0.0.0:0: connect: Connection refused (error 111)
I20260923 23:10:20.826536  2800 rpc-test.cc:394] Status: Network error: Client connection negotiation failed: client connection to 0.0.0.0:0: connect: Connection refused (error 111)
I20260923 23:10:20.826720  2800 rpc-test.cc:394] Status: Network error: Client connection negotiation failed: client connection to 0.0.0.0:0: connect: Connection refused (error 111)
I20260923 23:10:20.826941  2800 rpc-test.cc:394] Status: Network error: Client connection negotiation failed: client connection to 0.0.0.0:0: connect: Connection refused (error 111)
[       OK ] Parameters/TestRpc.TestCallToBadServer/SSL_UnixSocket (13 ms)
[ RUN      ] Parameters/TestRpc.TestWrongService/SSL_UnixSocket
I20260923 23:10:20.841915  2896 acceptor_pool.cc:254] collecting diagnostics on the listening RPC socket unix:/tmp/dist-test-taskd9xsWn/test-tmp/rpc-test-38ff4491fe574b47a088b0db5066191b.sock every 8 connection(s)
I20260923 23:10:20.841967  2897 acceptor_pool.cc:254] collecting diagnostics on the listening RPC socket unix:/tmp/dist-test-taskd9xsWn/test-tmp/rpc-test-38ff4491fe574b47a088b0db5066191b.sock every 8 connection(s)
I20260923 23:10:20.863023  2893 messenger.cc:345] service WrongServiceName not registered on TestServer
[       OK ] Parameters/TestRpc.TestWrongService/SSL_UnixSocket (37 ms)
[ RUN      ] Parameters/TestRpc.TestConnectionKeepalive/SSL_UnixSocket
I20260923 23:10:20.892010  2919 acceptor_pool.cc:254] collecting diagnostics on the listening RPC socket unix:/tmp/dist-test-taskd9xsWn/test-tmp/rpc-test-5df4d0e315494e73992b9530f232d8d0.sock every 8 connection(s)
I20260923 23:10:20.892060  2920 acceptor_pool.cc:254] collecting diagnostics on the listening RPC socket unix:/tmp/dist-test-taskd9xsWn/test-tmp/rpc-test-5df4d0e315494e73992b9530f232d8d0.sock every 8 connection(s)
I20260923 23:10:20.892287  2800 rpc-test.cc:488] Connecting to unix:/tmp/dist-test-taskd9xsWn/test-tmp/rpc-test-5df4d0e315494e73992b9530f232d8d0.sock
W20260923 23:10:21.366132  2932 connection.cc:196] Error closing socket: Network error: TlsSocket::Close: Broken pipe
[       OK ] Parameters/TestRpc.TestConnectionKeepalive/SSL_UnixSocket (1046 ms)
[ RUN      ] Parameters/TestRpc.TestClientConnectionMetrics/SSL_UnixSocket
I20260923 23:10:21.936471  2944 acceptor_pool.cc:254] collecting diagnostics on the listening RPC socket unix:/tmp/dist-test-taskd9xsWn/test-tmp/rpc-test-a626387d0aa74967af756521fa676d9b.sock every 8 connection(s)
I20260923 23:10:21.936514  2945 acceptor_pool.cc:254] collecting diagnostics on the listening RPC socket unix:/tmp/dist-test-taskd9xsWn/test-tmp/rpc-test-a626387d0aa74967af756521fa676d9b.sock every 8 connection(s)
I20260923 23:10:21.936681  2800 rpc-test.cc:569] Connecting to unix:/tmp/dist-test-taskd9xsWn/test-tmp/rpc-test-a626387d0aa74967af756521fa676d9b.sock
W20260923 23:10:30.186291  2941 connection.cc:196] Error closing socket: Network error: TlsSocket::Close: Broken pipe
[       OK ] Parameters/TestRpc.TestClientConnectionMetrics/SSL_UnixSocket (8275 ms)
[ RUN      ] Parameters/TestRpc.TestCredentialsPolicy/SSL_UnixSocket
I20260923 23:10:30.201051  2967 acceptor_pool.cc:254] collecting diagnostics on the listening RPC socket unix:/tmp/dist-test-taskd9xsWn/test-tmp/rpc-test-ce496eea93c941ceac1ea3af5b660531.sock every 8 connection(s)
I20260923 23:10:30.201174  2968 acceptor_pool.cc:254] collecting diagnostics on the listening RPC socket unix:/tmp/dist-test-taskd9xsWn/test-tmp/rpc-test-ce496eea93c941ceac1ea3af5b660531.sock every 8 connection(s)
I20260923 23:10:30.201313  2800 rpc-test.cc:700] Connecting to unix:/tmp/dist-test-taskd9xsWn/test-tmp/rpc-test-ce496eea93c941ceac1ea3af5b660531.sock
W20260923 23:10:30.222464  2966 connection.cc:196] Error closing socket: Network error: TlsSocket::Close: Broken pipe
[       OK ] Parameters/TestRpc.TestCredentialsPolicy/SSL_UnixSocket (39 ms)
[ RUN      ] Parameters/TestRpc.TestCallLongerThanKeepalive/SSL_UnixSocket
I20260923 23:10:30.253116  2992 acceptor_pool.cc:254] collecting diagnostics on the listening RPC socket unix:/tmp/dist-test-taskd9xsWn/test-tmp/rpc-test-d8235ad8cc4549049d4a0a2f07ceea36.sock every 8 connection(s)
I20260923 23:10:30.253185  2993 acceptor_pool.cc:254] collecting diagnostics on the listening RPC socket unix:/tmp/dist-test-taskd9xsWn/test-tmp/rpc-test-d8235ad8cc4549049d4a0a2f07ceea36.sock every 8 connection(s)
I20260923 23:10:30.277428  2996 rpc-test-base.h:222] got call: sleep_micros: 3000000 deferred: true
I20260923 23:10:33.278101  2996 rpcz_store.cc:275] Call kudu.rpc.GenericCalculatorService.Sleep from unix:<unnamed> (request call id 0) took 3000 ms. Trace:
I20260923 23:10:33.278195  2996 rpcz_store.cc:276] 0923 23:10:30.277370 (+     0us) service_pool.cc:170] Inserting onto call queue
0923 23:10:30.277413 (+    43us) service_pool.cc:227] Handling call
0923 23:10:33.278083 (+3000670us) inbound_call.cc:173] Queueing success response
Metrics: {}
[       OK ] Parameters/TestRpc.TestCallLongerThanKeepalive/SSL_UnixSocket (3053 ms)
[ RUN      ] Parameters/TestRpc.TestRpcSidecar/SSL_UnixSocket
I20260923 23:10:33.307986  3017 acceptor_pool.cc:254] collecting diagnostics on the listening RPC socket unix:/tmp/dist-test-taskd9xsWn/test-tmp/rpc-test-bd1d4c7adf3b4464b9dbdf89ceb8c334.sock every 8 connection(s)
I20260923 23:10:33.308043  3018 acceptor_pool.cc:254] collecting diagnostics on the listening RPC socket unix:/tmp/dist-test-taskd9xsWn/test-tmp/rpc-test-bd1d4c7adf3b4464b9dbdf89ceb8c334.sock every 8 connection(s)
W20260923 23:10:33.346006  3014 connection.cc:196] Error closing socket: Network error: TlsSocket::Close: Broken pipe
[       OK ] Parameters/TestRpc.TestRpcSidecar/SSL_UnixSocket (66 ms)
[ RUN      ] Parameters/TestRpc.TestRpcSidecarLimits/SSL_UnixSocket
I20260923 23:10:35.076314  3042 acceptor_pool.cc:254] collecting diagnostics on the listening RPC socket unix:/tmp/dist-test-taskd9xsWn/test-tmp/rpc-test-106fe961b6be401cac5b853ad131f290.sock every 8 connection(s)
I20260923 23:10:35.076395  3043 acceptor_pool.cc:254] collecting diagnostics on the listening RPC socket unix:/tmp/dist-test-taskd9xsWn/test-tmp/rpc-test-106fe961b6be401cac5b853ad131f290.sock every 8 connection(s)
W20260923 23:10:35.114256  2800 serialization.cc:72] Serialized kudu.rpc_test.PushStringsRequestPB (2147483654 bytes) is larger than the maximum configured RPC message size (52428800 bytes). Sending anyway, but peer may reject the data.
W20260923 23:10:35.117475  3039 connection.cc:535] server connection from unix:<unnamed> recv error: Network error: RPC frame had a length of 2147483714, but we only support messages up to 52428800 bytes long.
W20260923 23:10:35.117523  3039 connection.cc:158] shutting down server connection from unix:<unnamed> with pending inbound data: 4/2147483714 bytes received; last active 0 ns ago: status Network error: RPC frame had a length of 2147483714, but we only support messages up to 52428800 bytes long.
W20260923 23:10:35.117658  3055 connection.cc:698] client connection to unix:/tmp/dist-test-taskd9xsWn/test-tmp/rpc-test-106fe961b6be401cac5b853ad131f290.sock send error: Network error: failed to write to TLS socket: Broken pipe
W20260923 23:10:35.117789  3055 connection.cc:196] Error closing socket: Network error: TlsSocket::Close: Success
I20260923 23:10:35.140127  3067 acceptor_pool.cc:254] collecting diagnostics on the listening RPC socket unix:/tmp/dist-test-taskd9xsWn/test-tmp/rpc-test-106fe961b6be401cac5b853ad131f290.sock every 8 connection(s)
I20260923 23:10:35.140127  3068 acceptor_pool.cc:254] collecting diagnostics on the listening RPC socket unix:/tmp/dist-test-taskd9xsWn/test-tmp/rpc-test-106fe961b6be401cac5b853ad131f290.sock every 8 connection(s)
W20260923 23:10:39.353456  3064 connection.cc:577] server connection from unix:<unnamed>: received bad data: 'Corruption: Invalid packet: message had a length of 2147483710, but we only support messages up to 2147483647 bytes
'
W20260923 23:10:39.353721  3080 connection.cc:196] Error closing socket: Network error: TlsSocket::Close: Broken pipe
[       OK ] Parameters/TestRpc.TestRpcSidecarLimits/SSL_UnixSocket (6007 ms)
[ RUN      ] Parameters/TestRpc.TestCallTimeoutDoesntAffectNegotiation/SSL_UnixSocket
I20260923 23:10:39.369897  3092 acceptor_pool.cc:254] collecting diagnostics on the listening RPC socket unix:/tmp/dist-test-taskd9xsWn/test-tmp/rpc-test-c0cc4e5bfb7e41aa9646d4594e32e12f.sock every 8 connection(s)
I20260923 23:10:39.369951  3093 acceptor_pool.cc:254] collecting diagnostics on the listening RPC socket unix:/tmp/dist-test-taskd9xsWn/test-tmp/rpc-test-c0cc4e5bfb7e41aa9646d4594e32e12f.sock every 8 connection(s)
W20260923 23:10:39.374801  3088 negotiation.cc:266] Injecting 500ms delay in negotiation
I20260923 23:10:39.425118  2800 rpc-test-base.h:595] status: Timed out: connection negotiation to unix:/tmp/dist-test-taskd9xsWn/test-tmp/rpc-test-c0cc4e5bfb7e41aa9646d4594e32e12f.sock for RPC Sleep timed out after 0.050s (ON_OUTBOUND_QUEUE), seconds elapsed: 0.0505466
[       OK ] Parameters/TestRpc.TestCallTimeoutDoesntAffectNegotiation/SSL_UnixSocket (523 ms)
[ RUN      ] Parameters/TestRpc.TestRpcHandlerLatencyMetric/SSL_UnixSocket
I20260923 23:10:39.893049  3117 acceptor_pool.cc:254] collecting diagnostics on the listening RPC socket unix:/tmp/dist-test-taskd9xsWn/test-tmp/rpc-test-b8c3739c4ef145b3a7f4825bf75be2cb.sock every 8 connection(s)
I20260923 23:10:39.893091  3118 acceptor_pool.cc:254] collecting diagnostics on the listening RPC socket unix:/tmp/dist-test-taskd9xsWn/test-tmp/rpc-test-b8c3739c4ef145b3a7f4825bf75be2cb.sock every 8 connection(s)
I20260923 23:10:39.931103  2800 rpc-test.cc:1236] Sleep() min lat: 20245
I20260923 23:10:39.931164  2800 rpc-test.cc:1237] Sleep() mean lat: 20245
I20260923 23:10:39.931188  2800 rpc-test.cc:1238] Sleep() max lat: 20245
I20260923 23:10:39.931221  2800 rpc-test.cc:1239] Sleep() #calls: 1
W20260923 23:10:39.931818  3114 connection.cc:196] Error closing socket: Network error: TlsSocket::Close: Broken pipe
[       OK ] Parameters/TestRpc.TestRpcHandlerLatencyMetric/SSL_UnixSocket (53 ms)
[ RUN      ] Parameters/TestRpc.TimedOutOnResponseMetricServiceQueue/SSL_UnixSocket
I20260923 23:10:39.946327  3143 acceptor_pool.cc:254] collecting diagnostics on the listening RPC socket unix:/tmp/dist-test-taskd9xsWn/test-tmp/rpc-test-0af4f15ca5ba4df086aee1145b93fd26.sock every 8 connection(s)
I20260923 23:10:39.946381  3144 acceptor_pool.cc:254] collecting diagnostics on the listening RPC socket unix:/tmp/dist-test-taskd9xsWn/test-tmp/rpc-test-0af4f15ca5ba4df086aee1145b93fd26.sock every 8 connection(s)
W20260923 23:10:39.998283  3145 rpcz_store.cc:267] Call kudu.rpc_test.CalculatorService.Sleep from unix:<unnamed> (request call id 2) took 20 ms (client timeout 20 ms). Trace:
W20260923 23:10:39.998411  3145 rpcz_store.cc:269] 0923 23:10:39.978108 (+     0us) service_pool.cc:170] Inserting onto call queue
0923 23:10:39.998261 (+ 20153us) service_pool.cc:214] Skipping call since client already timed out
0923 23:10:39.998270 (+     9us) inbound_call.cc:173] Queueing failure response
Metrics: {}
[       OK ] Parameters/TestRpc.TimedOutOnResponseMetricServiceQueue/SSL_UnixSocket (66 ms)
[ RUN      ] Parameters/TestRpc.RpcPendingConnectionsMetric/SSL_UnixSocket
I20260923 23:10:40.001919  3166 acceptor_pool.cc:254] collecting diagnostics on the listening RPC socket 0.0.0.0:41507 every 8 connection(s)
I20260923 23:10:40.001965  3167 acceptor_pool.cc:254] collecting diagnostics on the listening RPC socket 0.0.0.0:41507 every 8 connection(s)
W20260923 23:10:40.002565  3162 negotiation.cc:337] Failed RPC negotiation. Trace:
0923 23:10:40.002375 (+     0us) reactor.cc:625] Submitting negotiation task for server connection from 127.0.0.1:55866 (local address 127.0.0.1:41507)
0923 23:10:40.002454 (+    79us) server_negotiation.cc:206] Beginning negotiation
0923 23:10:40.002456 (+     2us) server_negotiation.cc:399] Waiting for connection header
0923 23:10:40.002518 (+    62us) negotiation.cc:327] Negotiation complete: Network error: Server connection negotiation failed: server connection from 127.0.0.1:55866: BlockingRecv error: recv got EOF from 127.0.0.1:55866 (error 108)
Metrics: {"server-negotiator.queue_time_us":42}
[       OK ] Parameters/TestRpc.RpcPendingConnectionsMetric/SSL_UnixSocket (13 ms)
[ RUN      ] Parameters/TestRpc.TestRpcContextClientDeadline/SSL_UnixSocket
I20260923 23:10:40.023216  3182 acceptor_pool.cc:254] collecting diagnostics on the listening RPC socket unix:/tmp/dist-test-taskd9xsWn/test-tmp/rpc-test-25f676b6220c41cc8228e60abc1952d0.sock every 8 connection(s)
I20260923 23:10:40.023269  3183 acceptor_pool.cc:254] collecting diagnostics on the listening RPC socket unix:/tmp/dist-test-taskd9xsWn/test-tmp/rpc-test-25f676b6220c41cc8228e60abc1952d0.sock every 8 connection(s)
W20260923 23:10:40.062951  3179 connection.cc:196] Error closing socket: Network error: TlsSocket::Close: Broken pipe
[       OK ] Parameters/TestRpc.TestRpcContextClientDeadline/SSL_UnixSocket (50 ms)
[ RUN      ] Parameters/TestRpc.TestApplicationFeatureFlagUnsupportedServer/SSL_UnixSocket
I20260923 23:10:40.091832  3207 acceptor_pool.cc:254] collecting diagnostics on the listening RPC socket unix:/tmp/dist-test-taskd9xsWn/test-tmp/rpc-test-7c584816c3eb4695ada075d68012e5f3.sock every 8 connection(s)
I20260923 23:10:40.091877  3208 acceptor_pool.cc:254] collecting diagnostics on the listening RPC socket unix:/tmp/dist-test-taskd9xsWn/test-tmp/rpc-test-7c584816c3eb4695ada075d68012e5f3.sock every 8 connection(s)
[       OK ] Parameters/TestRpc.TestApplicationFeatureFlagUnsupportedServer/SSL_UnixSocket (43 ms)
[ RUN      ] Parameters/TestRpc.TestCancellationAsync/SSL_UnixSocket
I20260923 23:10:40.118026  3232 acceptor_pool.cc:254] collecting diagnostics on the listening RPC socket unix:/tmp/dist-test-taskd9xsWn/test-tmp/rpc-test-ae6d3354bce746faba8e047127c5a541.sock every 8 connection(s)
I20260923 23:10:40.118065  3233 acceptor_pool.cc:254] collecting diagnostics on the listening RPC socket unix:/tmp/dist-test-taskd9xsWn/test-tmp/rpc-test-ae6d3354bce746faba8e047127c5a541.sock every 8 connection(s)
I20260923 23:10:40.118212  2800 rpc-test.cc:1716] Connecting to unix:/tmp/dist-test-taskd9xsWn/test-tmp/rpc-test-ae6d3354bce746faba8e047127c5a541.sock
I20260923 23:10:40.129714  2800 test_util.cc:268] Using random seed: -1753352527
I20260923 23:10:40.144539  3236 rpc-test-base.h:240] got call: sleep_micros: 500 pattern: 4294967295 num_repetitions: 2097152 sidecar_idx: 0
I20260923 23:10:40.155105  3236 rpc-test-base.h:240] got call: sleep_micros: 500 pattern: 4294967295 num_repetitions: 2097152 sidecar_idx: 0
I20260923 23:10:40.165217  3236 rpc-test-base.h:240] got call: sleep_micros: 500 pattern: 4294967295 num_repetitions: 2097152 sidecar_idx: 0
I20260923 23:10:40.174631  3236 rpc-test-base.h:240] got call: sleep_micros: 500 pattern: 4294967295 num_repetitions: 2097152 sidecar_idx: 0
I20260923 23:10:40.184180  3236 rpc-test-base.h:240] got call: sleep_micros: 500 pattern: 4294967295 num_repetitions: 2097152 sidecar_idx: 0
I20260923 23:10:40.193796  3236 rpc-test-base.h:240] got call: sleep_micros: 500 pattern: 4294967295 num_repetitions: 2097152 sidecar_idx: 0
I20260923 23:10:40.204088  3236 rpc-test-base.h:240] got call: sleep_micros: 500 pattern: 4294967295 num_repetitions: 2097152 sidecar_idx: 0
W20260923 23:10:40.205148  3229 connection.cc:196] Error closing socket: Network error: TlsSocket::Close: Broken pipe
W20260923 23:10:40.207679  3229 connection.cc:441] server connection from unix:<unnamed> torn down before Call kudu.rpc.GenericCalculatorService.SleepWithSidecar from unix:<unnamed> (request call id 9) could send its response
[       OK ] Parameters/TestRpc.TestCancellationAsync/SSL_UnixSocket (101 ms)
[ RUN      ] Parameters/TestRpc.TestPerformanceBySocketType/SSL_UnixSocket
I20260923 23:10:40.223793  3257 acceptor_pool.cc:254] collecting diagnostics on the listening RPC socket unix:/tmp/dist-test-taskd9xsWn/test-tmp/rpc-test-f0ca268a49984db2a3f8b155ddcb1d88.sock every 8 connection(s)
I20260923 23:10:40.223847  3258 acceptor_pool.cc:254] collecting diagnostics on the listening RPC socket unix:/tmp/dist-test-taskd9xsWn/test-tmp/rpc-test-f0ca268a49984db2a3f8b155ddcb1d88.sock every 8 connection(s)
I20260923 23:10:40.223999  2800 rpc-test.cc:1846] Connecting to unix:/tmp/dist-test-taskd9xsWn/test-tmp/rpc-test-f0ca268a49984db2a3f8b155ddcb1d88.sock
I20260923 23:10:41.441776  2800 rpc-test.cc:1859] Sending 1024MB via ssl-enabled unix socket: real 1.210s	user 1.348s	sys 0.853s
I20260923 23:10:42.652714  2800 rpc-test.cc:1859] Sending 1024MB via ssl-enabled unix socket: real 1.211s	user 1.291s	sys 0.892s
I20260923 23:10:43.834214  2800 rpc-test.cc:1859] Sending 1024MB via ssl-enabled unix socket: real 1.181s	user 1.220s	sys 0.913s
I20260923 23:10:44.968076  2800 rpc-test.cc:1859] Sending 1024MB via ssl-enabled unix socket: real 1.134s	user 1.185s	sys 0.877s
I20260923 23:10:46.150805  2800 rpc-test.cc:1859] Sending 1024MB via ssl-enabled unix socket: real 1.183s	user 1.215s	sys 0.932s
[       OK ] Parameters/TestRpc.TestPerformanceBySocketType/SSL_UnixSocket (5943 ms)
[----------] 20 tests from Parameters/TestRpc (25436 ms total)

[----------] 1 test from Parameters/TestRpcSocketTxRxQueue
[ RUN      ] Parameters/TestRpcSocketTxRxQueue.AcceptorRxQueueSizeMetric/0
I20260923 23:10:46.167548  3283 acceptor_pool.cc:254] collecting diagnostics on the listening RPC socket 0.0.0.0:45903 every 1 connection(s)
I20260923 23:10:46.167927  3282 acceptor_pool.cc:254] collecting diagnostics on the listening RPC socket 0.0.0.0:45903 every 1 connection(s)
W20260923 23:10:46.168104  3278 negotiation.cc:337] Failed RPC negotiation. Trace:
0923 23:10:46.167928 (+     0us) reactor.cc:625] Submitting negotiation task for server connection from 127.0.0.1:59962 (local address 127.0.0.1:45903)
0923 23:10:46.167988 (+    60us) server_negotiation.cc:206] Beginning negotiation
0923 23:10:46.167990 (+     2us) server_negotiation.cc:399] Waiting for connection header
0923 23:10:46.168057 (+    67us) negotiation.cc:327] Negotiation complete: Network error: Server connection negotiation failed: server connection from 127.0.0.1:59962: BlockingRecv error: recv got EOF from 127.0.0.1:59962 (error 108)
Metrics: {"server-negotiator.queue_time_us":30}
[       OK ] Parameters/TestRpcSocketTxRxQueue.AcceptorRxQueueSizeMetric/0 (17 ms)
[----------] 1 test from Parameters/TestRpcSocketTxRxQueue (17 ms total)

[----------] Global test environment tear-down
[==========] 21 tests from 2 test suites ran. (25454 ms total)
[  PASSED  ] 20 tests.
[  FAILED  ] 1 test, listed below:
[  FAILED  ] Parameters/TestRpc.TestCallWithChainCertAndChainCA/SSL_UnixSocket, where GetParam() = (true, true)

 1 FAILED TEST