Diagnosed failure

Parameters/TestRpc.TestCallWithChainCertAndRootCA/SSL_TCP: /data0/somelongdirectorytoavoidrpathissues/src/kudu/src/kudu/rpc/rpc-test.cc:303: Failure
Failed
Bad status: Runtime error: could not verify certificate chain (error with cert: subject=CN = localhost, ST = sadfjas, C = AS, emailAddress = sdflkdsajf, O = lskdfjlsad, OU = sldfkja, issuer=C = AS, ST = ASDfkjdhf, L = lskdjf, O = saldfja, OU = skdjf, CN = localhost, emailAddress = sadjflkadsj): : certificate has expired
Google Test trace:
/data0/somelongdirectorytoavoidrpathissues/src/kudu/src/kudu/rpc/rpc-test.cc:300: Connecting to 0.0.0.0:35463
I20260924 14:12:01.253978  9200 test_util.cc:175] -----------------------------------------------
I20260924 14:12:01.254199  9200 test_util.cc:176] Had fatal failures, leaving test files at /tmp/dist-test-taskbJH5oA/test-tmp/rpc-test.1.Parameters_TestRpc.TestCallWithChainCertAndRootCA_SSL_TCP.1790259119646726-9200-0

Full log

Note: This is test shard 2 of 8.
[==========] Running 21 tests from 2 test suites.
[----------] Global test environment set-up.
[----------] 1 test from TestRpc
[ RUN      ] TestRpc.TestMethodsByName
[       OK ] TestRpc.TestMethodsByName (7 ms)
[----------] 1 test from TestRpc (7 ms total)

[----------] 20 tests from Parameters/TestRpc
[ RUN      ] Parameters/TestRpc.TestAcceptorPoolStartStop/SSL_TCP
WARNING: Logging before InitGoogleLogging() is written to STDERR
I20260924 14:11:59.755082  9215 acceptor_pool.cc:254] collecting diagnostics on the listening RPC socket 0.0.0.0:38989 every 8 connection(s)
I20260924 14:11:59.757010  9216 acceptor_pool.cc:254] collecting diagnostics on the listening RPC socket 0.0.0.0:38989 every 8 connection(s)
I20260924 14:12:00.966249  9227 acceptor_pool.cc:254] collecting diagnostics on the listening RPC socket 0.0.0.0:41059 every 8 connection(s)
I20260924 14:12:00.967887  9228 acceptor_pool.cc:254] collecting diagnostics on the listening RPC socket 0.0.0.0:41059 every 8 connection(s)
I20260924 14:12:01.015393  9238 acceptor_pool.cc:254] collecting diagnostics on the listening RPC socket 0.0.0.0:40755 every 8 connection(s)
I20260924 14:12:01.017179  9239 acceptor_pool.cc:254] collecting diagnostics on the listening RPC socket 0.0.0.0:40755 every 8 connection(s)
I20260924 14:12:01.046046  9249 acceptor_pool.cc:254] collecting diagnostics on the listening RPC socket 0.0.0.0:37035 every 8 connection(s)
I20260924 14:12:01.046833  9250 acceptor_pool.cc:254] collecting diagnostics on the listening RPC socket 0.0.0.0:37035 every 8 connection(s)
I20260924 14:12:01.073318  9260 acceptor_pool.cc:254] collecting diagnostics on the listening RPC socket 0.0.0.0:40257 every 8 connection(s)
I20260924 14:12:01.074317  9261 acceptor_pool.cc:254] collecting diagnostics on the listening RPC socket 0.0.0.0:40257 every 8 connection(s)
[       OK ] Parameters/TestRpc.TestAcceptorPoolStartStop/SSL_TCP (1369 ms)
[ RUN      ] Parameters/TestRpc.TestCall/SSL_TCP
I20260924 14:12:01.106441  9273 acceptor_pool.cc:254] collecting diagnostics on the listening RPC socket 0.0.0.0:39265 every 8 connection(s)
I20260924 14:12:01.108789  9274 acceptor_pool.cc:254] collecting diagnostics on the listening RPC socket 0.0.0.0:39265 every 8 connection(s)
I20260924 14:12:01.114440  9200 rpc-test.cc:234] Connecting to 0.0.0.0:39265
[       OK ] Parameters/TestRpc.TestCall/SSL_TCP (127 ms)
[ RUN      ] Parameters/TestRpc.TestCallWithChainCertAndRootCA/SSL_TCP
I20260924 14:12:01.228688  9298 acceptor_pool.cc:254] collecting diagnostics on the listening RPC socket 0.0.0.0:35463 every 8 connection(s)
I20260924 14:12:01.229511  9299 acceptor_pool.cc:254] collecting diagnostics on the listening RPC socket 0.0.0.0:35463 every 8 connection(s)
/data0/somelongdirectorytoavoidrpathissues/src/kudu/src/kudu/rpc/rpc-test.cc:303: Failure
Failed
Bad status: Runtime error: could not verify certificate chain (error with cert: subject=CN = localhost, ST = sadfjas, C = AS, emailAddress = sdflkdsajf, O = lskdfjlsad, OU = sldfkja, issuer=C = AS, ST = ASDfkjdhf, L = lskdjf, O = saldfja, OU = skdjf, CN = localhost, emailAddress = sadjflkadsj): : certificate has expired
Google Test trace:
/data0/somelongdirectorytoavoidrpathissues/src/kudu/src/kudu/rpc/rpc-test.cc:300: Connecting to 0.0.0.0:35463
I20260924 14:12:01.253978  9200 test_util.cc:175] -----------------------------------------------
I20260924 14:12:01.254199  9200 test_util.cc:176] Had fatal failures, leaving test files at /tmp/dist-test-taskbJH5oA/test-tmp/rpc-test.1.Parameters_TestRpc.TestCallWithChainCertAndRootCA_SSL_TCP.1790259119646726-9200-0
[  FAILED  ] Parameters/TestRpc.TestCallWithChainCertAndRootCA/SSL_TCP, where GetParam() = (true, false) (47 ms)
[ RUN      ] Parameters/TestRpc.TestCallWithBadPasswordProtectedKey/SSL_TCP
[       OK ] Parameters/TestRpc.TestCallWithBadPasswordProtectedKey/SSL_TCP (36 ms)
[ RUN      ] Parameters/TestRpc.TestInvalidMethodCall/SSL_TCP
I20260924 14:12:01.308593  9335 acceptor_pool.cc:254] collecting diagnostics on the listening RPC socket 0.0.0.0:42339 every 8 connection(s)
I20260924 14:12:01.309423  9336 acceptor_pool.cc:254] collecting diagnostics on the listening RPC socket 0.0.0.0:42339 every 8 connection(s)
I20260924 14:12:01.313035  9200 rpc-test.cc:406] Connecting to 0.0.0.0:42339
[       OK ] Parameters/TestRpc.TestInvalidMethodCall/SSL_TCP (63 ms)
[ RUN      ] Parameters/TestRpc.TestHighFDs/SSL_TCP
I20260924 14:12:01.588972  9360 acceptor_pool.cc:254] collecting diagnostics on the listening RPC socket 0.0.0.0:34873 every 8 connection(s)
I20260924 14:12:01.589749  9361 acceptor_pool.cc:254] collecting diagnostics on the listening RPC socket 0.0.0.0:34873 every 8 connection(s)
[       OK ] Parameters/TestRpc.TestHighFDs/SSL_TCP (301 ms)
[ RUN      ] Parameters/TestRpc.TestConnectionAlwaysKeepalive/SSL_TCP
I20260924 14:12:01.675364  9383 acceptor_pool.cc:254] collecting diagnostics on the listening RPC socket 0.0.0.0:34165 every 8 connection(s)
I20260924 14:12:01.676154  9384 acceptor_pool.cc:254] collecting diagnostics on the listening RPC socket 0.0.0.0:34165 every 8 connection(s)
I20260924 14:12:01.679461  9200 rpc-test.cc:532] Connecting to 0.0.0.0:34165
[       OK ] Parameters/TestRpc.TestConnectionAlwaysKeepalive/SSL_TCP (3066 ms)
[ RUN      ] Parameters/TestRpc.TestReopenOutboundConnections/SSL_TCP
I20260924 14:12:04.754180  9406 acceptor_pool.cc:254] collecting diagnostics on the listening RPC socket 0.0.0.0:38531 every 8 connection(s)
I20260924 14:12:04.754884  9407 acceptor_pool.cc:254] collecting diagnostics on the listening RPC socket 0.0.0.0:38531 every 8 connection(s)
I20260924 14:12:04.758910  9200 rpc-test.cc:658] Connecting to 0.0.0.0:38531
[       OK ] Parameters/TestRpc.TestReopenOutboundConnections/SSL_TCP (454 ms)
[ RUN      ] Parameters/TestRpc.TestConnectionNetworkPlane/SSL_TCP
I20260924 14:12:05.202900  9429 acceptor_pool.cc:254] collecting diagnostics on the listening RPC socket 0.0.0.0:38199 every 8 connection(s)
I20260924 14:12:05.203974  9430 acceptor_pool.cc:254] collecting diagnostics on the listening RPC socket 0.0.0.0:38199 every 8 connection(s)
I20260924 14:12:05.208071  9200 rpc-test.cc:772] Connecting to 0.0.0.0:38199
[       OK ] Parameters/TestRpc.TestConnectionNetworkPlane/SSL_TCP (87 ms)
[ RUN      ] Parameters/TestRpc.TestTCPKeepalive/SSL_TCP
I20260924 14:12:05.297039  9454 acceptor_pool.cc:254] collecting diagnostics on the listening RPC socket 0.0.0.0:36703 every 8 connection(s)
I20260924 14:12:05.298262  9455 acceptor_pool.cc:254] collecting diagnostics on the listening RPC socket 0.0.0.0:36703 every 8 connection(s)
I20260924 14:12:05.347440  9458 rpc-test-base.h:222] got call: sleep_micros: 8000000 deferred: true
I20260924 14:12:13.352068  9458 rpcz_store.cc:275] Call kudu.rpc.GenericCalculatorService.Sleep from 127.0.0.1:40504 (request call id 0) took 8005 ms. Trace:
I20260924 14:12:13.352514  9458 rpcz_store.cc:276] 0924 14:12:05.346909 (+     0us) service_pool.cc:170] Inserting onto call queue
0924 14:12:05.347245 (+   336us) service_pool.cc:227] Handling call
0924 14:12:13.351872 (+8004627us) inbound_call.cc:173] Queueing success response
Metrics: {}
[       OK ] Parameters/TestRpc.TestTCPKeepalive/SSL_TCP (8105 ms)
[ RUN      ] Parameters/TestRpc.TestMaxSmallSidecars/SSL_TCP
I20260924 14:12:13.403358  9480 acceptor_pool.cc:254] collecting diagnostics on the listening RPC socket 0.0.0.0:41557 every 8 connection(s)
I20260924 14:12:13.404541  9481 acceptor_pool.cc:254] collecting diagnostics on the listening RPC socket 0.0.0.0:41557 every 8 connection(s)
[       OK ] Parameters/TestRpc.TestMaxSmallSidecars/SSL_TCP (227 ms)
[ RUN      ] Parameters/TestRpc.TestCallTimeout/SSL_TCP
I20260924 14:12:13.620597  9505 acceptor_pool.cc:254] collecting diagnostics on the listening RPC socket 0.0.0.0:41895 every 8 connection(s)
I20260924 14:12:13.621294  9506 acceptor_pool.cc:254] collecting diagnostics on the listening RPC socket 0.0.0.0:41895 every 8 connection(s)
I20260924 14:12:13.667114  9200 rpc-test-base.h:595] status: Timed out: connection negotiation to 0.0.0.0:41895 for RPC Sleep timed out after 0.000s (ON_OUTBOUND_QUEUE), seconds elapsed: 0.00271886
I20260924 14:12:13.675767  9509 rpc-test-base.h:222] got call: sleep_micros: 700000
I20260924 14:12:13.869287  9200 rpc-test-base.h:595] status: Timed out: Sleep RPC to 0.0.0.0:41895 timed out after 0.200s (SENT), seconds elapsed: 0.201671
I20260924 14:12:13.871363  9508 rpc-test-base.h:222] got call: sleep_micros: 2000000
W20260924 14:12:14.376498  9509 rpcz_store.cc:267] Call kudu.rpc.GenericCalculatorService.Sleep from 127.0.0.1:38668 (request call id 1) took 701 ms (client timeout 200 ms). Trace:
W20260924 14:12:14.376928  9509 rpcz_store.cc:269] 0924 14:12:13.675515 (+     0us) service_pool.cc:170] Inserting onto call queue
0924 14:12:13.675636 (+   121us) service_pool.cc:227] Handling call
0924 14:12:14.376415 (+700779us) inbound_call.cc:173] Queueing success response
Metrics: {}
I20260924 14:12:15.371430  9200 rpc-test-base.h:595] status: Timed out: Sleep RPC to 0.0.0.0:41895 timed out after 1.500s (SENT), seconds elapsed: 1.50166
W20260924 14:12:15.872072  9508 rpcz_store.cc:267] Call kudu.rpc.GenericCalculatorService.Sleep from 127.0.0.1:38668 (request call id 2) took 2001 ms (client timeout 1500 ms). Trace:
W20260924 14:12:15.872504  9508 rpcz_store.cc:269] 0924 14:12:13.870980 (+     0us) service_pool.cc:170] Inserting onto call queue
0924 14:12:13.871158 (+   178us) service_pool.cc:227] Handling call
0924 14:12:15.872008 (+2000850us) inbound_call.cc:173] Queueing success response
Metrics: {}
W20260924 14:12:15.873217  9504 connection.cc:441] server connection from 127.0.0.1:38668 torn down before Call kudu.rpc.GenericCalculatorService.Sleep from 127.0.0.1:38668 (request call id 2) could send its response
[       OK ] Parameters/TestRpc.TestCallTimeout/SSL_TCP (2283 ms)
[ RUN      ] Parameters/TestRpc.TestServerShutsDown/SSL_TCP
I20260924 14:12:15.882431  9200 rpc-test.cc:1125] Connecting to 0.0.0.0:37905
W20260924 14:12:15.895382  9522 negotiation.cc:337] Failed RPC negotiation. Trace:
0924 14:12:15.893488 (+     0us) reactor.cc:625] Submitting negotiation task for client connection to 0.0.0.0:37905 (local address 127.0.0.1:41990)
0924 14:12:15.894084 (+   596us) negotiation.cc:107] Waiting for socket to connect
0924 14:12:15.894128 (+    44us) client_negotiation.cc:174] Beginning negotiation
0924 14:12:15.894446 (+   318us) client_negotiation.cc:252] Sending NEGOTIATE NegotiatePB request
0924 14:12:15.894728 (+   282us) negotiation.cc:327] Negotiation complete: Network error: Client connection negotiation failed: client connection to 0.0.0.0:37905: BlockingWrite error: write error: Broken pipe (error 32)
Metrics: {"client-negotiator.queue_time_us":142}
[       OK ] Parameters/TestRpc.TestServerShutsDown/SSL_TCP (18 ms)
[ RUN      ] Parameters/TestRpc.TimedOutOnResponseMetric/SSL_TCP
I20260924 14:12:15.920442  9539 acceptor_pool.cc:254] collecting diagnostics on the listening RPC socket 0.0.0.0:36727 every 8 connection(s)
I20260924 14:12:15.921342  9540 acceptor_pool.cc:254] collecting diagnostics on the listening RPC socket 0.0.0.0:36727 every 8 connection(s)
W20260924 14:12:16.162735  9543 rpcz_store.cc:267] Call kudu.rpc_test.CalculatorService.Sleep from 127.0.0.1:56216 (request call id 3) took 50 ms (client timeout 25 ms). Trace:
W20260924 14:12:16.163086  9543 rpcz_store.cc:269] 0924 14:12:16.112021 (+     0us) service_pool.cc:170] Inserting onto call queue
0924 14:12:16.112154 (+   133us) service_pool.cc:227] Handling call
0924 14:12:16.162637 (+ 50483us) inbound_call.cc:173] Queueing success response
Related trace 'test_child':
Metrics: {"test_sleep_us":50000,"child_traces":[["test_child",{"related_trace_metric":1}]]}
W20260924 14:12:16.223075  9543 rpcz_store.cc:267] Call kudu.rpc_test.CalculatorService.Sleep from 127.0.0.1:56216 (request call id 4) took 50 ms (client timeout 50 ms). Trace:
W20260924 14:12:16.223346  9543 rpcz_store.cc:269] 0924 14:12:16.172480 (+     0us) service_pool.cc:170] Inserting onto call queue
0924 14:12:16.172630 (+   150us) service_pool.cc:227] Handling call
0924 14:12:16.223005 (+ 50375us) inbound_call.cc:173] Queueing success response
Related trace 'test_child':
Metrics: {"test_sleep_us":50000,"child_traces":[["test_child",{"related_trace_metric":1}]]}
[       OK ] Parameters/TestRpc.TimedOutOnResponseMetric/SSL_TCP (334 ms)
[ RUN      ] Parameters/TestRpc.AcceptorDispatchingTimesMetric/SSL_TCP
I20260924 14:12:16.247020  9564 acceptor_pool.cc:254] collecting diagnostics on the listening RPC socket 0.0.0.0:37893 every 8 connection(s)
I20260924 14:12:16.247943  9565 acceptor_pool.cc:254] collecting diagnostics on the listening RPC socket 0.0.0.0:37893 every 8 connection(s)
W20260924 14:12:16.253135  9560 negotiation.cc:337] Failed RPC negotiation. Trace:
0924 14:12:16.251930 (+     0us) reactor.cc:625] Submitting negotiation task for server connection from 127.0.0.1:34482 (local address 127.0.0.1:37893)
0924 14:12:16.252342 (+   412us) server_negotiation.cc:206] Beginning negotiation
0924 14:12:16.252360 (+    18us) server_negotiation.cc:399] Waiting for connection header
0924 14:12:16.252608 (+   248us) negotiation.cc:327] Negotiation complete: Network error: Server connection negotiation failed: server connection from 127.0.0.1:34482: BlockingRecv error: recv got EOF from 127.0.0.1:34482 (error 108)
Metrics: {"server-negotiator.queue_time_us":117}
[       OK ] Parameters/TestRpc.AcceptorDispatchingTimesMetric/SSL_TCP (26 ms)
[ RUN      ] Parameters/TestRpc.TestRpcCallbackDestroysMessenger/SSL_TCP
[       OK ] Parameters/TestRpc.TestRpcCallbackDestroysMessenger/SSL_TCP (25 ms)
[ RUN      ] Parameters/TestRpc.TestApplicationFeatureFlag/SSL_TCP
I20260924 14:12:16.338655  9589 acceptor_pool.cc:254] collecting diagnostics on the listening RPC socket 0.0.0.0:45797 every 8 connection(s)
I20260924 14:12:16.339432  9590 acceptor_pool.cc:254] collecting diagnostics on the listening RPC socket 0.0.0.0:45797 every 8 connection(s)
W20260924 14:12:16.399959  9587 messenger.cc:357] Unable to handle RPC call: Not implemented: call requires unsupported application feature flags: 99
[       OK ] Parameters/TestRpc.TestApplicationFeatureFlag/SSL_TCP (122 ms)
[ RUN      ] Parameters/TestRpc.TestCancellation/SSL_TCP
I20260924 14:12:16.437340  9614 acceptor_pool.cc:254] collecting diagnostics on the listening RPC socket 0.0.0.0:46207 every 8 connection(s)
I20260924 14:12:16.437927  9615 acceptor_pool.cc:254] collecting diagnostics on the listening RPC socket 0.0.0.0:46207 every 8 connection(s)
I20260924 14:12:16.441385  9200 rpc-test.cc:1648] Connecting to 0.0.0.0:46207
I20260924 14:12:16.550585  9200 rpc-test-base.h:595] status: Aborted: Sleep RPC to 0.0.0.0:46207 is cancelled in state READY, seconds elapsed: 0.000487962
I20260924 14:12:16.710961  9200 rpc-test-base.h:595] status: Aborted: Sleep RPC to 0.0.0.0:46207 is cancelled in state SENT, seconds elapsed: 0.00104346
I20260924 14:12:16.759886  9617 rpc-test-base.h:222] got call: sleep_micros: 510000
I20260924 14:12:16.885490  9200 rpc-test-base.h:595] status: Aborted: Sleep RPC to 0.0.0.0:46207 is cancelled in state SENT, seconds elapsed: 0.000994901
I20260924 14:12:16.930655  9616 rpc-test-base.h:222] got call: sleep_micros: 510000
I20260924 14:12:17.061661  9200 rpc-test-base.h:595] status: Aborted: Sleep RPC to 0.0.0.0:46207 is cancelled in state SENT, seconds elapsed: 0.000869215
W20260924 14:12:17.102481  9618 rpcz_store.cc:267] Call kudu.rpc.GenericCalculatorService.Sleep from 127.0.0.1:49930 (request call id 11) took 15 ms (client timeout 10 ms). Trace:
W20260924 14:12:17.102804  9618 rpcz_store.cc:269] 0924 14:12:17.087067 (+     0us) service_pool.cc:170] Inserting onto call queue
0924 14:12:17.102152 (+ 15085us) service_pool.cc:214] Skipping call since client already timed out
0924 14:12:17.102273 (+   121us) inbound_call.cc:173] Queueing failure response
Metrics: {}
I20260924 14:12:17.103396  9618 rpc-test-base.h:222] got call: sleep_micros: 1500000
W20260924 14:12:17.270846  9617 rpcz_store.cc:267] Call kudu.rpc.GenericCalculatorService.Sleep from 127.0.0.1:49930 (request call id 3) took 511 ms (client timeout 10 ms). Trace:
W20260924 14:12:17.271198  9617 rpcz_store.cc:269] 0924 14:12:16.759635 (+     0us) service_pool.cc:170] Inserting onto call queue
0924 14:12:16.759792 (+   157us) service_pool.cc:227] Handling call
0924 14:12:17.270781 (+510989us) inbound_call.cc:173] Queueing success response
Metrics: {}
W20260924 14:12:17.441442  9616 rpcz_store.cc:267] Call kudu.rpc.GenericCalculatorService.Sleep from 127.0.0.1:49930 (request call id 7) took 511 ms (client timeout 10 ms). Trace:
W20260924 14:12:17.441831  9616 rpcz_store.cc:269] 0924 14:12:16.930363 (+     0us) service_pool.cc:170] Inserting onto call queue
0924 14:12:16.930572 (+   209us) service_pool.cc:227] Handling call
0924 14:12:17.441373 (+510801us) inbound_call.cc:173] Queueing success response
Metrics: {}
I20260924 14:12:18.064096  9200 rpc-test-base.h:595] status: Timed out: Sleep RPC to 0.0.0.0:46207 timed out after 1.000s (SENT), seconds elapsed: 1.00203
I20260924 14:12:18.065696  9616 rpc-test-base.h:222] got call: sleep_micros: 1500000
W20260924 14:12:18.604027  9618 rpcz_store.cc:267] Call kudu.rpc.GenericCalculatorService.Sleep from 127.0.0.1:49930 (request call id 12) took 1516 ms (client timeout 1000 ms). Trace:
W20260924 14:12:18.604377  9618 rpcz_store.cc:269] 0924 14:12:17.087406 (+     0us) service_pool.cc:170] Inserting onto call queue
0924 14:12:17.103346 (+ 15940us) service_pool.cc:227] Handling call
0924 14:12:18.603967 (+1500621us) inbound_call.cc:173] Queueing success response
Metrics: {}
I20260924 14:12:19.066264  9200 rpc-test-base.h:595] status: Timed out: Sleep RPC to 0.0.0.0:46207 timed out after 1.000s (SENT), seconds elapsed: 1.00181
W20260924 14:12:19.067821  9613 messenger.cc:357] Unable to handle RPC call: Not implemented: call requires unsupported application feature flags: 99, 1
W20260924 14:12:19.069767  9613 messenger.cc:357] Unable to handle RPC call: Not implemented: call requires unsupported application feature flags: 99, 1
W20260924 14:12:19.566306  9616 rpcz_store.cc:267] Call kudu.rpc.GenericCalculatorService.Sleep from 127.0.0.1:49930 (request call id 13) took 1500 ms (client timeout 1000 ms). Trace:
W20260924 14:12:19.566642  9616 rpcz_store.cc:269] 0924 14:12:18.065479 (+     0us) service_pool.cc:170] Inserting onto call queue
0924 14:12:18.065644 (+   165us) service_pool.cc:227] Handling call
0924 14:12:19.566244 (+1500600us) inbound_call.cc:173] Queueing success response
Metrics: {}
W20260924 14:12:19.567365  9613 connection.cc:441] server connection from 127.0.0.1:49930 torn down before Call kudu.rpc.GenericCalculatorService.Sleep from 127.0.0.1:49930 (request call id 13) could send its response
[       OK ] Parameters/TestRpc.TestCancellation/SSL_TCP (3165 ms)
[ RUN      ] Parameters/TestRpc.TestCancellationMultiThreads/SSL_TCP
I20260924 14:12:19.619104  9639 acceptor_pool.cc:254] collecting diagnostics on the listening RPC socket 0.0.0.0:35233 every 8 connection(s)
I20260924 14:12:19.620028  9640 acceptor_pool.cc:254] collecting diagnostics on the listening RPC socket 0.0.0.0:35233 every 8 connection(s)
I20260924 14:12:19.624493  9200 rpc-test.cc:1808] Connecting to 0.0.0.0:35233
I20260924 14:12:19.782069  9654 test_util.cc:268] Using random seed: 806692136
I20260924 14:12:19.783463  9655 test_util.cc:268] Using random seed: 806693519
I20260924 14:12:19.785712  9656 test_util.cc:268] Using random seed: 806695763
I20260924 14:12:19.787919  9657 test_util.cc:268] Using random seed: 806697933
I20260924 14:12:19.789891  9658 test_util.cc:268] Using random seed: 806699853
I20260924 14:12:19.792224  9659 test_util.cc:268] Using random seed: 806702286
I20260924 14:12:19.793814  9660 test_util.cc:268] Using random seed: 806703864
I20260924 14:12:19.795552  9661 test_util.cc:268] Using random seed: 806705600
I20260924 14:12:19.797052  9662 test_util.cc:268] Using random seed: 806707121
I20260924 14:12:19.798516  9663 test_util.cc:268] Using random seed: 806708582
I20260924 14:12:19.800256  9664 test_util.cc:268] Using random seed: 806710285
I20260924 14:12:19.801702  9665 test_util.cc:268] Using random seed: 806711784
I20260924 14:12:19.803544  9666 test_util.cc:268] Using random seed: 806713589
I20260924 14:12:19.805055  9667 test_util.cc:268] Using random seed: 806715132
I20260924 14:12:19.806679  9668 test_util.cc:268] Using random seed: 806716722
I20260924 14:12:19.809264  9669 test_util.cc:268] Using random seed: 806719197
I20260924 14:12:19.810877  9670 test_util.cc:268] Using random seed: 806720908
I20260924 14:12:19.812531  9671 test_util.cc:268] Using random seed: 806722546
I20260924 14:12:19.814248  9672 test_util.cc:268] Using random seed: 806724256
I20260924 14:12:19.816011  9673 test_util.cc:268] Using random seed: 806726072
I20260924 14:12:19.817905  9674 test_util.cc:268] Using random seed: 806727927
I20260924 14:12:19.820024  9675 test_util.cc:268] Using random seed: 806730066
I20260924 14:12:19.821949  9676 test_util.cc:268] Using random seed: 806731966
I20260924 14:12:19.823810  9677 test_util.cc:268] Using random seed: 806733744
I20260924 14:12:19.825824  9678 test_util.cc:268] Using random seed: 806735788
I20260924 14:12:19.829404  9679 test_util.cc:268] Using random seed: 806739239
I20260924 14:12:19.830724  9680 test_util.cc:268] Using random seed: 806740797
I20260924 14:12:19.832468  9681 test_util.cc:268] Using random seed: 806742480
I20260924 14:12:19.834431  9682 test_util.cc:268] Using random seed: 806744395
I20260924 14:12:19.836417  9683 test_util.cc:268] Using random seed: 806746443
[       OK ] Parameters/TestRpc.TestCancellationMultiThreads/SSL_TCP (22018 ms)
[ RUN      ] Parameters/TestRpc.TestCallId/SSL_TCP
I20260924 14:12:41.650811  9697 acceptor_pool.cc:254] collecting diagnostics on the listening RPC socket 0.0.0.0:36603 every 8 connection(s)
I20260924 14:12:41.652536  9698 acceptor_pool.cc:254] collecting diagnostics on the listening RPC socket 0.0.0.0:36603 every 8 connection(s)
[       OK ] Parameters/TestRpc.TestCallId/SSL_TCP (133 ms)
[----------] 20 tests from Parameters/TestRpc (42017 ms total)

[----------] Global test environment tear-down
[==========] 21 tests from 2 test suites ran. (42025 ms total)
[  PASSED  ] 20 tests.
[  FAILED  ] 1 test, listed below:
[  FAILED  ] Parameters/TestRpc.TestCallWithChainCertAndRootCA/SSL_TCP, where GetParam() = (true, false)

 1 FAILED TEST