Diagnosed failure

Parameters/TestRpc.TestCallWithChainCertAndChainCA/SSL_TCP: /data0/somelongdirectorytoavoidrpathissues/src/kudu/src/kudu/rpc/rpc-test.cc:270: Failure
Failed
Bad status: Runtime error: could not verify certificate chain (error with cert: subject=CN = localhost, ST = sadfjas, C = AS, emailAddress = sdflkdsajf, O = lskdfjlsad, OU = sldfkja, issuer=C = AS, ST = ASDfkjdhf, L = lskdjf, O = saldfja, OU = skdjf, CN = localhost, emailAddress = sadjflkadsj): : certificate has expired
Google Test trace:
/data0/somelongdirectorytoavoidrpathissues/src/kudu/src/kudu/rpc/rpc-test.cc:267: Connecting to 0.0.0.0:45083
I20260928 11:41:03.007769   390 test_util.cc:175] -----------------------------------------------
I20260928 11:41:03.007947   390 test_util.cc:176] Had fatal failures, leaving test files at /tmp/dist-test-taskEE67bQ/test-tmp/rpc-test.5.Parameters_TestRpc.TestCallWithChainCertAndChainCA_SSL_TCP.1790595661733863-390-0

Full log

Note: This is test shard 6 of 8.
[==========] Running 21 tests from 2 test suites.
[----------] Global test environment set-up.
[----------] 20 tests from Parameters/TestRpc
[ RUN      ] Parameters/TestRpc.TestMessengerCreateDestroy/SSL_TCP
WARNING: Logging before InitGoogleLogging() is written to STDERR
I20260928 11:41:01.827661   390 rpc-test.cc:169] started messenger TestCreateDestroy
[       OK ] Parameters/TestRpc.TestMessengerCreateDestroy/SSL_TCP (1087 ms)
[ RUN      ] Parameters/TestRpc.TestNegotiationDeadlock/SSL_TCP
I20260928 11:41:02.902102   412 acceptor_pool.cc:254] collecting diagnostics on the listening RPC socket 0.0.0.0:35159 every 8 connection(s)
I20260928 11:41:02.903293   413 acceptor_pool.cc:254] collecting diagnostics on the listening RPC socket 0.0.0.0:35159 every 8 connection(s)
[       OK ] Parameters/TestRpc.TestNegotiationDeadlock/SSL_TCP (79 ms)
[ RUN      ] Parameters/TestRpc.TestCallWithChainCertAndChainCA/SSL_TCP
I20260928 11:41:02.977676   428 acceptor_pool.cc:254] collecting diagnostics on the listening RPC socket 0.0.0.0:45083 every 8 connection(s)
I20260928 11:41:02.979727   429 acceptor_pool.cc:254] collecting diagnostics on the listening RPC socket 0.0.0.0:45083 every 8 connection(s)
/data0/somelongdirectorytoavoidrpathissues/src/kudu/src/kudu/rpc/rpc-test.cc:270: Failure
Failed
Bad status: Runtime error: could not verify certificate chain (error with cert: subject=CN = localhost, ST = sadfjas, C = AS, emailAddress = sdflkdsajf, O = lskdfjlsad, OU = sldfkja, issuer=C = AS, ST = ASDfkjdhf, L = lskdjf, O = saldfja, OU = skdjf, CN = localhost, emailAddress = sadjflkadsj): : certificate has expired
Google Test trace:
/data0/somelongdirectorytoavoidrpathissues/src/kudu/src/kudu/rpc/rpc-test.cc:267: Connecting to 0.0.0.0:45083
I20260928 11:41:03.007769   390 test_util.cc:175] -----------------------------------------------
I20260928 11:41:03.007947   390 test_util.cc:176] Had fatal failures, leaving test files at /tmp/dist-test-taskEE67bQ/test-tmp/rpc-test.5.Parameters_TestRpc.TestCallWithChainCertAndChainCA_SSL_TCP.1790595661733863-390-0
[  FAILED  ] Parameters/TestRpc.TestCallWithChainCertAndChainCA/SSL_TCP, where GetParam() = (true, false) (55 ms)
[ RUN      ] Parameters/TestRpc.TestCallWithPasswordProtectedKey/SSL_TCP
I20260928 11:41:03.047326   453 acceptor_pool.cc:254] collecting diagnostics on the listening RPC socket 0.0.0.0:36989 every 8 connection(s)
I20260928 11:41:03.047992   454 acceptor_pool.cc:254] collecting diagnostics on the listening RPC socket 0.0.0.0:36989 every 8 connection(s)
[       OK ] Parameters/TestRpc.TestCallWithPasswordProtectedKey/SSL_TCP (88 ms)
[ RUN      ] Parameters/TestRpc.TestCallToBadServer/SSL_TCP
I20260928 11:41:03.146505   390 rpc-test.cc:394] Status: Network error: Client connection negotiation failed: client connection to 0.0.0.0:0: connect: Connection refused (error 111)
I20260928 11:41:03.147827   390 rpc-test.cc:394] Status: Network error: Client connection negotiation failed: client connection to 0.0.0.0:0: connect: Connection refused (error 111)
I20260928 11:41:03.149031   390 rpc-test.cc:394] Status: Network error: Client connection negotiation failed: client connection to 0.0.0.0:0: connect: Connection refused (error 111)
I20260928 11:41:03.150197   390 rpc-test.cc:394] Status: Network error: Client connection negotiation failed: client connection to 0.0.0.0:0: connect: Connection refused (error 111)
I20260928 11:41:03.151383   390 rpc-test.cc:394] Status: Network error: Client connection negotiation failed: client connection to 0.0.0.0:0: connect: Connection refused (error 111)
[       OK ] Parameters/TestRpc.TestCallToBadServer/SSL_TCP (57 ms)
[ RUN      ] Parameters/TestRpc.TestWrongService/SSL_TCP
I20260928 11:41:03.182209   488 acceptor_pool.cc:254] collecting diagnostics on the listening RPC socket 0.0.0.0:38809 every 8 connection(s)
I20260928 11:41:03.182960   489 acceptor_pool.cc:254] collecting diagnostics on the listening RPC socket 0.0.0.0:38809 every 8 connection(s)
I20260928 11:41:03.212169   485 messenger.cc:345] service WrongServiceName not registered on TestServer
[       OK ] Parameters/TestRpc.TestWrongService/SSL_TCP (65 ms)
[ RUN      ] Parameters/TestRpc.TestConnectionKeepalive/SSL_TCP
I20260928 11:41:03.248054   511 acceptor_pool.cc:254] collecting diagnostics on the listening RPC socket 0.0.0.0:44863 every 8 connection(s)
I20260928 11:41:03.248737   512 acceptor_pool.cc:254] collecting diagnostics on the listening RPC socket 0.0.0.0:44863 every 8 connection(s)
I20260928 11:41:03.251847   390 rpc-test.cc:488] Connecting to 0.0.0.0:44863
[       OK ] Parameters/TestRpc.TestConnectionKeepalive/SSL_TCP (1071 ms)
[ RUN      ] Parameters/TestRpc.TestClientConnectionMetrics/SSL_TCP
I20260928 11:41:04.311373   536 acceptor_pool.cc:254] collecting diagnostics on the listening RPC socket 0.0.0.0:35811 every 8 connection(s)
I20260928 11:41:04.312088   537 acceptor_pool.cc:254] collecting diagnostics on the listening RPC socket 0.0.0.0:35811 every 8 connection(s)
I20260928 11:41:04.315284   390 rpc-test.cc:569] Connecting to 0.0.0.0:35811
[       OK ] Parameters/TestRpc.TestClientConnectionMetrics/SSL_TCP (108476 ms)
[ RUN      ] Parameters/TestRpc.TestCredentialsPolicy/SSL_TCP
I20260928 11:42:52.790429   570 acceptor_pool.cc:254] collecting diagnostics on the listening RPC socket 0.0.0.0:35625 every 8 connection(s)
I20260928 11:42:52.791160   571 acceptor_pool.cc:254] collecting diagnostics on the listening RPC socket 0.0.0.0:35625 every 8 connection(s)
I20260928 11:42:52.794122   390 rpc-test.cc:700] Connecting to 0.0.0.0:35625
[       OK ] Parameters/TestRpc.TestCredentialsPolicy/SSL_TCP (75 ms)
[ RUN      ] Parameters/TestRpc.TestCallLongerThanKeepalive/SSL_TCP
I20260928 11:42:52.859709   595 acceptor_pool.cc:254] collecting diagnostics on the listening RPC socket 0.0.0.0:46619 every 8 connection(s)
I20260928 11:42:52.860368   596 acceptor_pool.cc:254] collecting diagnostics on the listening RPC socket 0.0.0.0:46619 every 8 connection(s)
I20260928 11:42:52.912624   599 rpc-test-base.h:222] got call: sleep_micros: 3000000 deferred: true
I20260928 11:42:55.916584   599 rpcz_store.cc:275] Call kudu.rpc.GenericCalculatorService.Sleep from 127.0.0.1:48380 (request call id 0) took 3004 ms. Trace:
I20260928 11:42:55.916867   599 rpcz_store.cc:276] 0928 11:42:52.912398 (+     0us) service_pool.cc:170] Inserting onto call queue
0928 11:42:52.912489 (+    91us) service_pool.cc:227] Handling call
0928 11:42:55.916536 (+3004047us) inbound_call.cc:173] Queueing success response
Metrics: {}
[       OK ] Parameters/TestRpc.TestCallLongerThanKeepalive/SSL_TCP (3081 ms)
[ RUN      ] Parameters/TestRpc.TestRpcSidecar/SSL_TCP
I20260928 11:42:55.963047   620 acceptor_pool.cc:254] collecting diagnostics on the listening RPC socket 0.0.0.0:44635 every 8 connection(s)
I20260928 11:42:55.963739   621 acceptor_pool.cc:254] collecting diagnostics on the listening RPC socket 0.0.0.0:44635 every 8 connection(s)
[       OK ] Parameters/TestRpc.TestRpcSidecar/SSL_TCP (523 ms)
[ RUN      ] Parameters/TestRpc.TestRpcSidecarLimits/SSL_TCP
I20260928 11:43:12.361680   647 acceptor_pool.cc:254] collecting diagnostics on the listening RPC socket 0.0.0.0:37047 every 8 connection(s)
I20260928 11:43:12.362433   648 acceptor_pool.cc:254] collecting diagnostics on the listening RPC socket 0.0.0.0:37047 every 8 connection(s)
W20260928 11:43:12.387764   390 serialization.cc:72] Serialized kudu.rpc_test.PushStringsRequestPB (2147483654 bytes) is larger than the maximum configured RPC message size (52428800 bytes). Sending anyway, but peer may reject the data.
W20260928 11:43:12.398267   645 connection.cc:535] server connection from 127.0.0.1:49650 recv error: Network error: RPC frame had a length of 2147483714, but we only support messages up to 52428800 bytes long.
W20260928 11:43:12.398669   645 connection.cc:158] shutting down server connection from 127.0.0.1:49650 with pending inbound data: 4/2147483714 bytes received; last active 0 ns ago: status Network error: RPC frame had a length of 2147483714, but we only support messages up to 52428800 bytes long.
W20260928 11:43:12.399618   660 connection.cc:698] client connection to 0.0.0.0:37047 send error: Network error: failed to write to TLS socket: Connection reset by peer
W20260928 11:43:12.400182   660 connection.cc:196] Error closing socket: Network error: TlsSocket::Close: Success
[       OK ] Parameters/TestRpc.TestRpcSidecarLimits/SSL_TCP (16516 ms)
[ RUN      ] Parameters/TestRpc.TestCallTimeoutDoesntAffectNegotiation/SSL_TCP
I20260928 11:43:12.990303   672 acceptor_pool.cc:254] collecting diagnostics on the listening RPC socket 0.0.0.0:36651 every 8 connection(s)
I20260928 11:43:12.990936   673 acceptor_pool.cc:254] collecting diagnostics on the listening RPC socket 0.0.0.0:36651 every 8 connection(s)
W20260928 11:43:13.023495   668 negotiation.cc:266] Injecting 500ms delay in negotiation
I20260928 11:43:13.073422   390 rpc-test-base.h:595] status: Timed out: connection negotiation to 0.0.0.0:36651 for RPC Sleep timed out after 0.050s (ON_OUTBOUND_QUEUE), seconds elapsed: 0.0508487
[       OK ] Parameters/TestRpc.TestCallTimeoutDoesntAffectNegotiation/SSL_TCP (572 ms)
[ RUN      ] Parameters/TestRpc.TestRpcHandlerLatencyMetric/SSL_TCP
I20260928 11:43:13.560631   697 acceptor_pool.cc:254] collecting diagnostics on the listening RPC socket 0.0.0.0:43503 every 8 connection(s)
I20260928 11:43:13.561281   698 acceptor_pool.cc:254] collecting diagnostics on the listening RPC socket 0.0.0.0:43503 every 8 connection(s)
I20260928 11:43:13.606626   390 rpc-test.cc:1236] Sleep() min lat: 21385
I20260928 11:43:13.606793   390 rpc-test.cc:1237] Sleep() mean lat: 21385
I20260928 11:43:13.606911   390 rpc-test.cc:1238] Sleep() max lat: 21385
I20260928 11:43:13.607013   390 rpc-test.cc:1239] Sleep() #calls: 1
[       OK ] Parameters/TestRpc.TestRpcHandlerLatencyMetric/SSL_TCP (74 ms)
[ RUN      ] Parameters/TestRpc.TimedOutOnResponseMetricServiceQueue/SSL_TCP
I20260928 11:43:13.630954   723 acceptor_pool.cc:254] collecting diagnostics on the listening RPC socket 0.0.0.0:43085 every 8 connection(s)
I20260928 11:43:13.631644   724 acceptor_pool.cc:254] collecting diagnostics on the listening RPC socket 0.0.0.0:43085 every 8 connection(s)
W20260928 11:43:13.697639   725 rpcz_store.cc:267] Call kudu.rpc_test.CalculatorService.Sleep from 127.0.0.1:35398 (request call id 2) took 20 ms (client timeout 20 ms). Trace:
W20260928 11:43:13.697966   725 rpcz_store.cc:269] 0928 11:43:13.677275 (+     0us) service_pool.cc:170] Inserting onto call queue
0928 11:43:13.697524 (+ 20249us) service_pool.cc:214] Skipping call since client already timed out
0928 11:43:13.697598 (+    74us) inbound_call.cc:173] Queueing failure response
Metrics: {}
W20260928 11:43:13.699946   721 connection.cc:196] Error closing socket: Network error: TlsSocket::Close: Connection reset by peer
[       OK ] Parameters/TestRpc.TimedOutOnResponseMetricServiceQueue/SSL_TCP (90 ms)
[ RUN      ] Parameters/TestRpc.RpcPendingConnectionsMetric/SSL_TCP
I20260928 11:43:13.713261   746 acceptor_pool.cc:254] collecting diagnostics on the listening RPC socket 0.0.0.0:42545 every 8 connection(s)
I20260928 11:43:13.713928   747 acceptor_pool.cc:254] collecting diagnostics on the listening RPC socket 0.0.0.0:42545 every 8 connection(s)
W20260928 11:43:13.726029   742 negotiation.cc:337] Failed RPC negotiation. Trace:
0928 11:43:13.724498 (+     0us) reactor.cc:625] Submitting negotiation task for server connection from 127.0.0.1:33872 (local address 127.0.0.1:42545)
0928 11:43:13.724999 (+   501us) server_negotiation.cc:206] Beginning negotiation
0928 11:43:13.725024 (+    25us) server_negotiation.cc:399] Waiting for connection header
0928 11:43:13.725323 (+   299us) negotiation.cc:327] Negotiation complete: Network error: Server connection negotiation failed: server connection from 127.0.0.1:33872: BlockingRecv error: recv got EOF from 127.0.0.1:33872 (error 108)
Metrics: {"server-negotiator.queue_time_us":110}
[       OK ] Parameters/TestRpc.RpcPendingConnectionsMetric/SSL_TCP (34 ms)
[ RUN      ] Parameters/TestRpc.TestRpcContextClientDeadline/SSL_TCP
I20260928 11:43:13.782779   762 acceptor_pool.cc:254] collecting diagnostics on the listening RPC socket 0.0.0.0:36107 every 8 connection(s)
I20260928 11:43:13.783448   763 acceptor_pool.cc:254] collecting diagnostics on the listening RPC socket 0.0.0.0:36107 every 8 connection(s)
[       OK ] Parameters/TestRpc.TestRpcContextClientDeadline/SSL_TCP (100 ms)
[ RUN      ] Parameters/TestRpc.TestApplicationFeatureFlagUnsupportedServer/SSL_TCP
I20260928 11:43:13.856438   787 acceptor_pool.cc:254] collecting diagnostics on the listening RPC socket 0.0.0.0:33045 every 8 connection(s)
I20260928 11:43:13.857100   788 acceptor_pool.cc:254] collecting diagnostics on the listening RPC socket 0.0.0.0:33045 every 8 connection(s)
[       OK ] Parameters/TestRpc.TestApplicationFeatureFlagUnsupportedServer/SSL_TCP (61 ms)
[ RUN      ] Parameters/TestRpc.TestCancellationAsync/SSL_TCP
I20260928 11:43:13.919420   812 acceptor_pool.cc:254] collecting diagnostics on the listening RPC socket 0.0.0.0:39475 every 8 connection(s)
I20260928 11:43:13.920109   813 acceptor_pool.cc:254] collecting diagnostics on the listening RPC socket 0.0.0.0:39475 every 8 connection(s)
I20260928 11:43:13.922966   390 rpc-test.cc:1716] Connecting to 0.0.0.0:39475
I20260928 11:43:13.945752   390 test_util.cc:268] Using random seed: -1841560444
I20260928 11:43:14.169296   816 rpc-test-base.h:240] got call: sleep_micros: 500 pattern: 4294967295 num_repetitions: 2097152 sidecar_idx: 0
I20260928 11:43:14.319263   815 rpc-test-base.h:240] got call: sleep_micros: 500 pattern: 4294967295 num_repetitions: 2097152 sidecar_idx: 0
I20260928 11:43:14.502506   816 rpc-test-base.h:240] got call: sleep_micros: 500 pattern: 4294967295 num_repetitions: 2097152 sidecar_idx: 0
I20260928 11:43:14.683838   815 rpc-test-base.h:240] got call: sleep_micros: 500 pattern: 4294967295 num_repetitions: 2097152 sidecar_idx: 0
I20260928 11:43:14.846396   816 rpc-test-base.h:240] got call: sleep_micros: 500 pattern: 4294967295 num_repetitions: 2097152 sidecar_idx: 0
I20260928 11:43:15.021021   815 rpc-test-base.h:240] got call: sleep_micros: 500 pattern: 4294967295 num_repetitions: 2097152 sidecar_idx: 0
I20260928 11:43:15.191159   816 rpc-test-base.h:240] got call: sleep_micros: 500 pattern: 4294967295 num_repetitions: 2097152 sidecar_idx: 0
I20260928 11:43:15.367784   815 rpc-test-base.h:240] got call: sleep_micros: 500 pattern: 4294967295 num_repetitions: 2097152 sidecar_idx: 0
W20260928 11:43:15.530345   811 connection.cc:196] Error closing socket: Network error: TlsSocket::Close: Broken pipe
W20260928 11:43:15.552381   811 connection.cc:441] server connection from 127.0.0.1:32864 torn down before Call kudu.rpc.GenericCalculatorService.SleepWithSidecar from 127.0.0.1:32864 (request call id 8) could send its response
[       OK ] Parameters/TestRpc.TestCancellationAsync/SSL_TCP (1658 ms)
[ RUN      ] Parameters/TestRpc.TestPerformanceBySocketType/SSL_TCP
I20260928 11:43:15.638428   837 acceptor_pool.cc:254] collecting diagnostics on the listening RPC socket 0.0.0.0:39775 every 8 connection(s)
I20260928 11:43:15.639091   838 acceptor_pool.cc:254] collecting diagnostics on the listening RPC socket 0.0.0.0:39775 every 8 connection(s)
I20260928 11:43:15.641911   390 rpc-test.cc:1846] Connecting to 0.0.0.0:39775
I20260928 11:43:33.932951   390 rpc-test.cc:1859] Sending 1024MB via ssl-enabled tcp socket: real 18.271s	user 16.225s	sys 10.045s
I20260928 11:43:51.788945   390 rpc-test.cc:1859] Sending 1024MB via ssl-enabled tcp socket: real 17.856s	user 15.692s	sys 9.830s
I20260928 11:44:09.713347   390 rpc-test.cc:1859] Sending 1024MB via ssl-enabled tcp socket: real 17.924s	user 15.895s	sys 9.711s
I20260928 11:44:27.776584   390 rpc-test.cc:1859] Sending 1024MB via ssl-enabled tcp socket: real 18.063s	user 15.829s	sys 10.042s
I20260928 11:44:45.758435   390 rpc-test.cc:1859] Sending 1024MB via ssl-enabled tcp socket: real 17.981s	user 15.685s	sys 10.010s
[       OK ] Parameters/TestRpc.TestPerformanceBySocketType/SSL_TCP (90213 ms)
[----------] 20 tests from Parameters/TestRpc (223988 ms total)

[----------] 1 test from Parameters/TestRpcSocketTxRxQueue
[ RUN      ] Parameters/TestRpcSocketTxRxQueue.OverCapacity/0
W20260928 11:44:46.187860   890 negotiation.cc:337] Failed RPC negotiation. Trace:
0928 11:44:45.805402 (+     0us) reactor.cc:625] Submitting negotiation task for client connection to 0.0.0.0:44413 (local address 127.0.0.1:48268)
0928 11:44:45.805887 (+   485us) negotiation.cc:107] Waiting for socket to connect
0928 11:44:45.805916 (+    29us) client_negotiation.cc:174] Beginning negotiation
0928 11:44:45.806135 (+   219us) client_negotiation.cc:252] Sending NEGOTIATE NegotiatePB request
0928 11:44:46.186923 (+380788us) negotiation.cc:327] Negotiation complete: Network error: Client connection negotiation failed: client connection to 0.0.0.0:44413: BlockingRecv error: recv error from unknown peer: Transport endpoint is not connected (error 107)
Metrics: {"client-negotiator.queue_time_us":117}
W20260928 11:44:46.188119   908 negotiation.cc:337] Failed RPC negotiation. Trace:
0928 11:44:45.827992 (+     0us) reactor.cc:625] Submitting negotiation task for client connection to 0.0.0.0:44413 (local address 127.0.0.1:48290)
0928 11:44:45.828505 (+   513us) negotiation.cc:107] Waiting for socket to connect
0928 11:44:45.828541 (+    36us) client_negotiation.cc:174] Beginning negotiation
0928 11:44:45.828757 (+   216us) client_negotiation.cc:252] Sending NEGOTIATE NegotiatePB request
0928 11:44:46.187110 (+358353us) negotiation.cc:327] Negotiation complete: Network error: Client connection negotiation failed: client connection to 0.0.0.0:44413: BlockingRecv error: recv error from unknown peer: Transport endpoint is not connected (error 107)
Metrics: {"client-negotiator.queue_time_us":126}
W20260928 11:44:46.187871   881 negotiation.cc:337] Failed RPC negotiation. Trace:
0928 11:44:45.794652 (+     0us) reactor.cc:625] Submitting negotiation task for client connection to 0.0.0.0:44413 (local address 127.0.0.1:48260)
0928 11:44:45.795070 (+   418us) negotiation.cc:107] Waiting for socket to connect
0928 11:44:45.795098 (+    28us) client_negotiation.cc:174] Beginning negotiation
0928 11:44:45.795264 (+   166us) client_negotiation.cc:252] Sending NEGOTIATE NegotiatePB request
0928 11:44:46.186773 (+391509us) negotiation.cc:327] Negotiation complete: Network error: Client connection negotiation failed: client connection to 0.0.0.0:44413: BlockingRecv error: recv error from unknown peer: Transport endpoint is not connected (error 107)
Metrics: {"client-negotiator.queue_time_us":96}
W20260928 11:44:46.188458   872 negotiation.cc:337] Failed RPC negotiation. Trace:
0928 11:44:45.788113 (+     0us) reactor.cc:625] Submitting negotiation task for client connection to 0.0.0.0:44413 (local address 127.0.0.1:48248)
0928 11:44:45.788570 (+   457us) negotiation.cc:107] Waiting for socket to connect
0928 11:44:45.788598 (+    28us) client_negotiation.cc:174] Beginning negotiation
0928 11:44:45.788769 (+   171us) client_negotiation.cc:252] Sending NEGOTIATE NegotiatePB request
0928 11:44:46.186780 (+398011us) negotiation.cc:327] Negotiation complete: Network error: Client connection negotiation failed: client connection to 0.0.0.0:44413: BlockingRecv error: recv error from unknown peer: Transport endpoint is not connected (error 107)
Metrics: {"client-negotiator.queue_time_us":103}
W20260928 11:44:46.189297   899 negotiation.cc:337] Failed RPC negotiation. Trace:
0928 11:44:45.816954 (+     0us) reactor.cc:625] Submitting negotiation task for client connection to 0.0.0.0:44413 (local address 127.0.0.1:48284)
0928 11:44:45.817473 (+   519us) negotiation.cc:107] Waiting for socket to connect
0928 11:44:45.817502 (+    29us) client_negotiation.cc:174] Beginning negotiation
0928 11:44:45.817685 (+   183us) client_negotiation.cc:252] Sending NEGOTIATE NegotiatePB request
0928 11:44:46.187169 (+369484us) negotiation.cc:327] Negotiation complete: Network error: Client connection negotiation failed: client connection to 0.0.0.0:44413: BlockingRecv error: recv error from unknown peer: Transport endpoint is not connected (error 107)
Metrics: {"client-negotiator.queue_time_us":137}
W20260928 11:44:46.189487   863 negotiation.cc:337] Failed RPC negotiation. Trace:
0928 11:44:45.782153 (+     0us) reactor.cc:625] Submitting negotiation task for client connection to 0.0.0.0:44413 (local address 127.0.0.1:48244)
0928 11:44:45.782802 (+   649us) negotiation.cc:107] Waiting for socket to connect
0928 11:44:45.782842 (+    40us) client_negotiation.cc:174] Beginning negotiation
0928 11:44:45.783273 (+   431us) client_negotiation.cc:252] Sending NEGOTIATE NegotiatePB request
0928 11:44:46.186773 (+403500us) negotiation.cc:327] Negotiation complete: Network error: Client connection negotiation failed: client connection to 0.0.0.0:44413: BlockingRecv error: recv error from unknown peer: Transport endpoint is not connected (error 107)
Metrics: {"client-negotiator.queue_time_us":116}
[       OK ] Parameters/TestRpcSocketTxRxQueue.OverCapacity/0 (1218 ms)
[----------] 1 test from Parameters/TestRpcSocketTxRxQueue (1218 ms total)

[----------] Global test environment tear-down
[==========] 21 tests from 2 test suites ran. (225208 ms total)
[  PASSED  ] 20 tests.
[  FAILED  ] 1 test, listed below:
[  FAILED  ] Parameters/TestRpc.TestCallWithChainCertAndChainCA/SSL_TCP, where GetParam() = (true, false)

 1 FAILED TEST