Parameters/TestRpc.TestCallWithChainCertAndRootCA/SSL_UnixSocket: /data0/somelongdirectorytoavoidrpathissues/src/kudu/src/kudu/rpc/rpc-test.cc:303: Failure
Failed
Bad status: Runtime error: could not verify certificate chain (error with cert: subject=CN = localhost, ST = sadfjas, C = AS, emailAddress = sdflkdsajf, O = lskdfjlsad, OU = sldfkja, issuer=C = AS, ST = ASDfkjdhf, L = lskdjf, O = saldfja, OU = skdjf, CN = localhost, emailAddress = sadjflkadsj): : certificate has expired
Google Test trace:
/data0/somelongdirectorytoavoidrpathissues/src/kudu/src/kudu/rpc/rpc-test.cc:300: Connecting to unix:/tmp/dist-test-tasklBu1Vb/test-tmp/rpc-test-beb890ca31c34704a8257d7921051a0f.sock
I20260929 21:44:14.424439 390 test_util.cc:175] -----------------------------------------------
I20260929 21:44:14.424624 390 test_util.cc:176] Had fatal failures, leaving test files at /tmp/dist-test-tasklBu1Vb/test-tmp/rpc-test.2.Parameters_TestRpc.TestCallWithChainCertAndRootCA_SSL_UnixSocket.1790718250771638-390-0
Note: This is test shard 3 of 8.
[==========] Running 21 tests from 2 test suites.
[----------] Global test environment set-up.
[----------] 1 test from TestRpc
[ RUN ] TestRpc.TestNegotiationTimeout
WARNING: Logging before InitGoogleLogging() is written to STDERR
I20260929 21:44:10.959810 390 rpc-test-base.h:595] status: Timed out: connection negotiation to 0.0.0.0:42381 for RPC Sleep timed out after 0.100s (ON_OUTBOUND_QUEUE), seconds elapsed: 0.100802
W20260929 21:44:14.002837 400 negotiation.cc:337] Failed RPC negotiation. Trace:
0929 21:44:10.859531 (+ 0us) reactor.cc:625] Submitting negotiation task for client connection to 0.0.0.0:42381 (local address 127.0.0.1:44706)
0929 21:44:10.860339 (+ 808us) negotiation.cc:107] Waiting for socket to connect
0929 21:44:10.860389 (+ 50us) client_negotiation.cc:174] Beginning negotiation
0929 21:44:10.873700 (+ 13311us) client_negotiation.cc:252] Sending NEGOTIATE NegotiatePB request
0929 21:44:14.001611 (+3127911us) negotiation.cc:327] Negotiation complete: Timed out: Client connection negotiation failed: client connection to 0.0.0.0:42381: received 0 of 4 requested bytes
Metrics: {"client-negotiator.queue_time_us":240}
[ OK ] TestRpc.TestNegotiationTimeout (3182 ms)
[----------] 1 test from TestRpc (3182 ms total)
[----------] 20 tests from Parameters/TestRpc
[ RUN ] Parameters/TestRpc.TestAcceptorPoolStartStop/SSL_UnixSocket
I20260929 21:44:14.035717 416 acceptor_pool.cc:254] collecting diagnostics on the listening RPC socket unix:/tmp/dist-test-tasklBu1Vb/test-tmp/rpc-test-bb8bbc5f0e4943b7952ebc69a9868569.sock every 8 connection(s)
I20260929 21:44:14.037777 417 acceptor_pool.cc:254] collecting diagnostics on the listening RPC socket unix:/tmp/dist-test-tasklBu1Vb/test-tmp/rpc-test-bb8bbc5f0e4943b7952ebc69a9868569.sock every 8 connection(s)
I20260929 21:44:14.078990 427 acceptor_pool.cc:254] collecting diagnostics on the listening RPC socket unix:/tmp/dist-test-tasklBu1Vb/test-tmp/rpc-test-bb8bbc5f0e4943b7952ebc69a9868569.sock every 8 connection(s)
I20260929 21:44:14.080945 428 acceptor_pool.cc:254] collecting diagnostics on the listening RPC socket unix:/tmp/dist-test-tasklBu1Vb/test-tmp/rpc-test-bb8bbc5f0e4943b7952ebc69a9868569.sock every 8 connection(s)
I20260929 21:44:14.146797 438 acceptor_pool.cc:254] collecting diagnostics on the listening RPC socket unix:/tmp/dist-test-tasklBu1Vb/test-tmp/rpc-test-bb8bbc5f0e4943b7952ebc69a9868569.sock every 8 connection(s)
I20260929 21:44:14.147570 439 acceptor_pool.cc:254] collecting diagnostics on the listening RPC socket unix:/tmp/dist-test-tasklBu1Vb/test-tmp/rpc-test-bb8bbc5f0e4943b7952ebc69a9868569.sock every 8 connection(s)
I20260929 21:44:14.182657 449 acceptor_pool.cc:254] collecting diagnostics on the listening RPC socket unix:/tmp/dist-test-tasklBu1Vb/test-tmp/rpc-test-bb8bbc5f0e4943b7952ebc69a9868569.sock every 8 connection(s)
I20260929 21:44:14.183332 450 acceptor_pool.cc:254] collecting diagnostics on the listening RPC socket unix:/tmp/dist-test-tasklBu1Vb/test-tmp/rpc-test-bb8bbc5f0e4943b7952ebc69a9868569.sock every 8 connection(s)
I20260929 21:44:14.264094 460 acceptor_pool.cc:254] collecting diagnostics on the listening RPC socket unix:/tmp/dist-test-tasklBu1Vb/test-tmp/rpc-test-bb8bbc5f0e4943b7952ebc69a9868569.sock every 8 connection(s)
I20260929 21:44:14.264647 461 acceptor_pool.cc:254] collecting diagnostics on the listening RPC socket unix:/tmp/dist-test-tasklBu1Vb/test-tmp/rpc-test-bb8bbc5f0e4943b7952ebc69a9868569.sock every 8 connection(s)
[ OK ] Parameters/TestRpc.TestAcceptorPoolStartStop/SSL_UnixSocket (261 ms)
[ RUN ] Parameters/TestRpc.TestCall/SSL_UnixSocket
I20260929 21:44:14.312320 473 acceptor_pool.cc:254] collecting diagnostics on the listening RPC socket unix:/tmp/dist-test-tasklBu1Vb/test-tmp/rpc-test-1fe9c677dd0f471b8b01cabeaa0b9d84.sock every 8 connection(s)
I20260929 21:44:14.314162 474 acceptor_pool.cc:254] collecting diagnostics on the listening RPC socket unix:/tmp/dist-test-tasklBu1Vb/test-tmp/rpc-test-1fe9c677dd0f471b8b01cabeaa0b9d84.sock every 8 connection(s)
I20260929 21:44:14.319530 390 rpc-test.cc:234] Connecting to unix:/tmp/dist-test-tasklBu1Vb/test-tmp/rpc-test-1fe9c677dd0f471b8b01cabeaa0b9d84.sock
W20260929 21:44:14.372649 470 connection.cc:196] Error closing socket: Network error: TlsSocket::Close: Broken pipe
[ OK ] Parameters/TestRpc.TestCall/SSL_UnixSocket (108 ms)
[ RUN ] Parameters/TestRpc.TestCallWithChainCertAndRootCA/SSL_UnixSocket
I20260929 21:44:14.400934 498 acceptor_pool.cc:254] collecting diagnostics on the listening RPC socket unix:/tmp/dist-test-tasklBu1Vb/test-tmp/rpc-test-beb890ca31c34704a8257d7921051a0f.sock every 8 connection(s)
I20260929 21:44:14.401633 499 acceptor_pool.cc:254] collecting diagnostics on the listening RPC socket unix:/tmp/dist-test-tasklBu1Vb/test-tmp/rpc-test-beb890ca31c34704a8257d7921051a0f.sock every 8 connection(s)
/data0/somelongdirectorytoavoidrpathissues/src/kudu/src/kudu/rpc/rpc-test.cc:303: Failure
Failed
Bad status: Runtime error: could not verify certificate chain (error with cert: subject=CN = localhost, ST = sadfjas, C = AS, emailAddress = sdflkdsajf, O = lskdfjlsad, OU = sldfkja, issuer=C = AS, ST = ASDfkjdhf, L = lskdjf, O = saldfja, OU = skdjf, CN = localhost, emailAddress = sadjflkadsj): : certificate has expired
Google Test trace:
/data0/somelongdirectorytoavoidrpathissues/src/kudu/src/kudu/rpc/rpc-test.cc:300: Connecting to unix:/tmp/dist-test-tasklBu1Vb/test-tmp/rpc-test-beb890ca31c34704a8257d7921051a0f.sock
I20260929 21:44:14.424439 390 test_util.cc:175] -----------------------------------------------
I20260929 21:44:14.424624 390 test_util.cc:176] Had fatal failures, leaving test files at /tmp/dist-test-tasklBu1Vb/test-tmp/rpc-test.2.Parameters_TestRpc.TestCallWithChainCertAndRootCA_SSL_UnixSocket.1790718250771638-390-0
[ FAILED ] Parameters/TestRpc.TestCallWithChainCertAndRootCA/SSL_UnixSocket, where GetParam() = (true, true) (47 ms)
[ RUN ] Parameters/TestRpc.TestCallWithBadPasswordProtectedKey/SSL_UnixSocket
[ OK ] Parameters/TestRpc.TestCallWithBadPasswordProtectedKey/SSL_UnixSocket (32 ms)
[ RUN ] Parameters/TestRpc.TestInvalidMethodCall/SSL_UnixSocket
I20260929 21:44:14.481606 535 acceptor_pool.cc:254] collecting diagnostics on the listening RPC socket unix:/tmp/dist-test-tasklBu1Vb/test-tmp/rpc-test-149c9ab5d2884c249073b9bea0a50f6d.sock every 8 connection(s)
I20260929 21:44:14.482326 536 acceptor_pool.cc:254] collecting diagnostics on the listening RPC socket unix:/tmp/dist-test-tasklBu1Vb/test-tmp/rpc-test-149c9ab5d2884c249073b9bea0a50f6d.sock every 8 connection(s)
I20260929 21:44:14.486217 390 rpc-test.cc:406] Connecting to unix:/tmp/dist-test-tasklBu1Vb/test-tmp/rpc-test-149c9ab5d2884c249073b9bea0a50f6d.sock
W20260929 21:44:14.532467 532 connection.cc:196] Error closing socket: Network error: TlsSocket::Close: Broken pipe
[ OK ] Parameters/TestRpc.TestInvalidMethodCall/SSL_UnixSocket (80 ms)
[ RUN ] Parameters/TestRpc.TestHighFDs/SSL_UnixSocket
I20260929 21:44:14.793154 560 acceptor_pool.cc:254] collecting diagnostics on the listening RPC socket unix:/tmp/dist-test-tasklBu1Vb/test-tmp/rpc-test-598858a78d51457182ab7469cd565ff9.sock every 8 connection(s)
I20260929 21:44:14.793838 561 acceptor_pool.cc:254] collecting diagnostics on the listening RPC socket unix:/tmp/dist-test-tasklBu1Vb/test-tmp/rpc-test-598858a78d51457182ab7469cd565ff9.sock every 8 connection(s)
W20260929 21:44:14.839159 557 connection.cc:196] Error closing socket: Network error: TlsSocket::Close: Broken pipe
[ OK ] Parameters/TestRpc.TestHighFDs/SSL_UnixSocket (314 ms)
[ RUN ] Parameters/TestRpc.TestConnectionAlwaysKeepalive/SSL_UnixSocket
I20260929 21:44:14.872393 583 acceptor_pool.cc:254] collecting diagnostics on the listening RPC socket unix:/tmp/dist-test-tasklBu1Vb/test-tmp/rpc-test-12f5ce9dc91b464fb34298d89889a8d7.sock every 8 connection(s)
I20260929 21:44:14.873081 584 acceptor_pool.cc:254] collecting diagnostics on the listening RPC socket unix:/tmp/dist-test-tasklBu1Vb/test-tmp/rpc-test-12f5ce9dc91b464fb34298d89889a8d7.sock every 8 connection(s)
I20260929 21:44:14.876156 390 rpc-test.cc:532] Connecting to unix:/tmp/dist-test-tasklBu1Vb/test-tmp/rpc-test-12f5ce9dc91b464fb34298d89889a8d7.sock
[ OK ] Parameters/TestRpc.TestConnectionAlwaysKeepalive/SSL_UnixSocket (3069 ms)
[ RUN ] Parameters/TestRpc.TestReopenOutboundConnections/SSL_UnixSocket
I20260929 21:44:17.944450 606 acceptor_pool.cc:254] collecting diagnostics on the listening RPC socket unix:/tmp/dist-test-tasklBu1Vb/test-tmp/rpc-test-813e0566bcc345fda81ec4ffa8381bab.sock every 8 connection(s)
I20260929 21:44:17.945253 607 acceptor_pool.cc:254] collecting diagnostics on the listening RPC socket unix:/tmp/dist-test-tasklBu1Vb/test-tmp/rpc-test-813e0566bcc345fda81ec4ffa8381bab.sock every 8 connection(s)
I20260929 21:44:17.948578 390 rpc-test.cc:658] Connecting to unix:/tmp/dist-test-tasklBu1Vb/test-tmp/rpc-test-813e0566bcc345fda81ec4ffa8381bab.sock
W20260929 21:44:17.982731 605 connection.cc:196] Error closing socket: Network error: TlsSocket::Close: Broken pipe
W20260929 21:44:17.994477 605 connection.cc:196] Error closing socket: Network error: TlsSocket::Close: Broken pipe
W20260929 21:44:18.006695 605 connection.cc:196] Error closing socket: Network error: TlsSocket::Close: Broken pipe
W20260929 21:44:18.017270 605 connection.cc:196] Error closing socket: Network error: TlsSocket::Close: Broken pipe
W20260929 21:44:18.028964 605 connection.cc:196] Error closing socket: Network error: TlsSocket::Close: Broken pipe
W20260929 21:44:18.039451 605 connection.cc:196] Error closing socket: Network error: TlsSocket::Close: Broken pipe
W20260929 21:44:18.050194 605 connection.cc:196] Error closing socket: Network error: TlsSocket::Close: Broken pipe
W20260929 21:44:18.062400 605 connection.cc:196] Error closing socket: Network error: TlsSocket::Close: Broken pipe
W20260929 21:44:18.074950 605 connection.cc:196] Error closing socket: Network error: TlsSocket::Close: Broken pipe
W20260929 21:44:18.085970 605 connection.cc:196] Error closing socket: Network error: TlsSocket::Close: Broken pipe
W20260929 21:44:18.097543 605 connection.cc:196] Error closing socket: Network error: TlsSocket::Close: Broken pipe
W20260929 21:44:18.109375 605 connection.cc:196] Error closing socket: Network error: TlsSocket::Close: Broken pipe
W20260929 21:44:18.121305 605 connection.cc:196] Error closing socket: Network error: TlsSocket::Close: Broken pipe
W20260929 21:44:18.132704 605 connection.cc:196] Error closing socket: Network error: TlsSocket::Close: Broken pipe
W20260929 21:44:18.132954 606 acceptor_pool.cc:285] unable to collect diagnostics on RPC socket unix:/tmp/dist-test-tasklBu1Vb/test-tmp/rpc-test-813e0566bcc345fda81ec4ffa8381bab.sock: Not implemented: netlink diagnostics is currently supported only on IPv4 TCP sockets
W20260929 21:44:18.145566 605 connection.cc:196] Error closing socket: Network error: TlsSocket::Close: Broken pipe
W20260929 21:44:18.156569 605 connection.cc:196] Error closing socket: Network error: TlsSocket::Close: Broken pipe
W20260929 21:44:18.168526 605 connection.cc:196] Error closing socket: Network error: TlsSocket::Close: Broken pipe
W20260929 21:44:18.179414 605 connection.cc:196] Error closing socket: Network error: TlsSocket::Close: Broken pipe
W20260929 21:44:18.190770 605 connection.cc:196] Error closing socket: Network error: TlsSocket::Close: Broken pipe
W20260929 21:44:18.201903 605 connection.cc:196] Error closing socket: Network error: TlsSocket::Close: Broken pipe
W20260929 21:44:18.213935 605 connection.cc:196] Error closing socket: Network error: TlsSocket::Close: Broken pipe
W20260929 21:44:18.225852 605 connection.cc:196] Error closing socket: Network error: TlsSocket::Close: Broken pipe
W20260929 21:44:18.238960 605 connection.cc:196] Error closing socket: Network error: TlsSocket::Close: Broken pipe
W20260929 21:44:18.249347 605 connection.cc:196] Error closing socket: Network error: TlsSocket::Close: Broken pipe
W20260929 21:44:18.261605 605 connection.cc:196] Error closing socket: Network error: TlsSocket::Close: Broken pipe
W20260929 21:44:18.273140 605 connection.cc:196] Error closing socket: Network error: TlsSocket::Close: Broken pipe
W20260929 21:44:18.282884 605 connection.cc:196] Error closing socket: Network error: TlsSocket::Close: Broken pipe
W20260929 21:44:18.294064 605 connection.cc:196] Error closing socket: Network error: TlsSocket::Close: Broken pipe
W20260929 21:44:18.303684 605 connection.cc:196] Error closing socket: Network error: TlsSocket::Close: Broken pipe
W20260929 21:44:18.314950 605 connection.cc:196] Error closing socket: Network error: TlsSocket::Close: Broken pipe
W20260929 21:44:18.324962 605 connection.cc:196] Error closing socket: Network error: TlsSocket::Close: Broken pipe
W20260929 21:44:18.336223 605 connection.cc:196] Error closing socket: Network error: TlsSocket::Close: Broken pipe
[ OK ] Parameters/TestRpc.TestReopenOutboundConnections/SSL_UnixSocket (418 ms)
[ RUN ] Parameters/TestRpc.TestConnectionNetworkPlane/SSL_UnixSocket
I20260929 21:44:18.359800 629 acceptor_pool.cc:254] collecting diagnostics on the listening RPC socket unix:/tmp/dist-test-tasklBu1Vb/test-tmp/rpc-test-54a044bcf09045d6a4af8b1520723d9c.sock every 8 connection(s)
I20260929 21:44:18.360469 630 acceptor_pool.cc:254] collecting diagnostics on the listening RPC socket unix:/tmp/dist-test-tasklBu1Vb/test-tmp/rpc-test-54a044bcf09045d6a4af8b1520723d9c.sock every 8 connection(s)
I20260929 21:44:18.363766 390 rpc-test.cc:772] Connecting to unix:/tmp/dist-test-tasklBu1Vb/test-tmp/rpc-test-54a044bcf09045d6a4af8b1520723d9c.sock
W20260929 21:44:18.414866 628 connection.cc:196] Error closing socket: Network error: TlsSocket::Close: Broken pipe
W20260929 21:44:18.417358 628 connection.cc:196] Error closing socket: Network error: TlsSocket::Close: Broken pipe
[ OK ] Parameters/TestRpc.TestConnectionNetworkPlane/SSL_UnixSocket (78 ms)
[ RUN ] Parameters/TestRpc.TestTCPKeepalive/SSL_UnixSocket
I20260929 21:44:18.448887 654 acceptor_pool.cc:254] collecting diagnostics on the listening RPC socket unix:/tmp/dist-test-tasklBu1Vb/test-tmp/rpc-test-978dab0883fd47d39a185de50408958a.sock every 8 connection(s)
I20260929 21:44:18.449563 655 acceptor_pool.cc:254] collecting diagnostics on the listening RPC socket unix:/tmp/dist-test-tasklBu1Vb/test-tmp/rpc-test-978dab0883fd47d39a185de50408958a.sock every 8 connection(s)
I20260929 21:44:18.496588 658 rpc-test-base.h:222] got call: sleep_micros: 8000000 deferred: true
I20260929 21:44:26.500734 658 rpcz_store.cc:275] Call kudu.rpc.GenericCalculatorService.Sleep from unix:<unnamed> (request call id 0) took 8004 ms. Trace:
I20260929 21:44:26.501206 658 rpcz_store.cc:276] 0929 21:44:18.496394 (+ 0us) service_pool.cc:170] Inserting onto call queue
0929 21:44:18.496516 (+ 122us) service_pool.cc:227] Handling call
0929 21:44:26.500577 (+8004061us) inbound_call.cc:173] Queueing success response
Metrics: {}
W20260929 21:44:26.508021 651 connection.cc:196] Error closing socket: Network error: TlsSocket::Close: Broken pipe
[ OK ] Parameters/TestRpc.TestTCPKeepalive/SSL_UnixSocket (8095 ms)
[ RUN ] Parameters/TestRpc.TestMaxSmallSidecars/SSL_UnixSocket
I20260929 21:44:26.550480 680 acceptor_pool.cc:254] collecting diagnostics on the listening RPC socket unix:/tmp/dist-test-tasklBu1Vb/test-tmp/rpc-test-131919abf0944f7896073ba00964f060.sock every 8 connection(s)
I20260929 21:44:26.551285 681 acceptor_pool.cc:254] collecting diagnostics on the listening RPC socket unix:/tmp/dist-test-tasklBu1Vb/test-tmp/rpc-test-131919abf0944f7896073ba00964f060.sock every 8 connection(s)
W20260929 21:44:26.721151 677 connection.cc:196] Error closing socket: Network error: TlsSocket::Close: Broken pipe
[ OK ] Parameters/TestRpc.TestMaxSmallSidecars/SSL_UnixSocket (210 ms)
[ RUN ] Parameters/TestRpc.TestCallTimeout/SSL_UnixSocket
I20260929 21:44:26.744285 705 acceptor_pool.cc:254] collecting diagnostics on the listening RPC socket unix:/tmp/dist-test-tasklBu1Vb/test-tmp/rpc-test-49293996425541e682ee90e408f65889.sock every 8 connection(s)
I20260929 21:44:26.745232 706 acceptor_pool.cc:254] collecting diagnostics on the listening RPC socket unix:/tmp/dist-test-tasklBu1Vb/test-tmp/rpc-test-49293996425541e682ee90e408f65889.sock every 8 connection(s)
I20260929 21:44:26.766014 390 rpc-test-base.h:595] status: Timed out: connection negotiation to unix:/tmp/dist-test-tasklBu1Vb/test-tmp/rpc-test-49293996425541e682ee90e408f65889.sock for RPC Sleep timed out after 0.000s (ON_OUTBOUND_QUEUE), seconds elapsed: 0.00265805
I20260929 21:44:26.774034 709 rpc-test-base.h:222] got call: sleep_micros: 700000
I20260929 21:44:26.967877 390 rpc-test-base.h:595] status: Timed out: Sleep RPC to unix:/tmp/dist-test-tasklBu1Vb/test-tmp/rpc-test-49293996425541e682ee90e408f65889.sock timed out after 0.200s (SENT), seconds elapsed: 0.201485
I20260929 21:44:26.969254 708 rpc-test-base.h:222] got call: sleep_micros: 2000000
W20260929 21:44:27.474710 709 rpcz_store.cc:267] Call kudu.rpc.GenericCalculatorService.Sleep from unix:<unnamed> (request call id 1) took 700 ms (client timeout 200 ms). Trace:
W20260929 21:44:27.475044 709 rpcz_store.cc:269] 0929 21:44:26.773861 (+ 0us) service_pool.cc:170] Inserting onto call queue
0929 21:44:26.773983 (+ 122us) service_pool.cc:227] Handling call
0929 21:44:27.474649 (+700666us) inbound_call.cc:173] Queueing success response
Metrics: {}
I20260929 21:44:28.470779 390 rpc-test-base.h:595] status: Timed out: Sleep RPC to unix:/tmp/dist-test-tasklBu1Vb/test-tmp/rpc-test-49293996425541e682ee90e408f65889.sock timed out after 1.500s (SENT), seconds elapsed: 1.50259
W20260929 21:44:28.969796 708 rpcz_store.cc:267] Call kudu.rpc.GenericCalculatorService.Sleep from unix:<unnamed> (request call id 2) took 2000 ms (client timeout 1500 ms). Trace:
W20260929 21:44:28.970108 708 rpcz_store.cc:269] 0929 21:44:26.969047 (+ 0us) service_pool.cc:170] Inserting onto call queue
0929 21:44:26.969192 (+ 145us) service_pool.cc:227] Handling call
0929 21:44:28.969744 (+2000552us) inbound_call.cc:173] Queueing success response
Metrics: {}
W20260929 21:44:28.970676 702 connection.cc:441] server connection from unix:<unnamed> torn down before Call kudu.rpc.GenericCalculatorService.Sleep from unix:<unnamed> (request call id 2) could send its response
[ OK ] Parameters/TestRpc.TestCallTimeout/SSL_UnixSocket (2250 ms)
[ RUN ] Parameters/TestRpc.TestServerShutsDown/SSL_UnixSocket
I20260929 21:44:28.977550 390 rpc-test.cc:1125] Connecting to 0.0.0.0:40363
W20260929 21:44:28.987417 722 negotiation.cc:337] Failed RPC negotiation. Trace:
0929 21:44:28.985931 (+ 0us) reactor.cc:625] Submitting negotiation task for client connection to 0.0.0.0:40363 (local address 127.0.0.1:52192)
0929 21:44:28.986404 (+ 473us) negotiation.cc:107] Waiting for socket to connect
0929 21:44:28.986435 (+ 31us) client_negotiation.cc:174] Beginning negotiation
0929 21:44:28.986651 (+ 216us) client_negotiation.cc:252] Sending NEGOTIATE NegotiatePB request
0929 21:44:28.986898 (+ 247us) negotiation.cc:327] Negotiation complete: Network error: Client connection negotiation failed: client connection to 0.0.0.0:40363: BlockingWrite error: write error: Broken pipe (error 32)
Metrics: {"client-negotiator.queue_time_us":135}
[ OK ] Parameters/TestRpc.TestServerShutsDown/SSL_UnixSocket (14 ms)
[ RUN ] Parameters/TestRpc.TimedOutOnResponseMetric/SSL_UnixSocket
I20260929 21:44:29.029000 739 acceptor_pool.cc:254] collecting diagnostics on the listening RPC socket unix:/tmp/dist-test-tasklBu1Vb/test-tmp/rpc-test-be1786a1a0db4a409202b05dbd2feaf7.sock every 8 connection(s)
I20260929 21:44:29.029640 740 acceptor_pool.cc:254] collecting diagnostics on the listening RPC socket unix:/tmp/dist-test-tasklBu1Vb/test-tmp/rpc-test-be1786a1a0db4a409202b05dbd2feaf7.sock every 8 connection(s)
W20260929 21:44:29.266778 743 rpcz_store.cc:267] Call kudu.rpc_test.CalculatorService.Sleep from unix:<unnamed> (request call id 3) took 50 ms (client timeout 25 ms). Trace:
W20260929 21:44:29.267074 743 rpcz_store.cc:269] 0929 21:44:29.216163 (+ 0us) service_pool.cc:170] Inserting onto call queue
0929 21:44:29.216276 (+ 113us) service_pool.cc:227] Handling call
0929 21:44:29.266698 (+ 50422us) inbound_call.cc:173] Queueing success response
Related trace 'test_child':
Metrics: {"test_sleep_us":50000,"child_traces":[["test_child",{"related_trace_metric":1}]]}
W20260929 21:44:29.327049 743 rpcz_store.cc:267] Call kudu.rpc_test.CalculatorService.Sleep from unix:<unnamed> (request call id 4) took 50 ms (client timeout 50 ms). Trace:
W20260929 21:44:29.327402 743 rpcz_store.cc:269] 0929 21:44:29.276397 (+ 0us) service_pool.cc:170] Inserting onto call queue
0929 21:44:29.276533 (+ 136us) service_pool.cc:227] Handling call
0929 21:44:29.326957 (+ 50424us) inbound_call.cc:173] Queueing success response
Related trace 'test_child':
Metrics: {"test_sleep_us":50000,"child_traces":[["test_child",{"related_trace_metric":1}]]}
[ OK ] Parameters/TestRpc.TimedOutOnResponseMetric/SSL_UnixSocket (345 ms)
[ RUN ] Parameters/TestRpc.AcceptorDispatchingTimesMetric/SSL_UnixSocket
I20260929 21:44:29.346733 764 acceptor_pool.cc:254] collecting diagnostics on the listening RPC socket 0.0.0.0:44647 every 8 connection(s)
I20260929 21:44:29.347395 765 acceptor_pool.cc:254] collecting diagnostics on the listening RPC socket 0.0.0.0:44647 every 8 connection(s)
W20260929 21:44:29.352248 760 negotiation.cc:337] Failed RPC negotiation. Trace:
0929 21:44:29.350984 (+ 0us) reactor.cc:625] Submitting negotiation task for server connection from 127.0.0.1:50790 (local address 127.0.0.1:44647)
0929 21:44:29.351393 (+ 409us) server_negotiation.cc:206] Beginning negotiation
0929 21:44:29.351409 (+ 16us) server_negotiation.cc:399] Waiting for connection header
0929 21:44:29.351642 (+ 233us) negotiation.cc:327] Negotiation complete: Network error: Server connection negotiation failed: server connection from 127.0.0.1:50790: BlockingRecv error: recv got EOF from 127.0.0.1:50790 (error 108)
Metrics: {"server-negotiator.queue_time_us":118}
[ OK ] Parameters/TestRpc.AcceptorDispatchingTimesMetric/SSL_UnixSocket (21 ms)
[ RUN ] Parameters/TestRpc.TestRpcCallbackDestroysMessenger/SSL_UnixSocket
[ OK ] Parameters/TestRpc.TestRpcCallbackDestroysMessenger/SSL_UnixSocket (25 ms)
[ RUN ] Parameters/TestRpc.TestApplicationFeatureFlag/SSL_UnixSocket
I20260929 21:44:29.406698 789 acceptor_pool.cc:254] collecting diagnostics on the listening RPC socket unix:/tmp/dist-test-tasklBu1Vb/test-tmp/rpc-test-3e88c9e59590461ba0549a409e10839a.sock every 8 connection(s)
I20260929 21:44:29.407496 790 acceptor_pool.cc:254] collecting diagnostics on the listening RPC socket unix:/tmp/dist-test-tasklBu1Vb/test-tmp/rpc-test-3e88c9e59590461ba0549a409e10839a.sock every 8 connection(s)
W20260929 21:44:29.438649 786 messenger.cc:357] Unable to handle RPC call: Not implemented: call requires unsupported application feature flags: 99
W20260929 21:44:29.442023 786 connection.cc:196] Error closing socket: Network error: TlsSocket::Close: Broken pipe
[ OK ] Parameters/TestRpc.TestApplicationFeatureFlag/SSL_UnixSocket (64 ms)
[ RUN ] Parameters/TestRpc.TestCancellation/SSL_UnixSocket
I20260929 21:44:29.471596 814 acceptor_pool.cc:254] collecting diagnostics on the listening RPC socket unix:/tmp/dist-test-tasklBu1Vb/test-tmp/rpc-test-b3aaaa10ed5d403ca687d7b0b926d998.sock every 8 connection(s)
I20260929 21:44:29.472293 815 acceptor_pool.cc:254] collecting diagnostics on the listening RPC socket unix:/tmp/dist-test-tasklBu1Vb/test-tmp/rpc-test-b3aaaa10ed5d403ca687d7b0b926d998.sock every 8 connection(s)
I20260929 21:44:29.475576 390 rpc-test.cc:1648] Connecting to unix:/tmp/dist-test-tasklBu1Vb/test-tmp/rpc-test-b3aaaa10ed5d403ca687d7b0b926d998.sock
I20260929 21:44:29.584968 390 rpc-test-base.h:595] status: Aborted: Sleep RPC to unix:/tmp/dist-test-tasklBu1Vb/test-tmp/rpc-test-b3aaaa10ed5d403ca687d7b0b926d998.sock is cancelled in state READY, seconds elapsed: 0.000513195
I20260929 21:44:29.770033 390 rpc-test-base.h:595] status: Aborted: Sleep RPC to unix:/tmp/dist-test-tasklBu1Vb/test-tmp/rpc-test-b3aaaa10ed5d403ca687d7b0b926d998.sock is cancelled in state SENT, seconds elapsed: 0.00109328
I20260929 21:44:29.770368 817 rpc-test-base.h:222] got call: sleep_micros: 510000
I20260929 21:44:29.944983 390 rpc-test-base.h:595] status: Aborted: Sleep RPC to unix:/tmp/dist-test-tasklBu1Vb/test-tmp/rpc-test-b3aaaa10ed5d403ca687d7b0b926d998.sock is cancelled in state SENT, seconds elapsed: 0.00100653
I20260929 21:44:29.945350 816 rpc-test-base.h:222] got call: sleep_micros: 510000
I20260929 21:44:30.125963 390 rpc-test-base.h:595] status: Aborted: Sleep RPC to unix:/tmp/dist-test-tasklBu1Vb/test-tmp/rpc-test-b3aaaa10ed5d403ca687d7b0b926d998.sock is cancelled in state SENT, seconds elapsed: 0.000706076
W20260929 21:44:30.137321 818 rpcz_store.cc:267] Call kudu.rpc.GenericCalculatorService.Sleep from unix:<unnamed> (request call id 11) took 11 ms (client timeout 10 ms). Trace:
W20260929 21:44:30.137591 818 rpcz_store.cc:269] 0929 21:44:30.126246 (+ 0us) service_pool.cc:170] Inserting onto call queue
0929 21:44:30.137040 (+ 10794us) service_pool.cc:214] Skipping call since client already timed out
0929 21:44:30.137151 (+ 111us) inbound_call.cc:173] Queueing failure response
Metrics: {}
I20260929 21:44:30.138108 818 rpc-test-base.h:222] got call: sleep_micros: 1500000
W20260929 21:44:30.281069 817 rpcz_store.cc:267] Call kudu.rpc.GenericCalculatorService.Sleep from unix:<unnamed> (request call id 3) took 511 ms (client timeout 10 ms). Trace:
W20260929 21:44:30.281427 817 rpcz_store.cc:269] 0929 21:44:29.770082 (+ 0us) service_pool.cc:170] Inserting onto call queue
0929 21:44:29.770235 (+ 153us) service_pool.cc:227] Handling call
0929 21:44:30.281000 (+510765us) inbound_call.cc:173] Queueing success response
Metrics: {}
W20260929 21:44:30.456008 816 rpcz_store.cc:267] Call kudu.rpc.GenericCalculatorService.Sleep from unix:<unnamed> (request call id 7) took 511 ms (client timeout 10 ms). Trace:
W20260929 21:44:30.456315 816 rpcz_store.cc:269] 0929 21:44:29.945117 (+ 0us) service_pool.cc:170] Inserting onto call queue
0929 21:44:29.945279 (+ 162us) service_pool.cc:227] Handling call
0929 21:44:30.455953 (+510674us) inbound_call.cc:173] Queueing success response
Metrics: {}
I20260929 21:44:31.128893 390 rpc-test-base.h:595] status: Timed out: Sleep RPC to unix:/tmp/dist-test-tasklBu1Vb/test-tmp/rpc-test-b3aaaa10ed5d403ca687d7b0b926d998.sock timed out after 1.000s (SENT), seconds elapsed: 1.00247
I20260929 21:44:31.130724 816 rpc-test-base.h:222] got call: sleep_micros: 1500000
W20260929 21:44:31.638777 818 rpcz_store.cc:267] Call kudu.rpc.GenericCalculatorService.Sleep from unix:<unnamed> (request call id 12) took 1511 ms (client timeout 1000 ms). Trace:
W20260929 21:44:31.639128 818 rpcz_store.cc:269] 0929 21:44:30.127003 (+ 0us) service_pool.cc:170] Inserting onto call queue
0929 21:44:30.138035 (+ 11032us) service_pool.cc:227] Handling call
0929 21:44:31.638640 (+1500605us) inbound_call.cc:173] Queueing success response
Metrics: {}
I20260929 21:44:32.130729 390 rpc-test-base.h:595] status: Timed out: Sleep RPC to unix:/tmp/dist-test-tasklBu1Vb/test-tmp/rpc-test-b3aaaa10ed5d403ca687d7b0b926d998.sock timed out after 1.000s (SENT), seconds elapsed: 1.00137
W20260929 21:44:32.132318 811 messenger.cc:357] Unable to handle RPC call: Not implemented: call requires unsupported application feature flags: 99, 1
W20260929 21:44:32.134102 811 messenger.cc:357] Unable to handle RPC call: Not implemented: call requires unsupported application feature flags: 99, 1
W20260929 21:44:32.352113 811 connection.cc:196] Error closing socket: Network error: TlsSocket::Close: Broken pipe
W20260929 21:44:32.631399 816 rpcz_store.cc:267] Call kudu.rpc.GenericCalculatorService.Sleep from unix:<unnamed> (request call id 13) took 1501 ms (client timeout 1000 ms). Trace:
W20260929 21:44:32.631711 816 rpcz_store.cc:269] 0929 21:44:31.130445 (+ 0us) service_pool.cc:170] Inserting onto call queue
0929 21:44:31.130617 (+ 172us) service_pool.cc:227] Handling call
0929 21:44:32.631346 (+1500729us) inbound_call.cc:173] Queueing success response
Metrics: {}
W20260929 21:44:32.632297 811 connection.cc:441] server connection from unix:<unnamed> torn down before Call kudu.rpc.GenericCalculatorService.Sleep from unix:<unnamed> (request call id 13) could send its response
[ OK ] Parameters/TestRpc.TestCancellation/SSL_UnixSocket (3192 ms)
[ RUN ] Parameters/TestRpc.TestCancellationMultiThreads/SSL_UnixSocket
I20260929 21:44:32.666813 840 acceptor_pool.cc:254] collecting diagnostics on the listening RPC socket unix:/tmp/dist-test-tasklBu1Vb/test-tmp/rpc-test-5a88e848fbff41c98873c7341cc6999c.sock every 8 connection(s)
I20260929 21:44:32.667619 841 acceptor_pool.cc:254] collecting diagnostics on the listening RPC socket unix:/tmp/dist-test-tasklBu1Vb/test-tmp/rpc-test-5a88e848fbff41c98873c7341cc6999c.sock every 8 connection(s)
I20260929 21:44:32.670907 390 rpc-test.cc:1808] Connecting to unix:/tmp/dist-test-tasklBu1Vb/test-tmp/rpc-test-5a88e848fbff41c98873c7341cc6999c.sock
I20260929 21:44:32.807438 854 test_util.cc:268] Using random seed: 378216863
I20260929 21:44:32.808611 855 test_util.cc:268] Using random seed: 378218123
I20260929 21:44:32.810698 856 test_util.cc:268] Using random seed: 378220110
I20260929 21:44:32.811939 857 test_util.cc:268] Using random seed: 378221430
I20260929 21:44:32.813395 858 test_util.cc:268] Using random seed: 378222789
I20260929 21:44:32.814693 859 test_util.cc:268] Using random seed: 378224084
I20260929 21:44:32.816839 860 test_util.cc:268] Using random seed: 378226239
I20260929 21:44:32.818574 861 test_util.cc:268] Using random seed: 378227963
I20260929 21:44:32.820607 862 test_util.cc:268] Using random seed: 378229428
I20260929 21:44:32.821906 863 test_util.cc:268] Using random seed: 378231237
I20260929 21:44:32.824229 864 test_util.cc:268] Using random seed: 378233541
I20260929 21:44:32.827509 865 test_util.cc:268] Using random seed: 378236852
I20260929 21:44:32.829783 866 test_util.cc:268] Using random seed: 378239144
I20260929 21:44:32.831938 867 test_util.cc:268] Using random seed: 378240891
I20260929 21:44:32.833509 868 test_util.cc:268] Using random seed: 378242826
I20260929 21:44:32.835637 869 test_util.cc:268] Using random seed: 378244994
I20260929 21:44:32.838075 870 test_util.cc:268] Using random seed: 378247438
I20260929 21:44:32.840713 871 test_util.cc:268] Using random seed: 378250036
I20260929 21:44:32.843101 872 test_util.cc:268] Using random seed: 378252460
I20260929 21:44:32.845002 873 test_util.cc:268] Using random seed: 378253864
I20260929 21:44:32.847375 874 test_util.cc:268] Using random seed: 378256543
I20260929 21:44:32.849867 875 test_util.cc:268] Using random seed: 378258553
I20260929 21:44:32.851130 876 test_util.cc:268] Using random seed: 378260480
I20260929 21:44:32.852813 877 test_util.cc:268] Using random seed: 378262204
I20260929 21:44:32.854494 878 test_util.cc:268] Using random seed: 378263921
I20260929 21:44:32.857707 879 test_util.cc:268] Using random seed: 378266617
I20260929 21:44:32.859319 880 test_util.cc:268] Using random seed: 378268287
I20260929 21:44:32.861305 881 test_util.cc:268] Using random seed: 378270664
I20260929 21:44:32.863076 882 test_util.cc:268] Using random seed: 378272452
I20260929 21:44:32.865021 883 test_util.cc:268] Using random seed: 378274357
W20260929 21:44:53.041304 837 connection.cc:196] Error closing socket: Network error: TlsSocket::Close: Broken pipe
[ OK ] Parameters/TestRpc.TestCancellationMultiThreads/SSL_UnixSocket (20419 ms)
[ RUN ] Parameters/TestRpc.TestCallId/SSL_UnixSocket
I20260929 21:44:53.088361 897 acceptor_pool.cc:254] collecting diagnostics on the listening RPC socket unix:/tmp/dist-test-tasklBu1Vb/test-tmp/rpc-test-36069f5770b44e88ac9eca7cff30aa11.sock every 8 connection(s)
I20260929 21:44:53.089221 898 acceptor_pool.cc:254] collecting diagnostics on the listening RPC socket unix:/tmp/dist-test-tasklBu1Vb/test-tmp/rpc-test-36069f5770b44e88ac9eca7cff30aa11.sock every 8 connection(s)
[ OK ] Parameters/TestRpc.TestCallId/SSL_UnixSocket (86 ms)
[----------] 20 tests from Parameters/TestRpc (39139 ms total)
[----------] Global test environment tear-down
[==========] 21 tests from 2 test suites ran. (42323 ms total)
[ PASSED ] 20 tests.
[ FAILED ] 1 test, listed below:
[ FAILED ] Parameters/TestRpc.TestCallWithChainCertAndRootCA/SSL_UnixSocket, where GetParam() = (true, true)
1 FAILED TEST
I20260929 21:44:53.165234 390 logging.cc:424] LogThrottler /data0/somelongdirectorytoavoidrpathissues/src/kudu/src/kudu/rpc/acceptor_pool.cc:285: suppressed but not reported on 3 messages since previous log ~35 seconds ago