Diagnosed failure

Parameters/TestRpc.TestCallWithChainCertAndRootCA/SSL_UnixSocket: /data0/somelongdirectorytoavoidrpathissues/src/kudu/src/kudu/rpc/rpc-test.cc:303: Failure
Failed
Bad status: Runtime error: could not verify certificate chain (error with cert: subject=CN = localhost, ST = sadfjas, C = AS, emailAddress = sdflkdsajf, O = lskdfjlsad, OU = sldfkja, issuer=C = AS, ST = ASDfkjdhf, L = lskdjf, O = saldfja, OU = skdjf, CN = localhost, emailAddress = sadjflkadsj): : certificate has expired
Google Test trace:
/data0/somelongdirectorytoavoidrpathissues/src/kudu/src/kudu/rpc/rpc-test.cc:300: Connecting to unix:/tmp/dist-test-tasklgpljN/test-tmp/rpc-test-830290681c7d4314b7f951e3e7658ab3.sock
I20260926 21:54:54.586441   791 test_util.cc:175] -----------------------------------------------
I20260926 21:54:54.586694   791 test_util.cc:176] Had fatal failures, leaving test files at /tmp/dist-test-tasklgpljN/test-tmp/rpc-test.2.Parameters_TestRpc.TestCallWithChainCertAndRootCA_SSL_UnixSocket.1790459691033664-791-0

Full log

Note: This is test shard 3 of 8.
[==========] Running 21 tests from 2 test suites.
[----------] Global test environment set-up.
[----------] 1 test from TestRpc
[ RUN      ] TestRpc.TestNegotiationTimeout
WARNING: Logging before InitGoogleLogging() is written to STDERR
I20260926 21:54:51.225598   791 rpc-test-base.h:595] status: Timed out: connection negotiation to 0.0.0.0:36439 for RPC Sleep timed out after 0.100s (ON_OUTBOUND_QUEUE), seconds elapsed: 0.101441
W20260926 21:54:54.216382   801 negotiation.cc:337] Failed RPC negotiation. Trace:
0926 21:54:51.126335 (+     0us) reactor.cc:625] Submitting negotiation task for client connection to 0.0.0.0:36439 (local address 127.0.0.1:56360)
0926 21:54:51.127330 (+   995us) negotiation.cc:107] Waiting for socket to connect
0926 21:54:51.127397 (+    67us) client_negotiation.cc:174] Beginning negotiation
0926 21:54:51.140885 (+ 13488us) client_negotiation.cc:252] Sending NEGOTIATE NegotiatePB request
0926 21:54:54.215095 (+3074210us) negotiation.cc:327] Negotiation complete: Timed out: Client connection negotiation failed: client connection to 0.0.0.0:36439: received 0 of 4 requested bytes
Metrics: {"client-negotiator.queue_time_us":310}
[       OK ] TestRpc.TestNegotiationTimeout (3133 ms)
[----------] 1 test from TestRpc (3133 ms total)

[----------] 20 tests from Parameters/TestRpc
[ RUN      ] Parameters/TestRpc.TestAcceptorPoolStartStop/SSL_UnixSocket
I20260926 21:54:54.258908   817 acceptor_pool.cc:254] collecting diagnostics on the listening RPC socket unix:/tmp/dist-test-tasklgpljN/test-tmp/rpc-test-40e1041747dd41a6bb0cbee6f6a841aa.sock every 8 connection(s)
I20260926 21:54:54.260789   818 acceptor_pool.cc:254] collecting diagnostics on the listening RPC socket unix:/tmp/dist-test-tasklgpljN/test-tmp/rpc-test-40e1041747dd41a6bb0cbee6f6a841aa.sock every 8 connection(s)
I20260926 21:54:54.301528   828 acceptor_pool.cc:254] collecting diagnostics on the listening RPC socket unix:/tmp/dist-test-tasklgpljN/test-tmp/rpc-test-40e1041747dd41a6bb0cbee6f6a841aa.sock every 8 connection(s)
I20260926 21:54:54.303009   829 acceptor_pool.cc:254] collecting diagnostics on the listening RPC socket unix:/tmp/dist-test-tasklgpljN/test-tmp/rpc-test-40e1041747dd41a6bb0cbee6f6a841aa.sock every 8 connection(s)
I20260926 21:54:54.327973   839 acceptor_pool.cc:254] collecting diagnostics on the listening RPC socket unix:/tmp/dist-test-tasklgpljN/test-tmp/rpc-test-40e1041747dd41a6bb0cbee6f6a841aa.sock every 8 connection(s)
I20260926 21:54:54.328763   840 acceptor_pool.cc:254] collecting diagnostics on the listening RPC socket unix:/tmp/dist-test-tasklgpljN/test-tmp/rpc-test-40e1041747dd41a6bb0cbee6f6a841aa.sock every 8 connection(s)
I20260926 21:54:54.345638   850 acceptor_pool.cc:254] collecting diagnostics on the listening RPC socket unix:/tmp/dist-test-tasklgpljN/test-tmp/rpc-test-40e1041747dd41a6bb0cbee6f6a841aa.sock every 8 connection(s)
I20260926 21:54:54.346415   851 acceptor_pool.cc:254] collecting diagnostics on the listening RPC socket unix:/tmp/dist-test-tasklgpljN/test-tmp/rpc-test-40e1041747dd41a6bb0cbee6f6a841aa.sock every 8 connection(s)
I20260926 21:54:54.369872   861 acceptor_pool.cc:254] collecting diagnostics on the listening RPC socket unix:/tmp/dist-test-tasklgpljN/test-tmp/rpc-test-40e1041747dd41a6bb0cbee6f6a841aa.sock every 8 connection(s)
I20260926 21:54:54.370715   862 acceptor_pool.cc:254] collecting diagnostics on the listening RPC socket unix:/tmp/dist-test-tasklgpljN/test-tmp/rpc-test-40e1041747dd41a6bb0cbee6f6a841aa.sock every 8 connection(s)
[       OK ] Parameters/TestRpc.TestAcceptorPoolStartStop/SSL_UnixSocket (154 ms)
[ RUN      ] Parameters/TestRpc.TestCall/SSL_UnixSocket
I20260926 21:54:54.400560   874 acceptor_pool.cc:254] collecting diagnostics on the listening RPC socket unix:/tmp/dist-test-tasklgpljN/test-tmp/rpc-test-b5dc146cdc9b4ed6a71a4a4a8346097d.sock every 8 connection(s)
I20260926 21:54:54.403129   875 acceptor_pool.cc:254] collecting diagnostics on the listening RPC socket unix:/tmp/dist-test-tasklgpljN/test-tmp/rpc-test-b5dc146cdc9b4ed6a71a4a4a8346097d.sock every 8 connection(s)
I20260926 21:54:54.410887   791 rpc-test.cc:234] Connecting to unix:/tmp/dist-test-tasklgpljN/test-tmp/rpc-test-b5dc146cdc9b4ed6a71a4a4a8346097d.sock
W20260926 21:54:54.488044   871 connection.cc:196] Error closing socket: Network error: TlsSocket::Close: Broken pipe
[       OK ] Parameters/TestRpc.TestCall/SSL_UnixSocket (121 ms)
[ RUN      ] Parameters/TestRpc.TestCallWithChainCertAndRootCA/SSL_UnixSocket
I20260926 21:54:54.559774   899 acceptor_pool.cc:254] collecting diagnostics on the listening RPC socket unix:/tmp/dist-test-tasklgpljN/test-tmp/rpc-test-830290681c7d4314b7f951e3e7658ab3.sock every 8 connection(s)
I20260926 21:54:54.560518   900 acceptor_pool.cc:254] collecting diagnostics on the listening RPC socket unix:/tmp/dist-test-tasklgpljN/test-tmp/rpc-test-830290681c7d4314b7f951e3e7658ab3.sock every 8 connection(s)
/data0/somelongdirectorytoavoidrpathissues/src/kudu/src/kudu/rpc/rpc-test.cc:303: Failure
Failed
Bad status: Runtime error: could not verify certificate chain (error with cert: subject=CN = localhost, ST = sadfjas, C = AS, emailAddress = sdflkdsajf, O = lskdfjlsad, OU = sldfkja, issuer=C = AS, ST = ASDfkjdhf, L = lskdjf, O = saldfja, OU = skdjf, CN = localhost, emailAddress = sadjflkadsj): : certificate has expired
Google Test trace:
/data0/somelongdirectorytoavoidrpathissues/src/kudu/src/kudu/rpc/rpc-test.cc:300: Connecting to unix:/tmp/dist-test-tasklgpljN/test-tmp/rpc-test-830290681c7d4314b7f951e3e7658ab3.sock
I20260926 21:54:54.586441   791 test_util.cc:175] -----------------------------------------------
I20260926 21:54:54.586694   791 test_util.cc:176] Had fatal failures, leaving test files at /tmp/dist-test-tasklgpljN/test-tmp/rpc-test.2.Parameters_TestRpc.TestCallWithChainCertAndRootCA_SSL_UnixSocket.1790459691033664-791-0
[  FAILED  ] Parameters/TestRpc.TestCallWithChainCertAndRootCA/SSL_UnixSocket, where GetParam() = (true, true) (89 ms)
[ RUN      ] Parameters/TestRpc.TestCallWithBadPasswordProtectedKey/SSL_UnixSocket
[       OK ] Parameters/TestRpc.TestCallWithBadPasswordProtectedKey/SSL_UnixSocket (45 ms)
[ RUN      ] Parameters/TestRpc.TestInvalidMethodCall/SSL_UnixSocket
I20260926 21:54:54.655252   936 acceptor_pool.cc:254] collecting diagnostics on the listening RPC socket unix:/tmp/dist-test-tasklgpljN/test-tmp/rpc-test-4b2b8cb5df864be4b9e3b12966d4c731.sock every 8 connection(s)
I20260926 21:54:54.656348   937 acceptor_pool.cc:254] collecting diagnostics on the listening RPC socket unix:/tmp/dist-test-tasklgpljN/test-tmp/rpc-test-4b2b8cb5df864be4b9e3b12966d4c731.sock every 8 connection(s)
I20260926 21:54:54.661470   791 rpc-test.cc:406] Connecting to unix:/tmp/dist-test-tasklgpljN/test-tmp/rpc-test-4b2b8cb5df864be4b9e3b12966d4c731.sock
W20260926 21:54:54.704879   933 connection.cc:196] Error closing socket: Network error: TlsSocket::Close: Broken pipe
[       OK ] Parameters/TestRpc.TestInvalidMethodCall/SSL_UnixSocket (77 ms)
[ RUN      ] Parameters/TestRpc.TestHighFDs/SSL_UnixSocket
I20260926 21:54:54.925132   961 acceptor_pool.cc:254] collecting diagnostics on the listening RPC socket unix:/tmp/dist-test-tasklgpljN/test-tmp/rpc-test-d1a72286527e4584a33628f94cbb26e8.sock every 8 connection(s)
I20260926 21:54:54.926322   962 acceptor_pool.cc:254] collecting diagnostics on the listening RPC socket unix:/tmp/dist-test-tasklgpljN/test-tmp/rpc-test-d1a72286527e4584a33628f94cbb26e8.sock every 8 connection(s)
[       OK ] Parameters/TestRpc.TestHighFDs/SSL_UnixSocket (266 ms)
[ RUN      ] Parameters/TestRpc.TestConnectionAlwaysKeepalive/SSL_UnixSocket
I20260926 21:54:55.009101   984 acceptor_pool.cc:254] collecting diagnostics on the listening RPC socket unix:/tmp/dist-test-tasklgpljN/test-tmp/rpc-test-b1be6004b4cf47d4aad2a2185aaf880f.sock every 8 connection(s)
I20260926 21:54:55.009990   985 acceptor_pool.cc:254] collecting diagnostics on the listening RPC socket unix:/tmp/dist-test-tasklgpljN/test-tmp/rpc-test-b1be6004b4cf47d4aad2a2185aaf880f.sock every 8 connection(s)
I20260926 21:54:55.013871   791 rpc-test.cc:532] Connecting to unix:/tmp/dist-test-tasklgpljN/test-tmp/rpc-test-b1be6004b4cf47d4aad2a2185aaf880f.sock
W20260926 21:54:58.076700   983 connection.cc:196] Error closing socket: Network error: TlsSocket::Close: Broken pipe
[       OK ] Parameters/TestRpc.TestConnectionAlwaysKeepalive/SSL_UnixSocket (3104 ms)
[ RUN      ] Parameters/TestRpc.TestReopenOutboundConnections/SSL_UnixSocket
I20260926 21:54:58.109759  1007 acceptor_pool.cc:254] collecting diagnostics on the listening RPC socket unix:/tmp/dist-test-tasklgpljN/test-tmp/rpc-test-4e5e52735b664342b7f63d320c654e7e.sock every 8 connection(s)
I20260926 21:54:58.110595  1008 acceptor_pool.cc:254] collecting diagnostics on the listening RPC socket unix:/tmp/dist-test-tasklgpljN/test-tmp/rpc-test-4e5e52735b664342b7f63d320c654e7e.sock every 8 connection(s)
I20260926 21:54:58.114233   791 rpc-test.cc:658] Connecting to unix:/tmp/dist-test-tasklgpljN/test-tmp/rpc-test-4e5e52735b664342b7f63d320c654e7e.sock
W20260926 21:54:58.146466  1006 connection.cc:196] Error closing socket: Network error: TlsSocket::Close: Broken pipe
W20260926 21:54:58.158330  1006 connection.cc:196] Error closing socket: Network error: TlsSocket::Close: Broken pipe
W20260926 21:54:58.170702  1006 connection.cc:196] Error closing socket: Network error: TlsSocket::Close: Broken pipe
W20260926 21:54:58.183247  1006 connection.cc:196] Error closing socket: Network error: TlsSocket::Close: Broken pipe
W20260926 21:54:58.195528  1006 connection.cc:196] Error closing socket: Network error: TlsSocket::Close: Broken pipe
W20260926 21:54:58.207898  1006 connection.cc:196] Error closing socket: Network error: TlsSocket::Close: Broken pipe
W20260926 21:54:58.218598  1006 connection.cc:196] Error closing socket: Network error: TlsSocket::Close: Broken pipe
W20260926 21:54:58.231266  1006 connection.cc:196] Error closing socket: Network error: TlsSocket::Close: Broken pipe
W20260926 21:54:58.244267  1006 connection.cc:196] Error closing socket: Network error: TlsSocket::Close: Broken pipe
W20260926 21:54:58.256474  1006 connection.cc:196] Error closing socket: Network error: TlsSocket::Close: Broken pipe
W20260926 21:54:58.268426  1006 connection.cc:196] Error closing socket: Network error: TlsSocket::Close: Broken pipe
W20260926 21:54:58.281359  1006 connection.cc:196] Error closing socket: Network error: TlsSocket::Close: Broken pipe
W20260926 21:54:58.292760  1006 connection.cc:196] Error closing socket: Network error: TlsSocket::Close: Broken pipe
W20260926 21:54:58.306241  1006 connection.cc:196] Error closing socket: Network error: TlsSocket::Close: Broken pipe
W20260926 21:54:58.306515  1007 acceptor_pool.cc:285] unable to collect diagnostics on RPC socket unix:/tmp/dist-test-tasklgpljN/test-tmp/rpc-test-4e5e52735b664342b7f63d320c654e7e.sock: Not implemented: netlink diagnostics is currently supported only on IPv4 TCP sockets
W20260926 21:54:58.336648  1006 connection.cc:196] Error closing socket: Network error: TlsSocket::Close: Broken pipe
W20260926 21:54:58.348564  1006 connection.cc:196] Error closing socket: Network error: TlsSocket::Close: Broken pipe
W20260926 21:54:58.360419  1006 connection.cc:196] Error closing socket: Network error: TlsSocket::Close: Broken pipe
W20260926 21:54:58.373724  1006 connection.cc:196] Error closing socket: Network error: TlsSocket::Close: Broken pipe
W20260926 21:54:58.384840  1006 connection.cc:196] Error closing socket: Network error: TlsSocket::Close: Broken pipe
W20260926 21:54:58.396754  1006 connection.cc:196] Error closing socket: Network error: TlsSocket::Close: Broken pipe
W20260926 21:54:58.408005  1006 connection.cc:196] Error closing socket: Network error: TlsSocket::Close: Broken pipe
W20260926 21:54:58.419826  1006 connection.cc:196] Error closing socket: Network error: TlsSocket::Close: Broken pipe
W20260926 21:54:58.432274  1006 connection.cc:196] Error closing socket: Network error: TlsSocket::Close: Broken pipe
W20260926 21:54:58.445245  1006 connection.cc:196] Error closing socket: Network error: TlsSocket::Close: Broken pipe
W20260926 21:54:58.455853  1006 connection.cc:196] Error closing socket: Network error: TlsSocket::Close: Broken pipe
W20260926 21:54:58.466708  1006 connection.cc:196] Error closing socket: Network error: TlsSocket::Close: Broken pipe
W20260926 21:54:58.478390  1006 connection.cc:196] Error closing socket: Network error: TlsSocket::Close: Broken pipe
W20260926 21:54:58.490301  1006 connection.cc:196] Error closing socket: Network error: TlsSocket::Close: Broken pipe
W20260926 21:54:58.503558  1006 connection.cc:196] Error closing socket: Network error: TlsSocket::Close: Broken pipe
W20260926 21:54:58.530220  1006 connection.cc:196] Error closing socket: Network error: TlsSocket::Close: Broken pipe
[       OK ] Parameters/TestRpc.TestReopenOutboundConnections/SSL_UnixSocket (453 ms)
[ RUN      ] Parameters/TestRpc.TestConnectionNetworkPlane/SSL_UnixSocket
I20260926 21:54:58.558013  1030 acceptor_pool.cc:254] collecting diagnostics on the listening RPC socket unix:/tmp/dist-test-tasklgpljN/test-tmp/rpc-test-a8cc946ae3dc406bba8376a363e3b5ad.sock every 8 connection(s)
I20260926 21:54:58.558632  1031 acceptor_pool.cc:254] collecting diagnostics on the listening RPC socket unix:/tmp/dist-test-tasklgpljN/test-tmp/rpc-test-a8cc946ae3dc406bba8376a363e3b5ad.sock every 8 connection(s)
I20260926 21:54:58.562245   791 rpc-test.cc:772] Connecting to unix:/tmp/dist-test-tasklgpljN/test-tmp/rpc-test-a8cc946ae3dc406bba8376a363e3b5ad.sock
W20260926 21:54:58.620333  1029 connection.cc:196] Error closing socket: Network error: TlsSocket::Close: Broken pipe
W20260926 21:54:58.621340  1029 connection.cc:196] Error closing socket: Network error: TlsSocket::Close: Broken pipe
[       OK ] Parameters/TestRpc.TestConnectionNetworkPlane/SSL_UnixSocket (91 ms)
[ RUN      ] Parameters/TestRpc.TestTCPKeepalive/SSL_UnixSocket
I20260926 21:54:58.653970  1055 acceptor_pool.cc:254] collecting diagnostics on the listening RPC socket unix:/tmp/dist-test-tasklgpljN/test-tmp/rpc-test-038f2ba0ff3e4068a364869a811551ce.sock every 8 connection(s)
I20260926 21:54:58.654762  1056 acceptor_pool.cc:254] collecting diagnostics on the listening RPC socket unix:/tmp/dist-test-tasklgpljN/test-tmp/rpc-test-038f2ba0ff3e4068a364869a811551ce.sock every 8 connection(s)
I20260926 21:54:58.687613  1059 rpc-test-base.h:222] got call: sleep_micros: 8000000 deferred: true
I20260926 21:55:06.692396  1059 rpcz_store.cc:275] Call kudu.rpc.GenericCalculatorService.Sleep from unix:<unnamed> (request call id 0) took 8004 ms. Trace:
I20260926 21:55:06.692881  1059 rpcz_store.cc:276] 0926 21:54:58.687416 (+     0us) service_pool.cc:170] Inserting onto call queue
0926 21:54:58.687544 (+   128us) service_pool.cc:227] Handling call
0926 21:55:06.692158 (+8004614us) inbound_call.cc:173] Queueing success response
Metrics: {}
W20260926 21:55:06.701596  1052 connection.cc:196] Error closing socket: Network error: TlsSocket::Close: Broken pipe
[       OK ] Parameters/TestRpc.TestTCPKeepalive/SSL_UnixSocket (8082 ms)
[ RUN      ] Parameters/TestRpc.TestMaxSmallSidecars/SSL_UnixSocket
I20260926 21:55:06.737269  1081 acceptor_pool.cc:254] collecting diagnostics on the listening RPC socket unix:/tmp/dist-test-tasklgpljN/test-tmp/rpc-test-7344c4097ae84ad080936967c979f5fe.sock every 8 connection(s)
I20260926 21:55:06.738332  1082 acceptor_pool.cc:254] collecting diagnostics on the listening RPC socket unix:/tmp/dist-test-tasklgpljN/test-tmp/rpc-test-7344c4097ae84ad080936967c979f5fe.sock every 8 connection(s)
W20260926 21:55:06.919489  1078 connection.cc:196] Error closing socket: Network error: TlsSocket::Close: Broken pipe
[       OK ] Parameters/TestRpc.TestMaxSmallSidecars/SSL_UnixSocket (215 ms)
[ RUN      ] Parameters/TestRpc.TestCallTimeout/SSL_UnixSocket
I20260926 21:55:06.970078  1106 acceptor_pool.cc:254] collecting diagnostics on the listening RPC socket unix:/tmp/dist-test-tasklgpljN/test-tmp/rpc-test-8cb5634145154db0b68494baa07a2db4.sock every 8 connection(s)
I20260926 21:55:06.970878  1107 acceptor_pool.cc:254] collecting diagnostics on the listening RPC socket unix:/tmp/dist-test-tasklgpljN/test-tmp/rpc-test-8cb5634145154db0b68494baa07a2db4.sock every 8 connection(s)
I20260926 21:55:07.001565   791 rpc-test-base.h:595] status: Timed out: connection negotiation to unix:/tmp/dist-test-tasklgpljN/test-tmp/rpc-test-8cb5634145154db0b68494baa07a2db4.sock for RPC Sleep timed out after 0.000s (ON_OUTBOUND_QUEUE), seconds elapsed: 0.00280464
I20260926 21:55:07.010417  1110 rpc-test-base.h:222] got call: sleep_micros: 700000
I20260926 21:55:07.203612   791 rpc-test-base.h:595] status: Timed out: Sleep RPC to unix:/tmp/dist-test-tasklgpljN/test-tmp/rpc-test-8cb5634145154db0b68494baa07a2db4.sock timed out after 0.200s (SENT), seconds elapsed: 0.20161
I20260926 21:55:07.205163  1109 rpc-test-base.h:222] got call: sleep_micros: 2000000
W20260926 21:55:07.711248  1110 rpcz_store.cc:267] Call kudu.rpc.GenericCalculatorService.Sleep from unix:<unnamed> (request call id 1) took 701 ms (client timeout 200 ms). Trace:
W20260926 21:55:07.711627  1110 rpcz_store.cc:269] 0926 21:55:07.010194 (+     0us) service_pool.cc:170] Inserting onto call queue
0926 21:55:07.010354 (+   160us) service_pool.cc:227] Handling call
0926 21:55:07.711180 (+700826us) inbound_call.cc:173] Queueing success response
Metrics: {}
I20260926 21:55:08.706353   791 rpc-test-base.h:595] status: Timed out: Sleep RPC to unix:/tmp/dist-test-tasklgpljN/test-tmp/rpc-test-8cb5634145154db0b68494baa07a2db4.sock timed out after 1.500s (SENT), seconds elapsed: 1.50236
W20260926 21:55:08.712900  1103 connection.cc:196] Error closing socket: Network error: TlsSocket::Close: Broken pipe
W20260926 21:55:09.205797  1109 rpcz_store.cc:267] Call kudu.rpc.GenericCalculatorService.Sleep from unix:<unnamed> (request call id 2) took 2000 ms (client timeout 1500 ms). Trace:
W20260926 21:55:09.206188  1109 rpcz_store.cc:269] 0926 21:55:07.204956 (+     0us) service_pool.cc:170] Inserting onto call queue
0926 21:55:07.205097 (+   141us) service_pool.cc:227] Handling call
0926 21:55:09.205723 (+2000626us) inbound_call.cc:173] Queueing success response
Metrics: {}
W20260926 21:55:09.206912  1103 connection.cc:441] server connection from unix:<unnamed> torn down before Call kudu.rpc.GenericCalculatorService.Sleep from unix:<unnamed> (request call id 2) could send its response
[       OK ] Parameters/TestRpc.TestCallTimeout/SSL_UnixSocket (2287 ms)
[ RUN      ] Parameters/TestRpc.TestServerShutsDown/SSL_UnixSocket
I20260926 21:55:09.215556   791 rpc-test.cc:1125] Connecting to 0.0.0.0:45441
W20260926 21:55:09.226549  1123 negotiation.cc:337] Failed RPC negotiation. Trace:
0926 21:55:09.224578 (+     0us) reactor.cc:625] Submitting negotiation task for client connection to 0.0.0.0:45441 (local address 127.0.0.1:36990)
0926 21:55:09.225230 (+   652us) negotiation.cc:107] Waiting for socket to connect
0926 21:55:09.225273 (+    43us) client_negotiation.cc:174] Beginning negotiation
0926 21:55:09.225589 (+   316us) client_negotiation.cc:252] Sending NEGOTIATE NegotiatePB request
0926 21:55:09.225849 (+   260us) negotiation.cc:327] Negotiation complete: Network error: Client connection negotiation failed: client connection to 0.0.0.0:45441: BlockingWrite error: write error: Broken pipe (error 32)
Metrics: {"client-negotiator.queue_time_us":194}
[       OK ] Parameters/TestRpc.TestServerShutsDown/SSL_UnixSocket (16 ms)
[ RUN      ] Parameters/TestRpc.TimedOutOnResponseMetric/SSL_UnixSocket
I20260926 21:55:09.249850  1140 acceptor_pool.cc:254] collecting diagnostics on the listening RPC socket unix:/tmp/dist-test-tasklgpljN/test-tmp/rpc-test-c82e6d58f8554d0fa0aa6a1778cc4176.sock every 8 connection(s)
I20260926 21:55:09.250524  1141 acceptor_pool.cc:254] collecting diagnostics on the listening RPC socket unix:/tmp/dist-test-tasklgpljN/test-tmp/rpc-test-c82e6d58f8554d0fa0aa6a1778cc4176.sock every 8 connection(s)
W20260926 21:55:09.498651  1144 rpcz_store.cc:267] Call kudu.rpc_test.CalculatorService.Sleep from unix:<unnamed> (request call id 3) took 50 ms (client timeout 25 ms). Trace:
W20260926 21:55:09.499015  1144 rpcz_store.cc:269] 0926 21:55:09.447932 (+     0us) service_pool.cc:170] Inserting onto call queue
0926 21:55:09.448056 (+   124us) service_pool.cc:227] Handling call
0926 21:55:09.498537 (+ 50481us) inbound_call.cc:173] Queueing success response
Related trace 'test_child':
Metrics: {"test_sleep_us":50000,"child_traces":[["test_child",{"related_trace_metric":1}]]}
W20260926 21:55:09.557838  1144 rpcz_store.cc:267] Call kudu.rpc_test.CalculatorService.Sleep from unix:<unnamed> (request call id 4) took 50 ms (client timeout 50 ms). Trace:
W20260926 21:55:09.558171  1144 rpcz_store.cc:269] 0926 21:55:09.507153 (+     0us) service_pool.cc:170] Inserting onto call queue
0926 21:55:09.507336 (+   183us) service_pool.cc:227] Handling call
0926 21:55:09.557767 (+ 50431us) inbound_call.cc:173] Queueing success response
Related trace 'test_child':
Metrics: {"test_sleep_us":50000,"child_traces":[["test_child",{"related_trace_metric":1}]]}
W20260926 21:55:09.562541  1137 connection.cc:196] Error closing socket: Network error: TlsSocket::Close: Broken pipe
[       OK ] Parameters/TestRpc.TimedOutOnResponseMetric/SSL_UnixSocket (339 ms)
[ RUN      ] Parameters/TestRpc.AcceptorDispatchingTimesMetric/SSL_UnixSocket
I20260926 21:55:09.588349  1165 acceptor_pool.cc:254] collecting diagnostics on the listening RPC socket 0.0.0.0:38309 every 8 connection(s)
I20260926 21:55:09.589320  1166 acceptor_pool.cc:254] collecting diagnostics on the listening RPC socket 0.0.0.0:38309 every 8 connection(s)
W20260926 21:55:09.595817  1161 negotiation.cc:337] Failed RPC negotiation. Trace:
0926 21:55:09.594002 (+     0us) reactor.cc:625] Submitting negotiation task for server connection from 127.0.0.1:52446 (local address 127.0.0.1:38309)
0926 21:55:09.594664 (+   662us) server_negotiation.cc:206] Beginning negotiation
0926 21:55:09.594685 (+    21us) server_negotiation.cc:399] Waiting for connection header
0926 21:55:09.595045 (+   360us) negotiation.cc:327] Negotiation complete: Network error: Server connection negotiation failed: server connection from 127.0.0.1:52446: BlockingRecv error: recv got EOF from 127.0.0.1:52446 (error 108)
Metrics: {"server-negotiator.queue_time_us":140}
[       OK ] Parameters/TestRpc.AcceptorDispatchingTimesMetric/SSL_UnixSocket (32 ms)
[ RUN      ] Parameters/TestRpc.TestRpcCallbackDestroysMessenger/SSL_UnixSocket
[       OK ] Parameters/TestRpc.TestRpcCallbackDestroysMessenger/SSL_UnixSocket (30 ms)
[ RUN      ] Parameters/TestRpc.TestApplicationFeatureFlag/SSL_UnixSocket
I20260926 21:55:09.659814  1190 acceptor_pool.cc:254] collecting diagnostics on the listening RPC socket unix:/tmp/dist-test-tasklgpljN/test-tmp/rpc-test-1bfd4b24026a46d7add14b68beb7902a.sock every 8 connection(s)
I20260926 21:55:09.660651  1191 acceptor_pool.cc:254] collecting diagnostics on the listening RPC socket unix:/tmp/dist-test-tasklgpljN/test-tmp/rpc-test-1bfd4b24026a46d7add14b68beb7902a.sock every 8 connection(s)
W20260926 21:55:09.691941  1187 messenger.cc:357] Unable to handle RPC call: Not implemented: call requires unsupported application feature flags: 99
[       OK ] Parameters/TestRpc.TestApplicationFeatureFlag/SSL_UnixSocket (68 ms)
[ RUN      ] Parameters/TestRpc.TestCancellation/SSL_UnixSocket
I20260926 21:55:09.723753  1215 acceptor_pool.cc:254] collecting diagnostics on the listening RPC socket unix:/tmp/dist-test-tasklgpljN/test-tmp/rpc-test-604446fc0d544f5280720320730f94c2.sock every 8 connection(s)
I20260926 21:55:09.724421  1216 acceptor_pool.cc:254] collecting diagnostics on the listening RPC socket unix:/tmp/dist-test-tasklgpljN/test-tmp/rpc-test-604446fc0d544f5280720320730f94c2.sock every 8 connection(s)
I20260926 21:55:09.727795   791 rpc-test.cc:1648] Connecting to unix:/tmp/dist-test-tasklgpljN/test-tmp/rpc-test-604446fc0d544f5280720320730f94c2.sock
I20260926 21:55:09.834404   791 rpc-test-base.h:595] status: Aborted: Sleep RPC to unix:/tmp/dist-test-tasklgpljN/test-tmp/rpc-test-604446fc0d544f5280720320730f94c2.sock is cancelled in state READY, seconds elapsed: 0.000601489
I20260926 21:55:10.049209   791 rpc-test-base.h:595] status: Aborted: Sleep RPC to unix:/tmp/dist-test-tasklgpljN/test-tmp/rpc-test-604446fc0d544f5280720320730f94c2.sock is cancelled in state SENT, seconds elapsed: 0.00113277
I20260926 21:55:10.049667  1218 rpc-test-base.h:222] got call: sleep_micros: 510000
I20260926 21:55:10.259093   791 rpc-test-base.h:595] status: Aborted: Sleep RPC to unix:/tmp/dist-test-tasklgpljN/test-tmp/rpc-test-604446fc0d544f5280720320730f94c2.sock is cancelled in state SENT, seconds elapsed: 0.00110787
I20260926 21:55:10.259442  1217 rpc-test-base.h:222] got call: sleep_micros: 510000
I20260926 21:55:10.467906   791 rpc-test-base.h:595] status: Aborted: Sleep RPC to unix:/tmp/dist-test-tasklgpljN/test-tmp/rpc-test-604446fc0d544f5280720320730f94c2.sock is cancelled in state SENT, seconds elapsed: 0.00127688
W20260926 21:55:10.480813  1219 rpcz_store.cc:267] Call kudu.rpc.GenericCalculatorService.Sleep from unix:<unnamed> (request call id 11) took 12 ms (client timeout 10 ms). Trace:
W20260926 21:55:10.481287  1219 rpcz_store.cc:269] 0926 21:55:10.467957 (+     0us) service_pool.cc:170] Inserting onto call queue
0926 21:55:10.480639 (+ 12682us) service_pool.cc:214] Skipping call since client already timed out
0926 21:55:10.480736 (+    97us) inbound_call.cc:173] Queueing failure response
Metrics: {}
I20260926 21:55:10.481909  1219 rpc-test-base.h:222] got call: sleep_micros: 1500000
W20260926 21:55:10.560395  1218 rpcz_store.cc:267] Call kudu.rpc.GenericCalculatorService.Sleep from unix:<unnamed> (request call id 3) took 511 ms (client timeout 10 ms). Trace:
W20260926 21:55:10.560753  1218 rpcz_store.cc:269] 0926 21:55:10.049404 (+     0us) service_pool.cc:170] Inserting onto call queue
0926 21:55:10.049595 (+   191us) service_pool.cc:227] Handling call
0926 21:55:10.560343 (+510748us) inbound_call.cc:173] Queueing success response
Metrics: {}
W20260926 21:55:10.770133  1217 rpcz_store.cc:267] Call kudu.rpc.GenericCalculatorService.Sleep from unix:<unnamed> (request call id 7) took 511 ms (client timeout 10 ms). Trace:
W20260926 21:55:10.770548  1217 rpcz_store.cc:269] 0926 21:55:10.259206 (+     0us) service_pool.cc:170] Inserting onto call queue
0926 21:55:10.259374 (+   168us) service_pool.cc:227] Handling call
0926 21:55:10.770077 (+510703us) inbound_call.cc:173] Queueing success response
Metrics: {}
I20260926 21:55:11.469957   791 rpc-test-base.h:595] status: Timed out: Sleep RPC to unix:/tmp/dist-test-tasklgpljN/test-tmp/rpc-test-604446fc0d544f5280720320730f94c2.sock timed out after 1.000s (SENT), seconds elapsed: 1.00157
I20260926 21:55:11.472400  1217 rpc-test-base.h:222] got call: sleep_micros: 1500000
W20260926 21:55:11.982699  1219 rpcz_store.cc:267] Call kudu.rpc.GenericCalculatorService.Sleep from unix:<unnamed> (request call id 12) took 1513 ms (client timeout 1000 ms). Trace:
W20260926 21:55:11.983062  1219 rpcz_store.cc:269] 0926 21:55:10.469140 (+     0us) service_pool.cc:170] Inserting onto call queue
0926 21:55:10.481863 (+ 12723us) service_pool.cc:227] Handling call
0926 21:55:11.982533 (+1500670us) inbound_call.cc:173] Queueing success response
Metrics: {}
I20260926 21:55:12.472292   791 rpc-test-base.h:595] status: Timed out: Sleep RPC to unix:/tmp/dist-test-tasklgpljN/test-tmp/rpc-test-604446fc0d544f5280720320730f94c2.sock timed out after 1.000s (SENT), seconds elapsed: 1.00165
W20260926 21:55:12.473968  1212 messenger.cc:357] Unable to handle RPC call: Not implemented: call requires unsupported application feature flags: 99, 1
W20260926 21:55:12.475803  1212 messenger.cc:357] Unable to handle RPC call: Not implemented: call requires unsupported application feature flags: 99, 1
W20260926 21:55:12.712143  1212 connection.cc:196] Error closing socket: Network error: TlsSocket::Close: Broken pipe
W20260926 21:55:12.973060  1217 rpcz_store.cc:267] Call kudu.rpc.GenericCalculatorService.Sleep from unix:<unnamed> (request call id 13) took 1501 ms (client timeout 1000 ms). Trace:
W20260926 21:55:12.973407  1217 rpcz_store.cc:269] 0926 21:55:11.472020 (+     0us) service_pool.cc:170] Inserting onto call queue
0926 21:55:11.472277 (+   257us) service_pool.cc:227] Handling call
0926 21:55:12.973007 (+1500730us) inbound_call.cc:173] Queueing success response
Metrics: {}
W20260926 21:55:12.974131  1212 connection.cc:441] server connection from unix:<unnamed> torn down before Call kudu.rpc.GenericCalculatorService.Sleep from unix:<unnamed> (request call id 13) could send its response
[       OK ] Parameters/TestRpc.TestCancellation/SSL_UnixSocket (3281 ms)
[ RUN      ] Parameters/TestRpc.TestCancellationMultiThreads/SSL_UnixSocket
I20260926 21:55:13.011010  1241 acceptor_pool.cc:254] collecting diagnostics on the listening RPC socket unix:/tmp/dist-test-tasklgpljN/test-tmp/rpc-test-7c8bc0a053414e5f9f23dfbd0a902bcf.sock every 8 connection(s)
I20260926 21:55:13.011893  1242 acceptor_pool.cc:254] collecting diagnostics on the listening RPC socket unix:/tmp/dist-test-tasklgpljN/test-tmp/rpc-test-7c8bc0a053414e5f9f23dfbd0a902bcf.sock every 8 connection(s)
I20260926 21:55:13.015246   791 rpc-test.cc:1808] Connecting to unix:/tmp/dist-test-tasklgpljN/test-tmp/rpc-test-7c8bc0a053414e5f9f23dfbd0a902bcf.sock
I20260926 21:55:13.178555  1255 test_util.cc:268] Using random seed: -483374314
I20260926 21:55:13.180065  1256 test_util.cc:268] Using random seed: -483372672
I20260926 21:55:13.182066  1257 test_util.cc:268] Using random seed: -483370672
I20260926 21:55:13.184062  1258 test_util.cc:268] Using random seed: -483368833
I20260926 21:55:13.185982  1259 test_util.cc:268] Using random seed: -483367010
I20260926 21:55:13.187844  1260 test_util.cc:268] Using random seed: -483365089
I20260926 21:55:13.190997  1261 test_util.cc:268] Using random seed: -483361900
I20260926 21:55:13.192926  1262 test_util.cc:268] Using random seed: -483359953
I20260926 21:55:13.195906  1263 test_util.cc:268] Using random seed: -483357106
I20260926 21:55:13.198761  1264 test_util.cc:268] Using random seed: -483354707
I20260926 21:55:13.199681  1265 test_util.cc:268] Using random seed: -483353218
I20260926 21:55:13.202114  1266 test_util.cc:268] Using random seed: -483350851
I20260926 21:55:13.204438  1267 test_util.cc:268] Using random seed: -483348442
I20260926 21:55:13.212070  1268 test_util.cc:268] Using random seed: -483340858
I20260926 21:55:13.214994  1269 test_util.cc:268] Using random seed: -483337925
I20260926 21:55:13.217337  1270 test_util.cc:268] Using random seed: -483335566
I20260926 21:55:13.219796  1271 test_util.cc:268] Using random seed: -483333118
I20260926 21:55:13.221907  1272 test_util.cc:268] Using random seed: -483330996
I20260926 21:55:13.223913  1273 test_util.cc:268] Using random seed: -483329006
I20260926 21:55:13.226547  1274 test_util.cc:268] Using random seed: -483326319
I20260926 21:55:13.229101  1275 test_util.cc:268] Using random seed: -483323762
I20260926 21:55:13.231923  1276 test_util.cc:268] Using random seed: -483321069
I20260926 21:55:13.234561  1277 test_util.cc:268] Using random seed: -483318462
I20260926 21:55:13.236532  1278 test_util.cc:268] Using random seed: -483316707
I20260926 21:55:13.239086  1279 test_util.cc:268] Using random seed: -483314577
I20260926 21:55:13.240615  1280 test_util.cc:268] Using random seed: -483312231
I20260926 21:55:13.242946  1281 test_util.cc:268] Using random seed: -483309922
I20260926 21:55:13.246477  1282 test_util.cc:268] Using random seed: -483306421
I20260926 21:55:13.249380  1283 test_util.cc:268] Using random seed: -483304383
I20260926 21:55:13.250958  1284 test_util.cc:268] Using random seed: -483301905
W20260926 21:55:35.913434  1238 connection.cc:196] Error closing socket: Network error: TlsSocket::Close: Broken pipe
[       OK ] Parameters/TestRpc.TestCancellationMultiThreads/SSL_UnixSocket (22951 ms)
[ RUN      ] Parameters/TestRpc.TestCallId/SSL_UnixSocket
I20260926 21:55:35.960564  1298 acceptor_pool.cc:254] collecting diagnostics on the listening RPC socket unix:/tmp/dist-test-tasklgpljN/test-tmp/rpc-test-c3958d55ce144689b07c70f904db39af.sock every 8 connection(s)
I20260926 21:55:35.961429  1299 acceptor_pool.cc:254] collecting diagnostics on the listening RPC socket unix:/tmp/dist-test-tasklgpljN/test-tmp/rpc-test-c3958d55ce144689b07c70f904db39af.sock every 8 connection(s)
W20260926 21:55:36.007311  1295 connection.cc:196] Error closing socket: Network error: TlsSocket::Close: Broken pipe
[       OK ] Parameters/TestRpc.TestCallId/SSL_UnixSocket (81 ms)
[----------] 20 tests from Parameters/TestRpc (41795 ms total)

[----------] Global test environment tear-down
[==========] 21 tests from 2 test suites ran. (44930 ms total)
[  PASSED  ] 20 tests.
[  FAILED  ] 1 test, listed below:
[  FAILED  ] Parameters/TestRpc.TestCallWithChainCertAndRootCA/SSL_UnixSocket, where GetParam() = (true, true)

 1 FAILED TEST
I20260926 21:55:36.034524   791 logging.cc:424] LogThrottler /data0/somelongdirectorytoavoidrpathissues/src/kudu/src/kudu/rpc/acceptor_pool.cc:285: suppressed but not reported on 3 messages since previous log ~37 seconds ago