Diagnosed failure
Parameters/TestRpc.TestCallWithChainCertAndChainCA/SSL_UnixSocket: /data0/somelongdirectorytoavoidrpathissues/src/kudu/src/kudu/rpc/rpc-test.cc:270: Failure
Failed
Bad status: Runtime error: could not verify certificate chain (error with cert: subject=CN = localhost, ST = sadfjas, C = AS, emailAddress = sdflkdsajf, O = lskdfjlsad, OU = sldfkja, issuer=C = AS, ST = ASDfkjdhf, L = lskdjf, O = saldfja, OU = skdjf, CN = localhost, emailAddress = sadjflkadsj): : certificate has expired
Google Test trace:
/data0/somelongdirectorytoavoidrpathissues/src/kudu/src/kudu/rpc/rpc-test.cc:267: Connecting to unix:/tmp/dist-test-taskWyM1bl/test-tmp/rpc-test-f440dc84acb1465fbe210576740ed917.sock
I20260929 02:45:51.544037 379 test_util.cc:175] -----------------------------------------------
I20260929 02:45:51.544730 379 test_util.cc:176] Had fatal failures, leaving test files at /tmp/dist-test-taskWyM1bl/test-tmp/rpc-test.6.Parameters_TestRpc.TestCallWithChainCertAndChainCA_SSL_UnixSocket.1790649951147773-379-0
Full log
Note: This is test shard 7 of 8.
[==========] Running 21 tests from 2 test suites.
[----------] Global test environment set-up.
[----------] 20 tests from Parameters/TestRpc
[ RUN ] Parameters/TestRpc.TestMessengerCreateDestroy/SSL_UnixSocket
WARNING: Logging before InitGoogleLogging() is written to STDERR
I20260929 02:45:51.319278 379 rpc-test.cc:169] started messenger TestCreateDestroy
[ OK ] Parameters/TestRpc.TestMessengerCreateDestroy/SSL_UnixSocket (130 ms)
[ RUN ] Parameters/TestRpc.TestNegotiationDeadlock/SSL_UnixSocket
I20260929 02:45:51.371263 399 acceptor_pool.cc:254] collecting diagnostics on the listening RPC socket unix:/tmp/dist-test-taskWyM1bl/test-tmp/rpc-test-f653cc3817094cad9606136d4cab2c0e.sock every 8 connection(s)
I20260929 02:45:51.371651 400 acceptor_pool.cc:254] collecting diagnostics on the listening RPC socket unix:/tmp/dist-test-taskWyM1bl/test-tmp/rpc-test-f653cc3817094cad9606136d4cab2c0e.sock every 8 connection(s)
[ OK ] Parameters/TestRpc.TestNegotiationDeadlock/SSL_UnixSocket (102 ms)
[ RUN ] Parameters/TestRpc.TestCallWithChainCertAndChainCA/SSL_UnixSocket
I20260929 02:45:51.510463 415 acceptor_pool.cc:254] collecting diagnostics on the listening RPC socket unix:/tmp/dist-test-taskWyM1bl/test-tmp/rpc-test-f440dc84acb1465fbe210576740ed917.sock every 8 connection(s)
I20260929 02:45:51.511215 416 acceptor_pool.cc:254] collecting diagnostics on the listening RPC socket unix:/tmp/dist-test-taskWyM1bl/test-tmp/rpc-test-f440dc84acb1465fbe210576740ed917.sock every 8 connection(s)
/data0/somelongdirectorytoavoidrpathissues/src/kudu/src/kudu/rpc/rpc-test.cc:270: Failure
Failed
Bad status: Runtime error: could not verify certificate chain (error with cert: subject=CN = localhost, ST = sadfjas, C = AS, emailAddress = sdflkdsajf, O = lskdfjlsad, OU = sldfkja, issuer=C = AS, ST = ASDfkjdhf, L = lskdjf, O = saldfja, OU = skdjf, CN = localhost, emailAddress = sadjflkadsj): : certificate has expired
Google Test trace:
/data0/somelongdirectorytoavoidrpathissues/src/kudu/src/kudu/rpc/rpc-test.cc:267: Connecting to unix:/tmp/dist-test-taskWyM1bl/test-tmp/rpc-test-f440dc84acb1465fbe210576740ed917.sock
I20260929 02:45:51.544037 379 test_util.cc:175] -----------------------------------------------
I20260929 02:45:51.544730 379 test_util.cc:176] Had fatal failures, leaving test files at /tmp/dist-test-taskWyM1bl/test-tmp/rpc-test.6.Parameters_TestRpc.TestCallWithChainCertAndChainCA_SSL_UnixSocket.1790649951147773-379-0
[ FAILED ] Parameters/TestRpc.TestCallWithChainCertAndChainCA/SSL_UnixSocket, where GetParam() = (true, true) (111 ms)
[ RUN ] Parameters/TestRpc.TestCallWithPasswordProtectedKey/SSL_UnixSocket
I20260929 02:45:51.624493 440 acceptor_pool.cc:254] collecting diagnostics on the listening RPC socket unix:/tmp/dist-test-taskWyM1bl/test-tmp/rpc-test-2fb5dee03102454fb599b65f4756bdaa.sock every 8 connection(s)
I20260929 02:45:51.624907 441 acceptor_pool.cc:254] collecting diagnostics on the listening RPC socket unix:/tmp/dist-test-taskWyM1bl/test-tmp/rpc-test-2fb5dee03102454fb599b65f4756bdaa.sock every 8 connection(s)
[ OK ] Parameters/TestRpc.TestCallWithPasswordProtectedKey/SSL_UnixSocket (184 ms)
[ RUN ] Parameters/TestRpc.TestCallToBadServer/SSL_UnixSocket
I20260929 02:45:51.771512 379 rpc-test.cc:394] Status: Network error: Client connection negotiation failed: client connection to 0.0.0.0:0: connect: Connection refused (error 111)
I20260929 02:45:51.774693 379 rpc-test.cc:394] Status: Network error: Client connection negotiation failed: client connection to 0.0.0.0:0: connect: Connection refused (error 111)
I20260929 02:45:51.776794 379 rpc-test.cc:394] Status: Network error: Client connection negotiation failed: client connection to 0.0.0.0:0: connect: Connection refused (error 111)
I20260929 02:45:51.778621 379 rpc-test.cc:394] Status: Network error: Client connection negotiation failed: client connection to 0.0.0.0:0: connect: Connection refused (error 111)
I20260929 02:45:51.779472 379 rpc-test.cc:394] Status: Network error: Client connection negotiation failed: client connection to 0.0.0.0:0: connect: Connection refused (error 111)
[ OK ] Parameters/TestRpc.TestCallToBadServer/SSL_UnixSocket (54 ms)
[ RUN ] Parameters/TestRpc.TestWrongService/SSL_UnixSocket
I20260929 02:45:51.833710 475 acceptor_pool.cc:254] collecting diagnostics on the listening RPC socket unix:/tmp/dist-test-taskWyM1bl/test-tmp/rpc-test-52d2a3b82d6e42e09acf87282a93ec62.sock every 8 connection(s)
I20260929 02:45:51.834746 476 acceptor_pool.cc:254] collecting diagnostics on the listening RPC socket unix:/tmp/dist-test-taskWyM1bl/test-tmp/rpc-test-52d2a3b82d6e42e09acf87282a93ec62.sock every 8 connection(s)
I20260929 02:45:51.899358 472 messenger.cc:345] service WrongServiceName not registered on TestServer
[ OK ] Parameters/TestRpc.TestWrongService/SSL_UnixSocket (128 ms)
[ RUN ] Parameters/TestRpc.TestConnectionKeepalive/SSL_UnixSocket
I20260929 02:45:51.941883 498 acceptor_pool.cc:254] collecting diagnostics on the listening RPC socket unix:/tmp/dist-test-taskWyM1bl/test-tmp/rpc-test-5d165b13e7ed4bd8a80b7df3cfd4b52c.sock every 8 connection(s)
I20260929 02:45:51.942174 499 acceptor_pool.cc:254] collecting diagnostics on the listening RPC socket unix:/tmp/dist-test-taskWyM1bl/test-tmp/rpc-test-5d165b13e7ed4bd8a80b7df3cfd4b52c.sock every 8 connection(s)
I20260929 02:45:51.943536 379 rpc-test.cc:488] Connecting to unix:/tmp/dist-test-taskWyM1bl/test-tmp/rpc-test-5d165b13e7ed4bd8a80b7df3cfd4b52c.sock
W20260929 02:45:52.421120 511 connection.cc:196] Error closing socket: Network error: TlsSocket::Close: Broken pipe
[ OK ] Parameters/TestRpc.TestConnectionKeepalive/SSL_UnixSocket (1120 ms)
[ RUN ] Parameters/TestRpc.TestClientConnectionMetrics/SSL_UnixSocket
I20260929 02:45:53.076333 523 acceptor_pool.cc:254] collecting diagnostics on the listening RPC socket unix:/tmp/dist-test-taskWyM1bl/test-tmp/rpc-test-8f800abe95054ebaa3ac3ac002fd5cc6.sock every 8 connection(s)
I20260929 02:45:53.077299 524 acceptor_pool.cc:254] collecting diagnostics on the listening RPC socket unix:/tmp/dist-test-taskWyM1bl/test-tmp/rpc-test-8f800abe95054ebaa3ac3ac002fd5cc6.sock every 8 connection(s)
I20260929 02:45:53.080854 379 rpc-test.cc:569] Connecting to unix:/tmp/dist-test-taskWyM1bl/test-tmp/rpc-test-8f800abe95054ebaa3ac3ac002fd5cc6.sock
[ OK ] Parameters/TestRpc.TestClientConnectionMetrics/SSL_UnixSocket (21706 ms)
[ RUN ] Parameters/TestRpc.TestCredentialsPolicy/SSL_UnixSocket
I20260929 02:46:14.750458 546 acceptor_pool.cc:254] collecting diagnostics on the listening RPC socket unix:/tmp/dist-test-taskWyM1bl/test-tmp/rpc-test-5e4f113f4bdf4691b3aa259a0df98e4d.sock every 8 connection(s)
I20260929 02:46:14.750764 547 acceptor_pool.cc:254] collecting diagnostics on the listening RPC socket unix:/tmp/dist-test-taskWyM1bl/test-tmp/rpc-test-5e4f113f4bdf4691b3aa259a0df98e4d.sock every 8 connection(s)
I20260929 02:46:14.751705 379 rpc-test.cc:700] Connecting to unix:/tmp/dist-test-taskWyM1bl/test-tmp/rpc-test-5e4f113f4bdf4691b3aa259a0df98e4d.sock
W20260929 02:46:14.780678 545 connection.cc:196] Error closing socket: Network error: TlsSocket::Close: Broken pipe
W20260929 02:46:14.788833 545 connection.cc:196] Error closing socket: Network error: TlsSocket::Close: Broken pipe
[ OK ] Parameters/TestRpc.TestCredentialsPolicy/SSL_UnixSocket (50 ms)
[ RUN ] Parameters/TestRpc.TestCallLongerThanKeepalive/SSL_UnixSocket
I20260929 02:46:14.820461 571 acceptor_pool.cc:254] collecting diagnostics on the listening RPC socket unix:/tmp/dist-test-taskWyM1bl/test-tmp/rpc-test-b7d6f50f950a4a688c0292b2692a81de.sock every 8 connection(s)
I20260929 02:46:14.820704 572 acceptor_pool.cc:254] collecting diagnostics on the listening RPC socket unix:/tmp/dist-test-taskWyM1bl/test-tmp/rpc-test-b7d6f50f950a4a688c0292b2692a81de.sock every 8 connection(s)
I20260929 02:46:14.839716 575 rpc-test-base.h:222] got call: sleep_micros: 3000000 deferred: true
I20260929 02:46:17.841596 575 rpcz_store.cc:275] Call kudu.rpc.GenericCalculatorService.Sleep from unix:<unnamed> (request call id 0) took 3002 ms. Trace:
I20260929 02:46:17.841794 575 rpcz_store.cc:276] 0929 02:46:14.839567 (+ 0us) service_pool.cc:170] Inserting onto call queue
0929 02:46:14.839646 (+ 79us) service_pool.cc:227] Handling call
0929 02:46:17.841549 (+3001903us) inbound_call.cc:173] Queueing success response
Metrics: {}
[ OK ] Parameters/TestRpc.TestCallLongerThanKeepalive/SSL_UnixSocket (3056 ms)
[ RUN ] Parameters/TestRpc.TestRpcSidecar/SSL_UnixSocket
I20260929 02:46:17.871194 596 acceptor_pool.cc:254] collecting diagnostics on the listening RPC socket unix:/tmp/dist-test-taskWyM1bl/test-tmp/rpc-test-2c2fc99d9cf540d5889764beeef8773d.sock every 8 connection(s)
I20260929 02:46:17.871456 597 acceptor_pool.cc:254] collecting diagnostics on the listening RPC socket unix:/tmp/dist-test-taskWyM1bl/test-tmp/rpc-test-2c2fc99d9cf540d5889764beeef8773d.sock every 8 connection(s)
W20260929 02:46:17.974366 593 connection.cc:196] Error closing socket: Network error: TlsSocket::Close: Broken pipe
[ OK ] Parameters/TestRpc.TestRpcSidecar/SSL_UnixSocket (129 ms)
[ RUN ] Parameters/TestRpc.TestRpcSidecarLimits/SSL_UnixSocket
I20260929 02:46:20.135064 621 acceptor_pool.cc:254] collecting diagnostics on the listening RPC socket unix:/tmp/dist-test-taskWyM1bl/test-tmp/rpc-test-6f5eae88f2f543bebe48705903eb7c5f.sock every 8 connection(s)
I20260929 02:46:20.135421 622 acceptor_pool.cc:254] collecting diagnostics on the listening RPC socket unix:/tmp/dist-test-taskWyM1bl/test-tmp/rpc-test-6f5eae88f2f543bebe48705903eb7c5f.sock every 8 connection(s)
W20260929 02:46:20.151129 379 serialization.cc:72] Serialized kudu.rpc_test.PushStringsRequestPB (2147483654 bytes) is larger than the maximum configured RPC message size (52428800 bytes). Sending anyway, but peer may reject the data.
W20260929 02:46:20.157339 618 connection.cc:535] server connection from unix:<unnamed> recv error: Network error: RPC frame had a length of 2147483714, but we only support messages up to 52428800 bytes long.
W20260929 02:46:20.157485 618 connection.cc:158] shutting down server connection from unix:<unnamed> with pending inbound data: 4/2147483714 bytes received; last active 0 ns ago: status Network error: RPC frame had a length of 2147483714, but we only support messages up to 52428800 bytes long.
W20260929 02:46:20.158012 634 connection.cc:196] Error closing socket: Network error: TlsSocket::Close: Broken pipe
I20260929 02:46:20.205807 646 acceptor_pool.cc:254] collecting diagnostics on the listening RPC socket unix:/tmp/dist-test-taskWyM1bl/test-tmp/rpc-test-6f5eae88f2f543bebe48705903eb7c5f.sock every 8 connection(s)
I20260929 02:46:20.206073 647 acceptor_pool.cc:254] collecting diagnostics on the listening RPC socket unix:/tmp/dist-test-taskWyM1bl/test-tmp/rpc-test-6f5eae88f2f543bebe48705903eb7c5f.sock every 8 connection(s)
W20260929 02:46:26.096846 643 connection.cc:577] server connection from unix:<unnamed>: received bad data: 'Corruption: Invalid packet: message had a length of 2147483710, but we only support messages up to 2147483647 bytes
'
W20260929 02:46:26.097486 659 connection.cc:196] Error closing socket: Network error: TlsSocket::Close: Broken pipe
[ OK ] Parameters/TestRpc.TestRpcSidecarLimits/SSL_UnixSocket (8579 ms)
[ RUN ] Parameters/TestRpc.TestCallTimeoutDoesntAffectNegotiation/SSL_UnixSocket
I20260929 02:46:26.579260 671 acceptor_pool.cc:254] collecting diagnostics on the listening RPC socket unix:/tmp/dist-test-taskWyM1bl/test-tmp/rpc-test-3b2a47fbb45e4fc19d67c69e5f5dc856.sock every 8 connection(s)
I20260929 02:46:26.579535 672 acceptor_pool.cc:254] collecting diagnostics on the listening RPC socket unix:/tmp/dist-test-taskWyM1bl/test-tmp/rpc-test-3b2a47fbb45e4fc19d67c69e5f5dc856.sock every 8 connection(s)
W20260929 02:46:26.591223 667 negotiation.cc:266] Injecting 500ms delay in negotiation
I20260929 02:46:26.641656 379 rpc-test-base.h:595] status: Timed out: connection negotiation to unix:/tmp/dist-test-taskWyM1bl/test-tmp/rpc-test-3b2a47fbb45e4fc19d67c69e5f5dc856.sock for RPC Sleep timed out after 0.050s (ON_OUTBOUND_QUEUE), seconds elapsed: 0.051021
[ OK ] Parameters/TestRpc.TestCallTimeoutDoesntAffectNegotiation/SSL_UnixSocket (544 ms)
[ RUN ] Parameters/TestRpc.TestRpcHandlerLatencyMetric/SSL_UnixSocket
I20260929 02:46:27.129156 696 acceptor_pool.cc:254] collecting diagnostics on the listening RPC socket unix:/tmp/dist-test-taskWyM1bl/test-tmp/rpc-test-30c6ccfe67cf4c5ca4a8a11cf9b7edc8.sock every 8 connection(s)
I20260929 02:46:27.129384 697 acceptor_pool.cc:254] collecting diagnostics on the listening RPC socket unix:/tmp/dist-test-taskWyM1bl/test-tmp/rpc-test-30c6ccfe67cf4c5ca4a8a11cf9b7edc8.sock every 8 connection(s)
I20260929 02:46:27.181052 379 rpc-test.cc:1236] Sleep() min lat: 20606
I20260929 02:46:27.181216 379 rpc-test.cc:1237] Sleep() mean lat: 20606
I20260929 02:46:27.181313 379 rpc-test.cc:1238] Sleep() max lat: 20606
I20260929 02:46:27.181354 379 rpc-test.cc:1239] Sleep() #calls: 1
[ OK ] Parameters/TestRpc.TestRpcHandlerLatencyMetric/SSL_UnixSocket (84 ms)
[ RUN ] Parameters/TestRpc.TimedOutOnResponseMetricServiceQueue/SSL_UnixSocket
I20260929 02:46:27.201264 722 acceptor_pool.cc:254] collecting diagnostics on the listening RPC socket unix:/tmp/dist-test-taskWyM1bl/test-tmp/rpc-test-46f00bdb043344808128bc0ff8811664.sock every 8 connection(s)
I20260929 02:46:27.201493 723 acceptor_pool.cc:254] collecting diagnostics on the listening RPC socket unix:/tmp/dist-test-taskWyM1bl/test-tmp/rpc-test-46f00bdb043344808128bc0ff8811664.sock every 8 connection(s)
W20260929 02:46:27.275285 724 rpcz_store.cc:267] Call kudu.rpc_test.CalculatorService.Sleep from unix:<unnamed> (request call id 2) took 20 ms (client timeout 20 ms). Trace:
W20260929 02:46:27.275547 724 rpcz_store.cc:269] 0929 02:46:27.254833 (+ 0us) service_pool.cc:170] Inserting onto call queue
0929 02:46:27.275228 (+ 20395us) service_pool.cc:214] Skipping call since client already timed out
0929 02:46:27.275268 (+ 40us) inbound_call.cc:173] Queueing failure response
Metrics: {}
W20260929 02:46:27.276700 719 connection.cc:196] Error closing socket: Network error: TlsSocket::Close: Broken pipe
[ OK ] Parameters/TestRpc.TimedOutOnResponseMetricServiceQueue/SSL_UnixSocket (93 ms)
[ RUN ] Parameters/TestRpc.RpcPendingConnectionsMetric/SSL_UnixSocket
I20260929 02:46:27.285742 745 acceptor_pool.cc:254] collecting diagnostics on the listening RPC socket 0.0.0.0:46065 every 8 connection(s)
I20260929 02:46:27.285892 746 acceptor_pool.cc:254] collecting diagnostics on the listening RPC socket 0.0.0.0:46065 every 8 connection(s)
W20260929 02:46:27.296864 741 negotiation.cc:337] Failed RPC negotiation. Trace:
0929 02:46:27.295845 (+ 0us) reactor.cc:625] Submitting negotiation task for server connection from 127.0.0.1:58336 (local address 127.0.0.1:46065)
0929 02:46:27.296085 (+ 240us) server_negotiation.cc:206] Beginning negotiation
0929 02:46:27.296093 (+ 8us) server_negotiation.cc:399] Waiting for connection header
0929 02:46:27.296357 (+ 264us) negotiation.cc:327] Negotiation complete: Network error: Server connection negotiation failed: server connection from 127.0.0.1:58336: BlockingRecv error: recv got EOF from 127.0.0.1:58336 (error 108)
Metrics: {"server-negotiator.queue_time_us":71}
[ OK ] Parameters/TestRpc.RpcPendingConnectionsMetric/SSL_UnixSocket (28 ms)
[ RUN ] Parameters/TestRpc.TestRpcContextClientDeadline/SSL_UnixSocket
I20260929 02:46:27.331722 761 acceptor_pool.cc:254] collecting diagnostics on the listening RPC socket unix:/tmp/dist-test-taskWyM1bl/test-tmp/rpc-test-d27173d1b5c34b7a9bba1b34ba8d7ba2.sock every 8 connection(s)
I20260929 02:46:27.331940 762 acceptor_pool.cc:254] collecting diagnostics on the listening RPC socket unix:/tmp/dist-test-taskWyM1bl/test-tmp/rpc-test-d27173d1b5c34b7a9bba1b34ba8d7ba2.sock every 8 connection(s)
[ OK ] Parameters/TestRpc.TestRpcContextClientDeadline/SSL_UnixSocket (82 ms)
[ RUN ] Parameters/TestRpc.TestApplicationFeatureFlagUnsupportedServer/SSL_UnixSocket
I20260929 02:46:27.422358 786 acceptor_pool.cc:254] collecting diagnostics on the listening RPC socket unix:/tmp/dist-test-taskWyM1bl/test-tmp/rpc-test-5127ed022c3845ac8317f8f0cc768abb.sock every 8 connection(s)
I20260929 02:46:27.422515 787 acceptor_pool.cc:254] collecting diagnostics on the listening RPC socket unix:/tmp/dist-test-taskWyM1bl/test-tmp/rpc-test-5127ed022c3845ac8317f8f0cc768abb.sock every 8 connection(s)
[ OK ] Parameters/TestRpc.TestApplicationFeatureFlagUnsupportedServer/SSL_UnixSocket (51 ms)
[ RUN ] Parameters/TestRpc.TestCancellationAsync/SSL_UnixSocket
I20260929 02:46:27.462237 811 acceptor_pool.cc:254] collecting diagnostics on the listening RPC socket unix:/tmp/dist-test-taskWyM1bl/test-tmp/rpc-test-fba94b21b3e34ce385f0d3559b66ea67.sock every 8 connection(s)
I20260929 02:46:27.462534 812 acceptor_pool.cc:254] collecting diagnostics on the listening RPC socket unix:/tmp/dist-test-taskWyM1bl/test-tmp/rpc-test-fba94b21b3e34ce385f0d3559b66ea67.sock every 8 connection(s)
I20260929 02:46:27.463431 379 rpc-test.cc:1716] Connecting to unix:/tmp/dist-test-taskWyM1bl/test-tmp/rpc-test-fba94b21b3e34ce385f0d3559b66ea67.sock
I20260929 02:46:27.481932 379 test_util.cc:268] Using random seed: 812368185
I20260929 02:46:27.527987 815 rpc-test-base.h:240] got call: sleep_micros: 500 pattern: 4294967295 num_repetitions: 2097152 sidecar_idx: 0
I20260929 02:46:27.555624 814 rpc-test-base.h:240] got call: sleep_micros: 500 pattern: 4294967295 num_repetitions: 2097152 sidecar_idx: 0
I20260929 02:46:27.586515 815 rpc-test-base.h:240] got call: sleep_micros: 500 pattern: 4294967295 num_repetitions: 2097152 sidecar_idx: 0
I20260929 02:46:27.616725 814 rpc-test-base.h:240] got call: sleep_micros: 500 pattern: 4294967295 num_repetitions: 2097152 sidecar_idx: 0
I20260929 02:46:27.645555 815 rpc-test-base.h:240] got call: sleep_micros: 500 pattern: 4294967295 num_repetitions: 2097152 sidecar_idx: 0
I20260929 02:46:27.674494 814 rpc-test-base.h:240] got call: sleep_micros: 500 pattern: 4294967295 num_repetitions: 2097152 sidecar_idx: 0
I20260929 02:46:27.703541 813 rpc-test-base.h:240] got call: sleep_micros: 500 pattern: 4294967295 num_repetitions: 2097152 sidecar_idx: 0
W20260929 02:46:27.705742 808 connection.cc:196] Error closing socket: Network error: TlsSocket::Close: Broken pipe
W20260929 02:46:27.720854 808 connection.cc:441] server connection from unix:<unnamed> torn down before Call kudu.rpc.GenericCalculatorService.SleepWithSidecar from unix:<unnamed> (request call id 8) could send its response
W20260929 02:46:27.736546 808 connection.cc:441] server connection from unix:<unnamed> torn down before Call kudu.rpc.GenericCalculatorService.SleepWithSidecar from unix:<unnamed> (request call id 9) could send its response
[ OK ] Parameters/TestRpc.TestCancellationAsync/SSL_UnixSocket (295 ms)
[ RUN ] Parameters/TestRpc.TestPerformanceBySocketType/SSL_UnixSocket
I20260929 02:46:27.759393 836 acceptor_pool.cc:254] collecting diagnostics on the listening RPC socket unix:/tmp/dist-test-taskWyM1bl/test-tmp/rpc-test-64e2ad18c92247218a89d0029c50ade1.sock every 8 connection(s)
I20260929 02:46:27.759600 837 acceptor_pool.cc:254] collecting diagnostics on the listening RPC socket unix:/tmp/dist-test-taskWyM1bl/test-tmp/rpc-test-64e2ad18c92247218a89d0029c50ade1.sock every 8 connection(s)
I20260929 02:46:27.760474 379 rpc-test.cc:1846] Connecting to unix:/tmp/dist-test-taskWyM1bl/test-tmp/rpc-test-64e2ad18c92247218a89d0029c50ade1.sock
I20260929 02:46:30.936131 379 rpc-test.cc:1859] Sending 1024MB via ssl-enabled unix socket: real 3.168s user 3.088s sys 2.299s
I20260929 02:46:34.148325 379 rpc-test.cc:1859] Sending 1024MB via ssl-enabled unix socket: real 3.212s user 3.079s sys 2.371s
I20260929 02:46:37.441987 379 rpc-test.cc:1859] Sending 1024MB via ssl-enabled unix socket: real 3.294s user 3.261s sys 2.361s
I20260929 02:46:40.579165 379 rpc-test.cc:1859] Sending 1024MB via ssl-enabled unix socket: real 3.137s user 3.101s sys 2.234s
I20260929 02:46:43.914866 379 rpc-test.cc:1859] Sending 1024MB via ssl-enabled unix socket: real 3.336s user 3.353s sys 2.302s
W20260929 02:46:43.916101 833 connection.cc:196] Error closing socket: Network error: TlsSocket::Close: Broken pipe
[ OK ] Parameters/TestRpc.TestPerformanceBySocketType/SSL_UnixSocket (16183 ms)
[----------] 20 tests from Parameters/TestRpc (52722 ms total)
[----------] 1 test from Parameters/TestRpcSocketTxRxQueue
[ RUN ] Parameters/TestRpcSocketTxRxQueue.AcceptorRxQueueSizeMetric/0
I20260929 02:46:43.928445 861 acceptor_pool.cc:254] collecting diagnostics on the listening RPC socket 0.0.0.0:39211 every 1 connection(s)
I20260929 02:46:43.928742 862 acceptor_pool.cc:254] collecting diagnostics on the listening RPC socket 0.0.0.0:39211 every 1 connection(s)
W20260929 02:46:43.930605 857 negotiation.cc:337] Failed RPC negotiation. Trace:
0929 02:46:43.930170 (+ 0us) reactor.cc:625] Submitting negotiation task for server connection from 127.0.0.1:44680 (local address 127.0.0.1:39211)
0929 02:46:43.930374 (+ 204us) server_negotiation.cc:206] Beginning negotiation
0929 02:46:43.930382 (+ 8us) server_negotiation.cc:399] Waiting for connection header
0929 02:46:43.930493 (+ 111us) negotiation.cc:327] Negotiation complete: Network error: Server connection negotiation failed: server connection from 127.0.0.1:44680: BlockingRecv error: recv got EOF from 127.0.0.1:44680 (error 108)
Metrics: {"server-negotiator.queue_time_us":50}
[ OK ] Parameters/TestRpcSocketTxRxQueue.AcceptorRxQueueSizeMetric/0 (11 ms)
[----------] 1 test from Parameters/TestRpcSocketTxRxQueue (11 ms total)
[----------] Global test environment tear-down
[==========] 21 tests from 2 test suites ran. (52734 ms total)
[ PASSED ] 20 tests.
[ FAILED ] 1 test, listed below:
[ FAILED ] Parameters/TestRpc.TestCallWithChainCertAndChainCA/SSL_UnixSocket, where GetParam() = (true, true)
1 FAILED TEST