Parameters/TestRpc.TestCallWithChainCertAndRootCA/SSL_TCP: /data0/somelongdirectorytoavoidrpathissues/src/kudu/src/kudu/rpc/rpc-test.cc:303: Failure
Failed
Bad status: Runtime error: could not verify certificate chain (error with cert: subject=CN = localhost, ST = sadfjas, C = AS, emailAddress = sdflkdsajf, O = lskdfjlsad, OU = sldfkja, issuer=C = AS, ST = ASDfkjdhf, L = lskdjf, O = saldfja, OU = skdjf, CN = localhost, emailAddress = sadjflkadsj): : certificate has expired
Google Test trace:
/data0/somelongdirectorytoavoidrpathissues/src/kudu/src/kudu/rpc/rpc-test.cc:300: Connecting to 0.0.0.0:33821
I20260927 19:37:48.139158 7776 test_util.cc:175] -----------------------------------------------
I20260927 19:37:48.139340 7776 test_util.cc:176] Had fatal failures, leaving test files at /tmp/dist-test-taskZspBqa/test-tmp/rpc-test.1.Parameters_TestRpc.TestCallWithChainCertAndRootCA_SSL_TCP.1790537866636501-7776-0
Note: This is test shard 2 of 8.
[==========] Running 21 tests from 2 test suites.
[----------] Global test environment set-up.
[----------] 1 test from TestRpc
[ RUN ] TestRpc.TestMethodsByName
[ OK ] TestRpc.TestMethodsByName (6 ms)
[----------] 1 test from TestRpc (6 ms total)
[----------] 20 tests from Parameters/TestRpc
[ RUN ] Parameters/TestRpc.TestAcceptorPoolStartStop/SSL_TCP
WARNING: Logging before InitGoogleLogging() is written to STDERR
I20260927 19:37:46.747850 7791 acceptor_pool.cc:254] collecting diagnostics on the listening RPC socket 0.0.0.0:42131 every 8 connection(s)
I20260927 19:37:46.749485 7792 acceptor_pool.cc:254] collecting diagnostics on the listening RPC socket 0.0.0.0:42131 every 8 connection(s)
W20260927 19:37:47.750095 7776 thread.cc:536] Waited for 1000ms trying to join with acceptor (tid 7792)
I20260927 19:37:47.878214 7803 acceptor_pool.cc:254] collecting diagnostics on the listening RPC socket 0.0.0.0:35525 every 8 connection(s)
I20260927 19:37:47.879700 7804 acceptor_pool.cc:254] collecting diagnostics on the listening RPC socket 0.0.0.0:35525 every 8 connection(s)
I20260927 19:37:47.914762 7814 acceptor_pool.cc:254] collecting diagnostics on the listening RPC socket 0.0.0.0:33625 every 8 connection(s)
I20260927 19:37:47.916275 7815 acceptor_pool.cc:254] collecting diagnostics on the listening RPC socket 0.0.0.0:33625 every 8 connection(s)
I20260927 19:37:47.930301 7825 acceptor_pool.cc:254] collecting diagnostics on the listening RPC socket 0.0.0.0:46671 every 8 connection(s)
I20260927 19:37:47.931017 7826 acceptor_pool.cc:254] collecting diagnostics on the listening RPC socket 0.0.0.0:46671 every 8 connection(s)
I20260927 19:37:47.954581 7836 acceptor_pool.cc:254] collecting diagnostics on the listening RPC socket 0.0.0.0:38781 every 8 connection(s)
I20260927 19:37:47.955313 7837 acceptor_pool.cc:254] collecting diagnostics on the listening RPC socket 0.0.0.0:38781 every 8 connection(s)
[ OK ] Parameters/TestRpc.TestAcceptorPoolStartStop/SSL_TCP (1263 ms)
[ RUN ] Parameters/TestRpc.TestCall/SSL_TCP
I20260927 19:37:47.996973 7849 acceptor_pool.cc:254] collecting diagnostics on the listening RPC socket 0.0.0.0:35853 every 8 connection(s)
I20260927 19:37:47.999122 7850 acceptor_pool.cc:254] collecting diagnostics on the listening RPC socket 0.0.0.0:35853 every 8 connection(s)
I20260927 19:37:48.003906 7776 rpc-test.cc:234] Connecting to 0.0.0.0:35853
[ OK ] Parameters/TestRpc.TestCall/SSL_TCP (140 ms)
[ RUN ] Parameters/TestRpc.TestCallWithChainCertAndRootCA/SSL_TCP
I20260927 19:37:48.118224 7874 acceptor_pool.cc:254] collecting diagnostics on the listening RPC socket 0.0.0.0:33821 every 8 connection(s)
I20260927 19:37:48.118961 7875 acceptor_pool.cc:254] collecting diagnostics on the listening RPC socket 0.0.0.0:33821 every 8 connection(s)
/data0/somelongdirectorytoavoidrpathissues/src/kudu/src/kudu/rpc/rpc-test.cc:303: Failure
Failed
Bad status: Runtime error: could not verify certificate chain (error with cert: subject=CN = localhost, ST = sadfjas, C = AS, emailAddress = sdflkdsajf, O = lskdfjlsad, OU = sldfkja, issuer=C = AS, ST = ASDfkjdhf, L = lskdjf, O = saldfja, OU = skdjf, CN = localhost, emailAddress = sadjflkadsj): : certificate has expired
Google Test trace:
/data0/somelongdirectorytoavoidrpathissues/src/kudu/src/kudu/rpc/rpc-test.cc:300: Connecting to 0.0.0.0:33821
I20260927 19:37:48.139158 7776 test_util.cc:175] -----------------------------------------------
I20260927 19:37:48.139340 7776 test_util.cc:176] Had fatal failures, leaving test files at /tmp/dist-test-taskZspBqa/test-tmp/rpc-test.1.Parameters_TestRpc.TestCallWithChainCertAndRootCA_SSL_TCP.1790537866636501-7776-0
[ FAILED ] Parameters/TestRpc.TestCallWithChainCertAndRootCA/SSL_TCP, where GetParam() = (true, false) (39 ms)
[ RUN ] Parameters/TestRpc.TestCallWithBadPasswordProtectedKey/SSL_TCP
[ OK ] Parameters/TestRpc.TestCallWithBadPasswordProtectedKey/SSL_TCP (30 ms)
[ RUN ] Parameters/TestRpc.TestInvalidMethodCall/SSL_TCP
I20260927 19:37:48.191027 7911 acceptor_pool.cc:254] collecting diagnostics on the listening RPC socket 0.0.0.0:43373 every 8 connection(s)
I20260927 19:37:48.191880 7912 acceptor_pool.cc:254] collecting diagnostics on the listening RPC socket 0.0.0.0:43373 every 8 connection(s)
I20260927 19:37:48.195084 7776 rpc-test.cc:406] Connecting to 0.0.0.0:43373
[ OK ] Parameters/TestRpc.TestInvalidMethodCall/SSL_TCP (57 ms)
[ RUN ] Parameters/TestRpc.TestHighFDs/SSL_TCP
I20260927 19:37:48.442974 7936 acceptor_pool.cc:254] collecting diagnostics on the listening RPC socket 0.0.0.0:38425 every 8 connection(s)
I20260927 19:37:48.443686 7937 acceptor_pool.cc:254] collecting diagnostics on the listening RPC socket 0.0.0.0:38425 every 8 connection(s)
[ OK ] Parameters/TestRpc.TestHighFDs/SSL_TCP (290 ms)
[ RUN ] Parameters/TestRpc.TestConnectionAlwaysKeepalive/SSL_TCP
I20260927 19:37:48.538877 7959 acceptor_pool.cc:254] collecting diagnostics on the listening RPC socket 0.0.0.0:41953 every 8 connection(s)
I20260927 19:37:48.539606 7960 acceptor_pool.cc:254] collecting diagnostics on the listening RPC socket 0.0.0.0:41953 every 8 connection(s)
I20260927 19:37:48.542675 7776 rpc-test.cc:532] Connecting to 0.0.0.0:41953
[ OK ] Parameters/TestRpc.TestConnectionAlwaysKeepalive/SSL_TCP (3062 ms)
[ RUN ] Parameters/TestRpc.TestReopenOutboundConnections/SSL_TCP
I20260927 19:37:51.623288 7982 acceptor_pool.cc:254] collecting diagnostics on the listening RPC socket 0.0.0.0:35411 every 8 connection(s)
I20260927 19:37:51.624038 7983 acceptor_pool.cc:254] collecting diagnostics on the listening RPC socket 0.0.0.0:35411 every 8 connection(s)
I20260927 19:37:51.627168 7776 rpc-test.cc:658] Connecting to 0.0.0.0:35411
[ OK ] Parameters/TestRpc.TestReopenOutboundConnections/SSL_TCP (400 ms)
[ RUN ] Parameters/TestRpc.TestConnectionNetworkPlane/SSL_TCP
I20260927 19:37:51.998523 8005 acceptor_pool.cc:254] collecting diagnostics on the listening RPC socket 0.0.0.0:39303 every 8 connection(s)
I20260927 19:37:51.999297 8006 acceptor_pool.cc:254] collecting diagnostics on the listening RPC socket 0.0.0.0:39303 every 8 connection(s)
I20260927 19:37:52.002468 7776 rpc-test.cc:772] Connecting to 0.0.0.0:39303
[ OK ] Parameters/TestRpc.TestConnectionNetworkPlane/SSL_TCP (68 ms)
[ RUN ] Parameters/TestRpc.TestTCPKeepalive/SSL_TCP
I20260927 19:37:52.090664 8030 acceptor_pool.cc:254] collecting diagnostics on the listening RPC socket 0.0.0.0:44427 every 8 connection(s)
I20260927 19:37:52.091419 8031 acceptor_pool.cc:254] collecting diagnostics on the listening RPC socket 0.0.0.0:44427 every 8 connection(s)
I20260927 19:37:52.122738 8034 rpc-test-base.h:222] got call: sleep_micros: 8000000 deferred: true
I20260927 19:38:00.126911 8034 rpcz_store.cc:275] Call kudu.rpc.GenericCalculatorService.Sleep from 127.0.0.1:42174 (request call id 0) took 8004 ms. Trace:
I20260927 19:38:00.127512 8034 rpcz_store.cc:276] 0927 19:37:52.122463 (+ 0us) service_pool.cc:170] Inserting onto call queue
0927 19:37:52.122585 (+ 122us) service_pool.cc:227] Handling call
0927 19:38:00.126686 (+8004101us) inbound_call.cc:173] Queueing success response
Metrics: {}
[ OK ] Parameters/TestRpc.TestTCPKeepalive/SSL_TCP (8090 ms)
[ RUN ] Parameters/TestRpc.TestMaxSmallSidecars/SSL_TCP
I20260927 19:38:00.188231 8056 acceptor_pool.cc:254] collecting diagnostics on the listening RPC socket 0.0.0.0:37367 every 8 connection(s)
I20260927 19:38:00.189148 8057 acceptor_pool.cc:254] collecting diagnostics on the listening RPC socket 0.0.0.0:37367 every 8 connection(s)
[ OK ] Parameters/TestRpc.TestMaxSmallSidecars/SSL_TCP (213 ms)
[ RUN ] Parameters/TestRpc.TestCallTimeout/SSL_TCP
I20260927 19:38:00.380946 8081 acceptor_pool.cc:254] collecting diagnostics on the listening RPC socket 0.0.0.0:46359 every 8 connection(s)
I20260927 19:38:00.381712 8082 acceptor_pool.cc:254] collecting diagnostics on the listening RPC socket 0.0.0.0:46359 every 8 connection(s)
I20260927 19:38:00.406374 7776 rpc-test-base.h:595] status: Timed out: connection negotiation to 0.0.0.0:46359 for RPC Sleep timed out after 0.000s (ON_OUTBOUND_QUEUE), seconds elapsed: 0.00261618
I20260927 19:38:00.414078 8085 rpc-test-base.h:222] got call: sleep_micros: 700000
I20260927 19:38:00.607880 7776 rpc-test-base.h:595] status: Timed out: Sleep RPC to 0.0.0.0:46359 timed out after 0.200s (SENT), seconds elapsed: 0.201167
I20260927 19:38:00.609391 8084 rpc-test-base.h:222] got call: sleep_micros: 2000000
W20260927 19:38:01.114761 8085 rpcz_store.cc:267] Call kudu.rpc.GenericCalculatorService.Sleep from 127.0.0.1:56332 (request call id 1) took 700 ms (client timeout 200 ms). Trace:
W20260927 19:38:01.115185 8085 rpcz_store.cc:269] 0927 19:38:00.413886 (+ 0us) service_pool.cc:170] Inserting onto call queue
0927 19:38:00.414013 (+ 127us) service_pool.cc:227] Handling call
0927 19:38:01.114699 (+700686us) inbound_call.cc:173] Queueing success response
Metrics: {}
I20260927 19:38:02.110574 7776 rpc-test-base.h:595] status: Timed out: Sleep RPC to 0.0.0.0:46359 timed out after 1.500s (SENT), seconds elapsed: 1.50236
W20260927 19:38:02.609943 8084 rpcz_store.cc:267] Call kudu.rpc.GenericCalculatorService.Sleep from 127.0.0.1:56332 (request call id 2) took 2000 ms (client timeout 1500 ms). Trace:
W20260927 19:38:02.610303 8084 rpcz_store.cc:269] 0927 19:38:00.609096 (+ 0us) service_pool.cc:170] Inserting onto call queue
0927 19:38:00.609241 (+ 145us) service_pool.cc:227] Handling call
0927 19:38:02.609886 (+2000645us) inbound_call.cc:173] Queueing success response
Metrics: {}
W20260927 19:38:02.610916 8080 connection.cc:441] server connection from 127.0.0.1:56332 torn down before Call kudu.rpc.GenericCalculatorService.Sleep from 127.0.0.1:56332 (request call id 2) could send its response
[ OK ] Parameters/TestRpc.TestCallTimeout/SSL_TCP (2260 ms)
[ RUN ] Parameters/TestRpc.TestServerShutsDown/SSL_TCP
I20260927 19:38:02.618055 7776 rpc-test.cc:1125] Connecting to 0.0.0.0:34117
W20260927 19:38:02.628420 8098 negotiation.cc:337] Failed RPC negotiation. Trace:
0927 19:38:02.626385 (+ 0us) reactor.cc:625] Submitting negotiation task for client connection to 0.0.0.0:34117 (local address 127.0.0.1:56474)
0927 19:38:02.626929 (+ 544us) negotiation.cc:107] Waiting for socket to connect
0927 19:38:02.626969 (+ 40us) client_negotiation.cc:174] Beginning negotiation
0927 19:38:02.627271 (+ 302us) client_negotiation.cc:252] Sending NEGOTIATE NegotiatePB request
0927 19:38:02.627569 (+ 298us) negotiation.cc:327] Negotiation complete: Network error: Client connection negotiation failed: client connection to 0.0.0.0:34117: BlockingWrite error: write error: Broken pipe (error 32)
Metrics: {"client-negotiator.queue_time_us":118}
[ OK ] Parameters/TestRpc.TestServerShutsDown/SSL_TCP (14 ms)
[ RUN ] Parameters/TestRpc.TimedOutOnResponseMetric/SSL_TCP
I20260927 19:38:02.666500 8115 acceptor_pool.cc:254] collecting diagnostics on the listening RPC socket 0.0.0.0:33971 every 8 connection(s)
I20260927 19:38:02.667225 8116 acceptor_pool.cc:254] collecting diagnostics on the listening RPC socket 0.0.0.0:33971 every 8 connection(s)
W20260927 19:38:02.909446 8119 rpcz_store.cc:267] Call kudu.rpc_test.CalculatorService.Sleep from 127.0.0.1:40504 (request call id 3) took 50 ms (client timeout 25 ms). Trace:
W20260927 19:38:02.909782 8119 rpcz_store.cc:269] 0927 19:38:02.858924 (+ 0us) service_pool.cc:170] Inserting onto call queue
0927 19:38:02.859045 (+ 121us) service_pool.cc:227] Handling call
0927 19:38:02.909382 (+ 50337us) inbound_call.cc:173] Queueing success response
Related trace 'test_child':
Metrics: {"test_sleep_us":50000,"child_traces":[["test_child",{"related_trace_metric":1}]]}
W20260927 19:38:02.968555 8119 rpcz_store.cc:267] Call kudu.rpc_test.CalculatorService.Sleep from 127.0.0.1:40504 (request call id 4) took 50 ms (client timeout 50 ms). Trace:
W20260927 19:38:02.968829 8119 rpcz_store.cc:269] 0927 19:38:02.918049 (+ 0us) service_pool.cc:170] Inserting onto call queue
0927 19:38:02.918162 (+ 113us) service_pool.cc:227] Handling call
0927 19:38:02.968496 (+ 50334us) inbound_call.cc:173] Queueing success response
Related trace 'test_child':
Metrics: {"test_sleep_us":50000,"child_traces":[["test_child",{"related_trace_metric":1}]]}
[ OK ] Parameters/TestRpc.TimedOutOnResponseMetric/SSL_TCP (346 ms)
[ RUN ] Parameters/TestRpc.AcceptorDispatchingTimesMetric/SSL_TCP
I20260927 19:38:02.988891 8140 acceptor_pool.cc:254] collecting diagnostics on the listening RPC socket 0.0.0.0:33263 every 8 connection(s)
I20260927 19:38:02.989550 8141 acceptor_pool.cc:254] collecting diagnostics on the listening RPC socket 0.0.0.0:33263 every 8 connection(s)
W20260927 19:38:02.994992 8136 negotiation.cc:337] Failed RPC negotiation. Trace:
0927 19:38:02.993146 (+ 0us) reactor.cc:625] Submitting negotiation task for server connection from 127.0.0.1:55862 (local address 127.0.0.1:33263)
0927 19:38:02.993686 (+ 540us) server_negotiation.cc:206] Beginning negotiation
0927 19:38:02.993711 (+ 25us) server_negotiation.cc:399] Waiting for connection header
0927 19:38:02.994074 (+ 363us) negotiation.cc:327] Negotiation complete: Network error: Server connection negotiation failed: server connection from 127.0.0.1:55862: BlockingRecv error: recv got EOF from 127.0.0.1:55862 (error 108)
Metrics: {"server-negotiator.queue_time_us":108}
[ OK ] Parameters/TestRpc.AcceptorDispatchingTimesMetric/SSL_TCP (20 ms)
[ RUN ] Parameters/TestRpc.TestRpcCallbackDestroysMessenger/SSL_TCP
[ OK ] Parameters/TestRpc.TestRpcCallbackDestroysMessenger/SSL_TCP (17 ms)
[ RUN ] Parameters/TestRpc.TestApplicationFeatureFlag/SSL_TCP
I20260927 19:38:03.036406 8165 acceptor_pool.cc:254] collecting diagnostics on the listening RPC socket 0.0.0.0:37341 every 8 connection(s)
I20260927 19:38:03.037160 8166 acceptor_pool.cc:254] collecting diagnostics on the listening RPC socket 0.0.0.0:37341 every 8 connection(s)
W20260927 19:38:03.067466 8164 messenger.cc:357] Unable to handle RPC call: Not implemented: call requires unsupported application feature flags: 99
[ OK ] Parameters/TestRpc.TestApplicationFeatureFlag/SSL_TCP (60 ms)
[ RUN ] Parameters/TestRpc.TestCancellation/SSL_TCP
I20260927 19:38:03.091002 8190 acceptor_pool.cc:254] collecting diagnostics on the listening RPC socket 0.0.0.0:42135 every 8 connection(s)
I20260927 19:38:03.091735 8191 acceptor_pool.cc:254] collecting diagnostics on the listening RPC socket 0.0.0.0:42135 every 8 connection(s)
I20260927 19:38:03.094748 7776 rpc-test.cc:1648] Connecting to 0.0.0.0:42135
I20260927 19:38:03.197108 7776 rpc-test-base.h:595] status: Aborted: Sleep RPC to 0.0.0.0:42135 is cancelled in state READY, seconds elapsed: 0.00034802
I20260927 19:38:03.334401 7776 rpc-test-base.h:595] status: Aborted: Sleep RPC to 0.0.0.0:42135 is cancelled in state SENT, seconds elapsed: 0.000879237
I20260927 19:38:03.375079 8193 rpc-test-base.h:222] got call: sleep_micros: 510000
I20260927 19:38:03.490541 7776 rpc-test-base.h:595] status: Aborted: Sleep RPC to 0.0.0.0:42135 is cancelled in state SENT, seconds elapsed: 0.000836101
I20260927 19:38:03.530634 8192 rpc-test-base.h:222] got call: sleep_micros: 510000
I20260927 19:38:03.646741 7776 rpc-test-base.h:595] status: Aborted: Sleep RPC to 0.0.0.0:42135 is cancelled in state SENT, seconds elapsed: 0.000806971
W20260927 19:38:03.685997 8194 rpcz_store.cc:267] Call kudu.rpc.GenericCalculatorService.Sleep from 127.0.0.1:40718 (request call id 11) took 15 ms (client timeout 10 ms). Trace:
W20260927 19:38:03.686311 8194 rpcz_store.cc:269] 0927 19:38:03.670471 (+ 0us) service_pool.cc:170] Inserting onto call queue
0927 19:38:03.685711 (+ 15240us) service_pool.cc:214] Skipping call since client already timed out
0927 19:38:03.685821 (+ 110us) inbound_call.cc:173] Queueing failure response
Metrics: {}
I20260927 19:38:03.686813 8194 rpc-test-base.h:222] got call: sleep_micros: 1500000
W20260927 19:38:03.885752 8193 rpcz_store.cc:267] Call kudu.rpc.GenericCalculatorService.Sleep from 127.0.0.1:40718 (request call id 3) took 511 ms (client timeout 10 ms). Trace:
W20260927 19:38:03.886107 8193 rpcz_store.cc:269] 0927 19:38:03.374800 (+ 0us) service_pool.cc:170] Inserting onto call queue
0927 19:38:03.375006 (+ 206us) service_pool.cc:227] Handling call
0927 19:38:03.885697 (+510691us) inbound_call.cc:173] Queueing success response
Metrics: {}
W20260927 19:38:04.041318 8192 rpcz_store.cc:267] Call kudu.rpc.GenericCalculatorService.Sleep from 127.0.0.1:40718 (request call id 7) took 511 ms (client timeout 10 ms). Trace:
W20260927 19:38:04.041673 8192 rpcz_store.cc:269] 0927 19:38:03.530382 (+ 0us) service_pool.cc:170] Inserting onto call queue
0927 19:38:03.530561 (+ 179us) service_pool.cc:227] Handling call
0927 19:38:04.041255 (+510694us) inbound_call.cc:173] Queueing success response
Metrics: {}
I20260927 19:38:04.648505 7776 rpc-test-base.h:595] status: Timed out: Sleep RPC to 0.0.0.0:42135 timed out after 1.000s (SENT), seconds elapsed: 1.0014
I20260927 19:38:04.649907 8192 rpc-test-base.h:222] got call: sleep_micros: 1500000
W20260927 19:38:05.187357 8194 rpcz_store.cc:267] Call kudu.rpc.GenericCalculatorService.Sleep from 127.0.0.1:40718 (request call id 12) took 1516 ms (client timeout 1000 ms). Trace:
W20260927 19:38:05.187680 8194 rpcz_store.cc:269] 0927 19:38:03.670810 (+ 0us) service_pool.cc:170] Inserting onto call queue
0927 19:38:03.686774 (+ 15964us) service_pool.cc:227] Handling call
0927 19:38:05.187270 (+1500496us) inbound_call.cc:173] Queueing success response
Metrics: {}
I20260927 19:38:05.650058 7776 rpc-test-base.h:595] status: Timed out: Sleep RPC to 0.0.0.0:42135 timed out after 1.000s (SENT), seconds elapsed: 1.00121
W20260927 19:38:05.651403 8187 messenger.cc:357] Unable to handle RPC call: Not implemented: call requires unsupported application feature flags: 99, 1
W20260927 19:38:05.652977 8187 messenger.cc:357] Unable to handle RPC call: Not implemented: call requires unsupported application feature flags: 99, 1
W20260927 19:38:06.150449 8192 rpcz_store.cc:267] Call kudu.rpc.GenericCalculatorService.Sleep from 127.0.0.1:40718 (request call id 13) took 1500 ms (client timeout 1000 ms). Trace:
W20260927 19:38:06.150813 8192 rpcz_store.cc:269] 0927 19:38:04.649660 (+ 0us) service_pool.cc:170] Inserting onto call queue
0927 19:38:04.649861 (+ 201us) service_pool.cc:227] Handling call
0927 19:38:06.150391 (+1500530us) inbound_call.cc:173] Queueing success response
Metrics: {}
W20260927 19:38:06.151414 8187 connection.cc:441] server connection from 127.0.0.1:40718 torn down before Call kudu.rpc.GenericCalculatorService.Sleep from 127.0.0.1:40718 (request call id 13) could send its response
[ OK ] Parameters/TestRpc.TestCancellation/SSL_TCP (3082 ms)
[ RUN ] Parameters/TestRpc.TestCancellationMultiThreads/SSL_TCP
I20260927 19:38:06.211630 8215 acceptor_pool.cc:254] collecting diagnostics on the listening RPC socket 0.0.0.0:44305 every 8 connection(s)
I20260927 19:38:06.212358 8216 acceptor_pool.cc:254] collecting diagnostics on the listening RPC socket 0.0.0.0:44305 every 8 connection(s)
I20260927 19:38:06.215622 7776 rpc-test.cc:1808] Connecting to 0.0.0.0:44305
I20260927 19:38:06.351578 8229 test_util.cc:268] Using random seed: 380387513
I20260927 19:38:06.352944 8230 test_util.cc:268] Using random seed: 380388831
I20260927 19:38:06.354461 8231 test_util.cc:268] Using random seed: 380390401
I20260927 19:38:06.355921 8232 test_util.cc:268] Using random seed: 380391836
I20260927 19:38:06.357676 8233 test_util.cc:268] Using random seed: 380393470
I20260927 19:38:06.359088 8234 test_util.cc:268] Using random seed: 380394894
I20260927 19:38:06.360749 8235 test_util.cc:268] Using random seed: 380396542
I20260927 19:38:06.362288 8236 test_util.cc:268] Using random seed: 380398092
I20260927 19:38:06.364392 8237 test_util.cc:268] Using random seed: 380400178
I20260927 19:38:06.365756 8238 test_util.cc:268] Using random seed: 380401560
I20260927 19:38:06.367358 8239 test_util.cc:268] Using random seed: 380403139
I20260927 19:38:06.368949 8240 test_util.cc:268] Using random seed: 380404725
I20260927 19:38:06.370512 8241 test_util.cc:268] Using random seed: 380406306
I20260927 19:38:06.372249 8242 test_util.cc:268] Using random seed: 380408059
I20260927 19:38:06.373953 8243 test_util.cc:268] Using random seed: 380409756
I20260927 19:38:06.376462 8244 test_util.cc:268] Using random seed: 380412150
I20260927 19:38:06.378216 8245 test_util.cc:268] Using random seed: 380414061
I20260927 19:38:06.379431 8246 test_util.cc:268] Using random seed: 380415279
I20260927 19:38:06.380685 8247 test_util.cc:268] Using random seed: 380416534
I20260927 19:38:06.382114 8248 test_util.cc:268] Using random seed: 380417923
I20260927 19:38:06.383749 8249 test_util.cc:268] Using random seed: 380419511
I20260927 19:38:06.385319 8250 test_util.cc:268] Using random seed: 380421117
I20260927 19:38:06.386957 8251 test_util.cc:268] Using random seed: 380422723
I20260927 19:38:06.389473 8252 test_util.cc:268] Using random seed: 380425265
I20260927 19:38:06.391239 8253 test_util.cc:268] Using random seed: 380426999
I20260927 19:38:06.392894 8254 test_util.cc:268] Using random seed: 380428628
I20260927 19:38:06.394603 8255 test_util.cc:268] Using random seed: 380430381
I20260927 19:38:06.397006 8256 test_util.cc:268] Using random seed: 380432679
I20260927 19:38:06.405695 8257 test_util.cc:268] Using random seed: 380441471
I20260927 19:38:06.407483 8258 test_util.cc:268] Using random seed: 380443248
[ OK ] Parameters/TestRpc.TestCancellationMultiThreads/SSL_TCP (17577 ms)
[ RUN ] Parameters/TestRpc.TestCallId/SSL_TCP
I20260927 19:38:23.761121 8272 acceptor_pool.cc:254] collecting diagnostics on the listening RPC socket 0.0.0.0:40519 every 8 connection(s)
I20260927 19:38:23.761873 8273 acceptor_pool.cc:254] collecting diagnostics on the listening RPC socket 0.0.0.0:40519 every 8 connection(s)
[ OK ] Parameters/TestRpc.TestCallId/SSL_TCP (75 ms)
[----------] 20 tests from Parameters/TestRpc (37115 ms total)
[----------] Global test environment tear-down
[==========] 21 tests from 2 test suites ran. (37122 ms total)
[ PASSED ] 20 tests.
[ FAILED ] 1 test, listed below:
[ FAILED ] Parameters/TestRpc.TestCallWithChainCertAndRootCA/SSL_TCP, where GetParam() = (true, false)
1 FAILED TEST