Diagnosed failure
Parameters/TestRpc.TestCallWithChainCertAndChainCA/SSL_UnixSocket: /data0/somelongdirectorytoavoidrpathissues/src/kudu/src/kudu/rpc/rpc-test.cc:270: Failure
Failed
Bad status: Runtime error: could not verify certificate chain (error with cert: subject=CN = localhost, ST = sadfjas, C = AS, emailAddress = sdflkdsajf, O = lskdfjlsad, OU = sldfkja, issuer=C = AS, ST = ASDfkjdhf, L = lskdjf, O = saldfja, OU = skdjf, CN = localhost, emailAddress = sadjflkadsj): : certificate has expired
Google Test trace:
/data0/somelongdirectorytoavoidrpathissues/src/kudu/src/kudu/rpc/rpc-test.cc:267: Connecting to unix:/tmp/dist-test-taskEDWMwb/test-tmp/rpc-test-bed18a8da65a45fc99d5e41c445a3ee6.sock
I20260926 07:28:36.268239 4673 test_util.cc:175] -----------------------------------------------
I20260926 07:28:36.268363 4673 test_util.cc:176] Had fatal failures, leaving test files at /tmp/dist-test-taskEDWMwb/test-tmp/rpc-test.6.Parameters_TestRpc.TestCallWithChainCertAndChainCA_SSL_UnixSocket.1790407716133556-4673-0
Full log
Note: This is test shard 7 of 8.
[==========] Running 21 tests from 2 test suites.
[----------] Global test environment set-up.
[----------] 20 tests from Parameters/TestRpc
[ RUN ] Parameters/TestRpc.TestMessengerCreateDestroy/SSL_UnixSocket
WARNING: Logging before InitGoogleLogging() is written to STDERR
I20260926 07:28:36.184266 4673 rpc-test.cc:169] started messenger TestCreateDestroy
[ OK ] Parameters/TestRpc.TestMessengerCreateDestroy/SSL_UnixSocket (33 ms)
[ RUN ] Parameters/TestRpc.TestNegotiationDeadlock/SSL_UnixSocket
I20260926 07:28:36.211969 4693 acceptor_pool.cc:254] collecting diagnostics on the listening RPC socket unix:/tmp/dist-test-taskEDWMwb/test-tmp/rpc-test-323fea2bba944db080205c46186767d0.sock every 8 connection(s)
I20260926 07:28:36.212281 4694 acceptor_pool.cc:254] collecting diagnostics on the listening RPC socket unix:/tmp/dist-test-taskEDWMwb/test-tmp/rpc-test-323fea2bba944db080205c46186767d0.sock every 8 connection(s)
[ OK ] Parameters/TestRpc.TestNegotiationDeadlock/SSL_UnixSocket (44 ms)
[ RUN ] Parameters/TestRpc.TestCallWithChainCertAndChainCA/SSL_UnixSocket
I20260926 07:28:36.255842 4709 acceptor_pool.cc:254] collecting diagnostics on the listening RPC socket unix:/tmp/dist-test-taskEDWMwb/test-tmp/rpc-test-bed18a8da65a45fc99d5e41c445a3ee6.sock every 8 connection(s)
I20260926 07:28:36.256182 4710 acceptor_pool.cc:254] collecting diagnostics on the listening RPC socket unix:/tmp/dist-test-taskEDWMwb/test-tmp/rpc-test-bed18a8da65a45fc99d5e41c445a3ee6.sock every 8 connection(s)
/data0/somelongdirectorytoavoidrpathissues/src/kudu/src/kudu/rpc/rpc-test.cc:270: Failure
Failed
Bad status: Runtime error: could not verify certificate chain (error with cert: subject=CN = localhost, ST = sadfjas, C = AS, emailAddress = sdflkdsajf, O = lskdfjlsad, OU = sldfkja, issuer=C = AS, ST = ASDfkjdhf, L = lskdjf, O = saldfja, OU = skdjf, CN = localhost, emailAddress = sadjflkadsj): : certificate has expired
Google Test trace:
/data0/somelongdirectorytoavoidrpathissues/src/kudu/src/kudu/rpc/rpc-test.cc:267: Connecting to unix:/tmp/dist-test-taskEDWMwb/test-tmp/rpc-test-bed18a8da65a45fc99d5e41c445a3ee6.sock
I20260926 07:28:36.268239 4673 test_util.cc:175] -----------------------------------------------
I20260926 07:28:36.268363 4673 test_util.cc:176] Had fatal failures, leaving test files at /tmp/dist-test-taskEDWMwb/test-tmp/rpc-test.6.Parameters_TestRpc.TestCallWithChainCertAndChainCA_SSL_UnixSocket.1790407716133556-4673-0
[ FAILED ] Parameters/TestRpc.TestCallWithChainCertAndChainCA/SSL_UnixSocket, where GetParam() = (true, true) (36 ms)
[ RUN ] Parameters/TestRpc.TestCallWithPasswordProtectedKey/SSL_UnixSocket
I20260926 07:28:36.281622 4734 acceptor_pool.cc:254] collecting diagnostics on the listening RPC socket unix:/tmp/dist-test-taskEDWMwb/test-tmp/rpc-test-b9536492a2c94a6b87e94489fc8a30b7.sock every 8 connection(s)
I20260926 07:28:36.281886 4735 acceptor_pool.cc:254] collecting diagnostics on the listening RPC socket unix:/tmp/dist-test-taskEDWMwb/test-tmp/rpc-test-b9536492a2c94a6b87e94489fc8a30b7.sock every 8 connection(s)
W20260926 07:28:36.313051 4731 connection.cc:196] Error closing socket: Network error: TlsSocket::Close: Broken pipe
[ OK ] Parameters/TestRpc.TestCallWithPasswordProtectedKey/SSL_UnixSocket (48 ms)
[ RUN ] Parameters/TestRpc.TestCallToBadServer/SSL_UnixSocket
I20260926 07:28:36.343847 4673 rpc-test.cc:394] Status: Network error: Client connection negotiation failed: client connection to 0.0.0.0:0: connect: Connection refused (error 111)
I20260926 07:28:36.344648 4673 rpc-test.cc:394] Status: Network error: Client connection negotiation failed: client connection to 0.0.0.0:0: connect: Connection refused (error 111)
I20260926 07:28:36.345309 4673 rpc-test.cc:394] Status: Network error: Client connection negotiation failed: client connection to 0.0.0.0:0: connect: Connection refused (error 111)
I20260926 07:28:36.345956 4673 rpc-test.cc:394] Status: Network error: Client connection negotiation failed: client connection to 0.0.0.0:0: connect: Connection refused (error 111)
I20260926 07:28:36.346550 4673 rpc-test.cc:394] Status: Network error: Client connection negotiation failed: client connection to 0.0.0.0:0: connect: Connection refused (error 111)
[ OK ] Parameters/TestRpc.TestCallToBadServer/SSL_UnixSocket (31 ms)
[ RUN ] Parameters/TestRpc.TestWrongService/SSL_UnixSocket
I20260926 07:28:36.368757 4769 acceptor_pool.cc:254] collecting diagnostics on the listening RPC socket unix:/tmp/dist-test-taskEDWMwb/test-tmp/rpc-test-8e3921cc1abd4f109f31a5f29ca20a2a.sock every 8 connection(s)
I20260926 07:28:36.369014 4770 acceptor_pool.cc:254] collecting diagnostics on the listening RPC socket unix:/tmp/dist-test-taskEDWMwb/test-tmp/rpc-test-8e3921cc1abd4f109f31a5f29ca20a2a.sock every 8 connection(s)
I20260926 07:28:36.407217 4766 messenger.cc:345] service WrongServiceName not registered on TestServer
W20260926 07:28:36.408614 4766 connection.cc:196] Error closing socket: Network error: TlsSocket::Close: Broken pipe
[ OK ] Parameters/TestRpc.TestWrongService/SSL_UnixSocket (64 ms)
[ RUN ] Parameters/TestRpc.TestConnectionKeepalive/SSL_UnixSocket
I20260926 07:28:36.429255 4792 acceptor_pool.cc:254] collecting diagnostics on the listening RPC socket unix:/tmp/dist-test-taskEDWMwb/test-tmp/rpc-test-504292aca4894fd39f40ee8abe5b77a8.sock every 8 connection(s)
I20260926 07:28:36.429502 4793 acceptor_pool.cc:254] collecting diagnostics on the listening RPC socket unix:/tmp/dist-test-taskEDWMwb/test-tmp/rpc-test-504292aca4894fd39f40ee8abe5b77a8.sock every 8 connection(s)
I20260926 07:28:36.430501 4673 rpc-test.cc:488] Connecting to unix:/tmp/dist-test-taskEDWMwb/test-tmp/rpc-test-504292aca4894fd39f40ee8abe5b77a8.sock
W20260926 07:28:36.915315 4805 connection.cc:196] Error closing socket: Network error: TlsSocket::Close: Broken pipe
[ OK ] Parameters/TestRpc.TestConnectionKeepalive/SSL_UnixSocket (1060 ms)
[ RUN ] Parameters/TestRpc.TestClientConnectionMetrics/SSL_UnixSocket
I20260926 07:28:37.498652 4817 acceptor_pool.cc:254] collecting diagnostics on the listening RPC socket unix:/tmp/dist-test-taskEDWMwb/test-tmp/rpc-test-3d74215f11e0459da31f2da1a114b491.sock every 8 connection(s)
I20260926 07:28:37.498906 4818 acceptor_pool.cc:254] collecting diagnostics on the listening RPC socket unix:/tmp/dist-test-taskEDWMwb/test-tmp/rpc-test-3d74215f11e0459da31f2da1a114b491.sock every 8 connection(s)
I20260926 07:28:37.499830 4673 rpc-test.cc:569] Connecting to unix:/tmp/dist-test-taskEDWMwb/test-tmp/rpc-test-3d74215f11e0459da31f2da1a114b491.sock
W20260926 07:28:58.835394 4814 connection.cc:196] Error closing socket: Network error: TlsSocket::Close: Broken pipe
[ OK ] Parameters/TestRpc.TestClientConnectionMetrics/SSL_UnixSocket (21368 ms)
[ RUN ] Parameters/TestRpc.TestCredentialsPolicy/SSL_UnixSocket
I20260926 07:28:58.851964 4840 acceptor_pool.cc:254] collecting diagnostics on the listening RPC socket unix:/tmp/dist-test-taskEDWMwb/test-tmp/rpc-test-22896e726b8245a7b81bddd005b297be.sock every 8 connection(s)
I20260926 07:28:58.852182 4841 acceptor_pool.cc:254] collecting diagnostics on the listening RPC socket unix:/tmp/dist-test-taskEDWMwb/test-tmp/rpc-test-22896e726b8245a7b81bddd005b297be.sock every 8 connection(s)
I20260926 07:28:58.853084 4673 rpc-test.cc:700] Connecting to unix:/tmp/dist-test-taskEDWMwb/test-tmp/rpc-test-22896e726b8245a7b81bddd005b297be.sock
W20260926 07:28:58.877168 4839 connection.cc:196] Error closing socket: Network error: TlsSocket::Close: Broken pipe
[ OK ] Parameters/TestRpc.TestCredentialsPolicy/SSL_UnixSocket (46 ms)
[ RUN ] Parameters/TestRpc.TestCallLongerThanKeepalive/SSL_UnixSocket
I20260926 07:28:58.898943 4865 acceptor_pool.cc:254] collecting diagnostics on the listening RPC socket unix:/tmp/dist-test-taskEDWMwb/test-tmp/rpc-test-a3994c2269ab47b68d43e7d53853cb5c.sock every 8 connection(s)
I20260926 07:28:58.899155 4866 acceptor_pool.cc:254] collecting diagnostics on the listening RPC socket unix:/tmp/dist-test-taskEDWMwb/test-tmp/rpc-test-a3994c2269ab47b68d43e7d53853cb5c.sock every 8 connection(s)
I20260926 07:28:58.918773 4869 rpc-test-base.h:222] got call: sleep_micros: 3000000 deferred: true
I20260926 07:29:01.920500 4869 rpcz_store.cc:275] Call kudu.rpc.GenericCalculatorService.Sleep from unix:<unnamed> (request call id 0) took 3001 ms. Trace:
I20260926 07:29:01.920647 4869 rpcz_store.cc:276] 0926 07:28:58.918669 (+ 0us) service_pool.cc:170] Inserting onto call queue
0926 07:28:58.918728 (+ 59us) service_pool.cc:227] Handling call
0926 07:29:01.920457 (+3001729us) inbound_call.cc:173] Queueing success response
Metrics: {}
[ OK ] Parameters/TestRpc.TestCallLongerThanKeepalive/SSL_UnixSocket (3038 ms)
[ RUN ] Parameters/TestRpc.TestRpcSidecar/SSL_UnixSocket
I20260926 07:29:01.949046 4890 acceptor_pool.cc:254] collecting diagnostics on the listening RPC socket unix:/tmp/dist-test-taskEDWMwb/test-tmp/rpc-test-06b7e588c066472aa5d0d8ff104903ae.sock every 8 connection(s)
I20260926 07:29:01.949273 4891 acceptor_pool.cc:254] collecting diagnostics on the listening RPC socket unix:/tmp/dist-test-taskEDWMwb/test-tmp/rpc-test-06b7e588c066472aa5d0d8ff104903ae.sock every 8 connection(s)
[ OK ] Parameters/TestRpc.TestRpcSidecar/SSL_UnixSocket (117 ms)
[ RUN ] Parameters/TestRpc.TestRpcSidecarLimits/SSL_UnixSocket
I20260926 07:29:04.186714 4915 acceptor_pool.cc:254] collecting diagnostics on the listening RPC socket unix:/tmp/dist-test-taskEDWMwb/test-tmp/rpc-test-af335d4664fd42f68c4c2b5d4929c7c6.sock every 8 connection(s)
I20260926 07:29:04.187026 4916 acceptor_pool.cc:254] collecting diagnostics on the listening RPC socket unix:/tmp/dist-test-taskEDWMwb/test-tmp/rpc-test-af335d4664fd42f68c4c2b5d4929c7c6.sock every 8 connection(s)
W20260926 07:29:04.200848 4673 serialization.cc:72] Serialized kudu.rpc_test.PushStringsRequestPB (2147483654 bytes) is larger than the maximum configured RPC message size (52428800 bytes). Sending anyway, but peer may reject the data.
W20260926 07:29:04.207521 4912 connection.cc:535] server connection from unix:<unnamed> recv error: Network error: RPC frame had a length of 2147483714, but we only support messages up to 52428800 bytes long.
W20260926 07:29:04.207751 4912 connection.cc:158] shutting down server connection from unix:<unnamed> with pending inbound data: 4/2147483714 bytes received; last active 0 ns ago: status Network error: RPC frame had a length of 2147483714, but we only support messages up to 52428800 bytes long.
W20260926 07:29:04.208345 4928 connection.cc:196] Error closing socket: Network error: TlsSocket::Close: Broken pipe
I20260926 07:29:04.253692 4940 acceptor_pool.cc:254] collecting diagnostics on the listening RPC socket unix:/tmp/dist-test-taskEDWMwb/test-tmp/rpc-test-af335d4664fd42f68c4c2b5d4929c7c6.sock every 8 connection(s)
I20260926 07:29:04.254038 4941 acceptor_pool.cc:254] collecting diagnostics on the listening RPC socket unix:/tmp/dist-test-taskEDWMwb/test-tmp/rpc-test-af335d4664fd42f68c4c2b5d4929c7c6.sock every 8 connection(s)
W20260926 07:29:09.937180 4937 connection.cc:577] server connection from unix:<unnamed>: received bad data: 'Corruption: Invalid packet: message had a length of 2147483710, but we only support messages up to 2147483647 bytes
'
W20260926 07:29:09.938019 4953 connection.cc:196] Error closing socket: Network error: TlsSocket::Close: Broken pipe
[ OK ] Parameters/TestRpc.TestRpcSidecarLimits/SSL_UnixSocket (8361 ms)
[ RUN ] Parameters/TestRpc.TestCallTimeoutDoesntAffectNegotiation/SSL_UnixSocket
I20260926 07:29:10.422317 4965 acceptor_pool.cc:254] collecting diagnostics on the listening RPC socket unix:/tmp/dist-test-taskEDWMwb/test-tmp/rpc-test-ba4aac1a00b74af4835d0bae73a606c3.sock every 8 connection(s)
I20260926 07:29:10.422613 4966 acceptor_pool.cc:254] collecting diagnostics on the listening RPC socket unix:/tmp/dist-test-taskEDWMwb/test-tmp/rpc-test-ba4aac1a00b74af4835d0bae73a606c3.sock every 8 connection(s)
W20260926 07:29:10.444150 4961 negotiation.cc:266] Injecting 500ms delay in negotiation
I20260926 07:29:10.494906 4673 rpc-test-base.h:595] status: Timed out: connection negotiation to unix:/tmp/dist-test-taskEDWMwb/test-tmp/rpc-test-ba4aac1a00b74af4835d0bae73a606c3.sock for RPC Sleep timed out after 0.050s (ON_OUTBOUND_QUEUE), seconds elapsed: 0.0513423
[ OK ] Parameters/TestRpc.TestCallTimeoutDoesntAffectNegotiation/SSL_UnixSocket (548 ms)
[ RUN ] Parameters/TestRpc.TestRpcHandlerLatencyMetric/SSL_UnixSocket
I20260926 07:29:10.970182 4990 acceptor_pool.cc:254] collecting diagnostics on the listening RPC socket unix:/tmp/dist-test-taskEDWMwb/test-tmp/rpc-test-00e2ed231ef646f1a97ff5e9be1156d7.sock every 8 connection(s)
I20260926 07:29:10.970424 4991 acceptor_pool.cc:254] collecting diagnostics on the listening RPC socket unix:/tmp/dist-test-taskEDWMwb/test-tmp/rpc-test-00e2ed231ef646f1a97ff5e9be1156d7.sock every 8 connection(s)
I20260926 07:29:11.009826 4673 rpc-test.cc:1236] Sleep() min lat: 20672
I20260926 07:29:11.009927 4673 rpc-test.cc:1237] Sleep() mean lat: 20672
I20260926 07:29:11.009976 4673 rpc-test.cc:1238] Sleep() max lat: 20672
I20260926 07:29:11.009996 4673 rpc-test.cc:1239] Sleep() #calls: 1
[ OK ] Parameters/TestRpc.TestRpcHandlerLatencyMetric/SSL_UnixSocket (60 ms)
[ RUN ] Parameters/TestRpc.TimedOutOnResponseMetricServiceQueue/SSL_UnixSocket
I20260926 07:29:11.027197 5016 acceptor_pool.cc:254] collecting diagnostics on the listening RPC socket unix:/tmp/dist-test-taskEDWMwb/test-tmp/rpc-test-62ad9e5dc04346a5b2e3aeda36cf96e5.sock every 8 connection(s)
I20260926 07:29:11.027433 5017 acceptor_pool.cc:254] collecting diagnostics on the listening RPC socket unix:/tmp/dist-test-taskEDWMwb/test-tmp/rpc-test-62ad9e5dc04346a5b2e3aeda36cf96e5.sock every 8 connection(s)
W20260926 07:29:11.086766 5018 rpcz_store.cc:267] Call kudu.rpc_test.CalculatorService.Sleep from unix:<unnamed> (request call id 2) took 20 ms (client timeout 20 ms). Trace:
W20260926 07:29:11.086962 5018 rpcz_store.cc:269] 0926 07:29:11.066284 (+ 0us) service_pool.cc:170] Inserting onto call queue
0926 07:29:11.086684 (+ 20400us) service_pool.cc:214] Skipping call since client already timed out
0926 07:29:11.086741 (+ 57us) inbound_call.cc:173] Queueing failure response
Metrics: {}
[ OK ] Parameters/TestRpc.TimedOutOnResponseMetricServiceQueue/SSL_UnixSocket (76 ms)
[ RUN ] Parameters/TestRpc.RpcPendingConnectionsMetric/SSL_UnixSocket
I20260926 07:29:11.096508 5039 acceptor_pool.cc:254] collecting diagnostics on the listening RPC socket 0.0.0.0:44637 every 8 connection(s)
I20260926 07:29:11.096755 5040 acceptor_pool.cc:254] collecting diagnostics on the listening RPC socket 0.0.0.0:44637 every 8 connection(s)
W20260926 07:29:11.098914 5035 negotiation.cc:337] Failed RPC negotiation. Trace:
0926 07:29:11.098308 (+ 0us) reactor.cc:625] Submitting negotiation task for server connection from 127.0.0.1:60518 (local address 127.0.0.1:44637)
0926 07:29:11.098482 (+ 174us) server_negotiation.cc:206] Beginning negotiation
0926 07:29:11.098486 (+ 4us) server_negotiation.cc:399] Waiting for connection header
0926 07:29:11.098622 (+ 136us) negotiation.cc:327] Negotiation complete: Network error: Server connection negotiation failed: server connection from 127.0.0.1:60518: BlockingRecv error: recv got EOF from 127.0.0.1:60518 (error 108)
Metrics: {"server-negotiator.queue_time_us":49}
[ OK ] Parameters/TestRpc.RpcPendingConnectionsMetric/SSL_UnixSocket (20 ms)
[ RUN ] Parameters/TestRpc.TestRpcContextClientDeadline/SSL_UnixSocket
I20260926 07:29:11.129228 5055 acceptor_pool.cc:254] collecting diagnostics on the listening RPC socket unix:/tmp/dist-test-taskEDWMwb/test-tmp/rpc-test-e0bbf3ffe6a1497c8c0be3ce88096027.sock every 8 connection(s)
I20260926 07:29:11.129540 5056 acceptor_pool.cc:254] collecting diagnostics on the listening RPC socket unix:/tmp/dist-test-taskEDWMwb/test-tmp/rpc-test-e0bbf3ffe6a1497c8c0be3ce88096027.sock every 8 connection(s)
[ OK ] Parameters/TestRpc.TestRpcContextClientDeadline/SSL_UnixSocket (81 ms)
[ RUN ] Parameters/TestRpc.TestApplicationFeatureFlagUnsupportedServer/SSL_UnixSocket
I20260926 07:29:11.219662 5080 acceptor_pool.cc:254] collecting diagnostics on the listening RPC socket unix:/tmp/dist-test-taskEDWMwb/test-tmp/rpc-test-f81b4f71a21841ecb949a246aea53fae.sock every 8 connection(s)
I20260926 07:29:11.219874 5081 acceptor_pool.cc:254] collecting diagnostics on the listening RPC socket unix:/tmp/dist-test-taskEDWMwb/test-tmp/rpc-test-f81b4f71a21841ecb949a246aea53fae.sock every 8 connection(s)
[ OK ] Parameters/TestRpc.TestApplicationFeatureFlagUnsupportedServer/SSL_UnixSocket (57 ms)
[ RUN ] Parameters/TestRpc.TestCancellationAsync/SSL_UnixSocket
I20260926 07:29:11.269402 5105 acceptor_pool.cc:254] collecting diagnostics on the listening RPC socket unix:/tmp/dist-test-taskEDWMwb/test-tmp/rpc-test-445950a77b0f4c6bae91a6863fbbc295.sock every 8 connection(s)
I20260926 07:29:11.269615 5106 acceptor_pool.cc:254] collecting diagnostics on the listening RPC socket unix:/tmp/dist-test-taskEDWMwb/test-tmp/rpc-test-445950a77b0f4c6bae91a6863fbbc295.sock every 8 connection(s)
I20260926 07:29:11.270529 4673 rpc-test.cc:1716] Connecting to unix:/tmp/dist-test-taskEDWMwb/test-tmp/rpc-test-445950a77b0f4c6bae91a6863fbbc295.sock
I20260926 07:29:11.283238 4673 test_util.cc:268] Using random seed: -905661935
I20260926 07:29:11.327991 5109 rpc-test-base.h:240] got call: sleep_micros: 500 pattern: 4294967295 num_repetitions: 2097152 sidecar_idx: 0
I20260926 07:29:11.355755 5108 rpc-test-base.h:240] got call: sleep_micros: 500 pattern: 4294967295 num_repetitions: 2097152 sidecar_idx: 0
I20260926 07:29:11.387970 5107 rpc-test-base.h:240] got call: sleep_micros: 500 pattern: 4294967295 num_repetitions: 2097152 sidecar_idx: 0
I20260926 07:29:11.420969 5108 rpc-test-base.h:240] got call: sleep_micros: 500 pattern: 4294967295 num_repetitions: 2097152 sidecar_idx: 0
I20260926 07:29:11.454131 5107 rpc-test-base.h:240] got call: sleep_micros: 500 pattern: 4294967295 num_repetitions: 2097152 sidecar_idx: 0
I20260926 07:29:11.489923 5108 rpc-test-base.h:240] got call: sleep_micros: 500 pattern: 4294967295 num_repetitions: 2097152 sidecar_idx: 0
I20260926 07:29:11.524551 5107 rpc-test-base.h:240] got call: sleep_micros: 500 pattern: 4294967295 num_repetitions: 2097152 sidecar_idx: 0
W20260926 07:29:11.526835 5102 connection.cc:196] Error closing socket: Network error: TlsSocket::Close: Broken pipe
W20260926 07:29:11.533310 5102 connection.cc:441] server connection from unix:<unnamed> torn down before Call kudu.rpc.GenericCalculatorService.SleepWithSidecar from unix:<unnamed> (request call id 8) could send its response
W20260926 07:29:11.561141 5102 connection.cc:441] server connection from unix:<unnamed> torn down before Call kudu.rpc.GenericCalculatorService.SleepWithSidecar from unix:<unnamed> (request call id 9) could send its response
[ OK ] Parameters/TestRpc.TestCancellationAsync/SSL_UnixSocket (313 ms)
[ RUN ] Parameters/TestRpc.TestPerformanceBySocketType/SSL_UnixSocket
I20260926 07:29:11.589121 5130 acceptor_pool.cc:254] collecting diagnostics on the listening RPC socket unix:/tmp/dist-test-taskEDWMwb/test-tmp/rpc-test-70fb5f70f1a544f9ac5a1c3a437f9542.sock every 8 connection(s)
I20260926 07:29:11.589362 5131 acceptor_pool.cc:254] collecting diagnostics on the listening RPC socket unix:/tmp/dist-test-taskEDWMwb/test-tmp/rpc-test-70fb5f70f1a544f9ac5a1c3a437f9542.sock every 8 connection(s)
I20260926 07:29:11.590289 4673 rpc-test.cc:1846] Connecting to unix:/tmp/dist-test-taskEDWMwb/test-tmp/rpc-test-70fb5f70f1a544f9ac5a1c3a437f9542.sock
I20260926 07:29:14.695350 4673 rpc-test.cc:1859] Sending 1024MB via ssl-enabled unix socket: real 3.095s user 2.974s sys 2.261s
I20260926 07:29:17.813630 4673 rpc-test.cc:1859] Sending 1024MB via ssl-enabled unix socket: real 3.118s user 3.118s sys 2.163s
I20260926 07:29:20.855124 4673 rpc-test.cc:1859] Sending 1024MB via ssl-enabled unix socket: real 3.041s user 2.826s sys 2.329s
I20260926 07:29:23.972219 4673 rpc-test.cc:1859] Sending 1024MB via ssl-enabled unix socket: real 3.117s user 3.121s sys 2.172s
I20260926 07:29:27.028577 4673 rpc-test.cc:1859] Sending 1024MB via ssl-enabled unix socket: real 3.056s user 2.822s sys 2.350s
W20260926 07:29:27.029601 5127 connection.cc:196] Error closing socket: Network error: TlsSocket::Close: Broken pipe
[ OK ] Parameters/TestRpc.TestPerformanceBySocketType/SSL_UnixSocket (15472 ms)
[----------] 20 tests from Parameters/TestRpc (50883 ms total)
[----------] 1 test from Parameters/TestRpcSocketTxRxQueue
[ RUN ] Parameters/TestRpcSocketTxRxQueue.AcceptorRxQueueSizeMetric/0
I20260926 07:29:27.047725 5155 acceptor_pool.cc:254] collecting diagnostics on the listening RPC socket 0.0.0.0:35447 every 1 connection(s)
I20260926 07:29:27.048002 5156 acceptor_pool.cc:254] collecting diagnostics on the listening RPC socket 0.0.0.0:35447 every 1 connection(s)
W20260926 07:29:27.049788 5151 negotiation.cc:337] Failed RPC negotiation. Trace:
0926 07:29:27.049333 (+ 0us) reactor.cc:625] Submitting negotiation task for server connection from 127.0.0.1:56886 (local address 127.0.0.1:35447)
0926 07:29:27.049479 (+ 146us) server_negotiation.cc:206] Beginning negotiation
0926 07:29:27.049483 (+ 4us) server_negotiation.cc:399] Waiting for connection header
0926 07:29:27.049596 (+ 113us) negotiation.cc:327] Negotiation complete: Network error: Server connection negotiation failed: server connection from 127.0.0.1:56886: BlockingRecv error: recv got EOF from 127.0.0.1:56886 (error 108)
Metrics: {"server-negotiator.queue_time_us":47}
[ OK ] Parameters/TestRpcSocketTxRxQueue.AcceptorRxQueueSizeMetric/0 (16 ms)
[----------] 1 test from Parameters/TestRpcSocketTxRxQueue (16 ms total)
[----------] Global test environment tear-down
[==========] 21 tests from 2 test suites ran. (50900 ms total)
[ PASSED ] 20 tests.
[ FAILED ] 1 test, listed below:
[ FAILED ] Parameters/TestRpc.TestCallWithChainCertAndChainCA/SSL_UnixSocket, where GetParam() = (true, true)
1 FAILED TEST