Diagnosed failure
Parameters/TestRpc.TestCallWithChainCertAndChainCA/SSL_UnixSocket: /data0/somelongdirectorytoavoidrpathissues/src/kudu/src/kudu/rpc/rpc-test.cc:270: Failure
Failed
Bad status: Runtime error: could not verify certificate chain (error with cert: subject=CN = localhost, ST = sadfjas, C = AS, emailAddress = sdflkdsajf, O = lskdfjlsad, OU = sldfkja, issuer=C = AS, ST = ASDfkjdhf, L = lskdjf, O = saldfja, OU = skdjf, CN = localhost, emailAddress = sadjflkadsj): : certificate has expired
Google Test trace:
/data0/somelongdirectorytoavoidrpathissues/src/kudu/src/kudu/rpc/rpc-test.cc:267: Connecting to unix:/tmp/dist-test-task2shO_t/test-tmp/rpc-test-e32c7b1638604ca08c4095c5312d425c.sock
I20260928 11:40:40.165388 390 test_util.cc:175] -----------------------------------------------
I20260928 11:40:40.165548 390 test_util.cc:176] Had fatal failures, leaving test files at /tmp/dist-test-task2shO_t/test-tmp/rpc-test.6.Parameters_TestRpc.TestCallWithChainCertAndChainCA_SSL_UnixSocket.1790595638894411-390-0
Full log
Note: This is test shard 7 of 8.
[==========] Running 21 tests from 2 test suites.
[----------] Global test environment set-up.
[----------] 20 tests from Parameters/TestRpc
[ RUN ] Parameters/TestRpc.TestMessengerCreateDestroy/SSL_UnixSocket
WARNING: Logging before InitGoogleLogging() is written to STDERR
I20260928 11:40:38.982614 390 rpc-test.cc:169] started messenger TestCreateDestroy
[ OK ] Parameters/TestRpc.TestMessengerCreateDestroy/SSL_UnixSocket (1081 ms)
[ RUN ] Parameters/TestRpc.TestNegotiationDeadlock/SSL_UnixSocket
I20260928 11:40:40.062427 412 acceptor_pool.cc:254] collecting diagnostics on the listening RPC socket unix:/tmp/dist-test-task2shO_t/test-tmp/rpc-test-f47497f3c2444d5ea9a06fe70d8bfdc6.sock every 8 connection(s)
I20260928 11:40:40.063565 413 acceptor_pool.cc:254] collecting diagnostics on the listening RPC socket unix:/tmp/dist-test-task2shO_t/test-tmp/rpc-test-f47497f3c2444d5ea9a06fe70d8bfdc6.sock every 8 connection(s)
[ OK ] Parameters/TestRpc.TestNegotiationDeadlock/SSL_UnixSocket (87 ms)
[ RUN ] Parameters/TestRpc.TestCallWithChainCertAndChainCA/SSL_UnixSocket
I20260928 11:40:40.136437 428 acceptor_pool.cc:254] collecting diagnostics on the listening RPC socket unix:/tmp/dist-test-task2shO_t/test-tmp/rpc-test-e32c7b1638604ca08c4095c5312d425c.sock every 8 connection(s)
I20260928 11:40:40.138221 429 acceptor_pool.cc:254] collecting diagnostics on the listening RPC socket unix:/tmp/dist-test-task2shO_t/test-tmp/rpc-test-e32c7b1638604ca08c4095c5312d425c.sock every 8 connection(s)
/data0/somelongdirectorytoavoidrpathissues/src/kudu/src/kudu/rpc/rpc-test.cc:270: Failure
Failed
Bad status: Runtime error: could not verify certificate chain (error with cert: subject=CN = localhost, ST = sadfjas, C = AS, emailAddress = sdflkdsajf, O = lskdfjlsad, OU = sldfkja, issuer=C = AS, ST = ASDfkjdhf, L = lskdjf, O = saldfja, OU = skdjf, CN = localhost, emailAddress = sadjflkadsj): : certificate has expired
Google Test trace:
/data0/somelongdirectorytoavoidrpathissues/src/kudu/src/kudu/rpc/rpc-test.cc:267: Connecting to unix:/tmp/dist-test-task2shO_t/test-tmp/rpc-test-e32c7b1638604ca08c4095c5312d425c.sock
I20260928 11:40:40.165388 390 test_util.cc:175] -----------------------------------------------
I20260928 11:40:40.165548 390 test_util.cc:176] Had fatal failures, leaving test files at /tmp/dist-test-task2shO_t/test-tmp/rpc-test.6.Parameters_TestRpc.TestCallWithChainCertAndChainCA_SSL_UnixSocket.1790595638894411-390-0
[ FAILED ] Parameters/TestRpc.TestCallWithChainCertAndChainCA/SSL_UnixSocket, where GetParam() = (true, true) (51 ms)
[ RUN ] Parameters/TestRpc.TestCallWithPasswordProtectedKey/SSL_UnixSocket
I20260928 11:40:40.192571 453 acceptor_pool.cc:254] collecting diagnostics on the listening RPC socket unix:/tmp/dist-test-task2shO_t/test-tmp/rpc-test-e65d311db6114dc7bbd414b1cbdde0c0.sock every 8 connection(s)
I20260928 11:40:40.193231 454 acceptor_pool.cc:254] collecting diagnostics on the listening RPC socket unix:/tmp/dist-test-task2shO_t/test-tmp/rpc-test-e65d311db6114dc7bbd414b1cbdde0c0.sock every 8 connection(s)
W20260928 11:40:40.231637 450 connection.cc:196] Error closing socket: Network error: TlsSocket::Close: Broken pipe
[ OK ] Parameters/TestRpc.TestCallWithPasswordProtectedKey/SSL_UnixSocket (71 ms)
[ RUN ] Parameters/TestRpc.TestCallToBadServer/SSL_UnixSocket
I20260928 11:40:40.259513 390 rpc-test.cc:394] Status: Network error: Client connection negotiation failed: client connection to 0.0.0.0:0: connect: Connection refused (error 111)
I20260928 11:40:40.260797 390 rpc-test.cc:394] Status: Network error: Client connection negotiation failed: client connection to 0.0.0.0:0: connect: Connection refused (error 111)
I20260928 11:40:40.261969 390 rpc-test.cc:394] Status: Network error: Client connection negotiation failed: client connection to 0.0.0.0:0: connect: Connection refused (error 111)
I20260928 11:40:40.263144 390 rpc-test.cc:394] Status: Network error: Client connection negotiation failed: client connection to 0.0.0.0:0: connect: Connection refused (error 111)
I20260928 11:40:40.264249 390 rpc-test.cc:394] Status: Network error: Client connection negotiation failed: client connection to 0.0.0.0:0: connect: Connection refused (error 111)
[ OK ] Parameters/TestRpc.TestCallToBadServer/SSL_UnixSocket (29 ms)
[ RUN ] Parameters/TestRpc.TestWrongService/SSL_UnixSocket
I20260928 11:40:40.288612 488 acceptor_pool.cc:254] collecting diagnostics on the listening RPC socket unix:/tmp/dist-test-task2shO_t/test-tmp/rpc-test-378c08d74b544e34a06c2d355387834e.sock every 8 connection(s)
I20260928 11:40:40.289402 489 acceptor_pool.cc:254] collecting diagnostics on the listening RPC socket unix:/tmp/dist-test-task2shO_t/test-tmp/rpc-test-378c08d74b544e34a06c2d355387834e.sock every 8 connection(s)
I20260928 11:40:40.332201 485 messenger.cc:345] service WrongServiceName not registered on TestServer
W20260928 11:40:40.335208 485 connection.cc:196] Error closing socket: Network error: TlsSocket::Close: Broken pipe
[ OK ] Parameters/TestRpc.TestWrongService/SSL_UnixSocket (73 ms)
[ RUN ] Parameters/TestRpc.TestConnectionKeepalive/SSL_UnixSocket
I20260928 11:40:40.362628 511 acceptor_pool.cc:254] collecting diagnostics on the listening RPC socket unix:/tmp/dist-test-task2shO_t/test-tmp/rpc-test-85cbb34591dc4ea89a6f55d63a480e52.sock every 8 connection(s)
I20260928 11:40:40.363297 512 acceptor_pool.cc:254] collecting diagnostics on the listening RPC socket unix:/tmp/dist-test-task2shO_t/test-tmp/rpc-test-85cbb34591dc4ea89a6f55d63a480e52.sock every 8 connection(s)
I20260928 11:40:40.366164 390 rpc-test.cc:488] Connecting to unix:/tmp/dist-test-task2shO_t/test-tmp/rpc-test-85cbb34591dc4ea89a6f55d63a480e52.sock
W20260928 11:40:40.843583 524 connection.cc:196] Error closing socket: Network error: TlsSocket::Close: Broken pipe
[ OK ] Parameters/TestRpc.TestConnectionKeepalive/SSL_UnixSocket (1059 ms)
[ RUN ] Parameters/TestRpc.TestClientConnectionMetrics/SSL_UnixSocket
I20260928 11:40:41.428834 536 acceptor_pool.cc:254] collecting diagnostics on the listening RPC socket unix:/tmp/dist-test-task2shO_t/test-tmp/rpc-test-a36375b0f4c945a4911a86a6ed78e2d9.sock every 8 connection(s)
I20260928 11:40:41.429723 537 acceptor_pool.cc:254] collecting diagnostics on the listening RPC socket unix:/tmp/dist-test-task2shO_t/test-tmp/rpc-test-a36375b0f4c945a4911a86a6ed78e2d9.sock every 8 connection(s)
I20260928 11:40:41.433691 390 rpc-test.cc:569] Connecting to unix:/tmp/dist-test-task2shO_t/test-tmp/rpc-test-a36375b0f4c945a4911a86a6ed78e2d9.sock
W20260928 11:42:45.035108 533 connection.cc:196] Error closing socket: Network error: TlsSocket::Close: Broken pipe
[ OK ] Parameters/TestRpc.TestClientConnectionMetrics/SSL_UnixSocket (123642 ms)
[ RUN ] Parameters/TestRpc.TestCredentialsPolicy/SSL_UnixSocket
I20260928 11:42:45.074433 571 acceptor_pool.cc:254] collecting diagnostics on the listening RPC socket unix:/tmp/dist-test-task2shO_t/test-tmp/rpc-test-11c80f3c121d4c08abaf0d1b359809dc.sock every 8 connection(s)
I20260928 11:42:45.075184 572 acceptor_pool.cc:254] collecting diagnostics on the listening RPC socket unix:/tmp/dist-test-task2shO_t/test-tmp/rpc-test-11c80f3c121d4c08abaf0d1b359809dc.sock every 8 connection(s)
I20260928 11:42:45.078042 390 rpc-test.cc:700] Connecting to unix:/tmp/dist-test-task2shO_t/test-tmp/rpc-test-11c80f3c121d4c08abaf0d1b359809dc.sock
W20260928 11:42:45.112911 570 connection.cc:196] Error closing socket: Network error: TlsSocket::Close: Broken pipe
W20260928 11:42:45.125133 570 connection.cc:196] Error closing socket: Network error: TlsSocket::Close: Broken pipe
[ OK ] Parameters/TestRpc.TestCredentialsPolicy/SSL_UnixSocket (89 ms)
[ RUN ] Parameters/TestRpc.TestCallLongerThanKeepalive/SSL_UnixSocket
I20260928 11:42:45.155431 596 acceptor_pool.cc:254] collecting diagnostics on the listening RPC socket unix:/tmp/dist-test-task2shO_t/test-tmp/rpc-test-c13696abb3d74ef3a366a2db9911a5b6.sock every 8 connection(s)
I20260928 11:42:45.156090 597 acceptor_pool.cc:254] collecting diagnostics on the listening RPC socket unix:/tmp/dist-test-task2shO_t/test-tmp/rpc-test-c13696abb3d74ef3a366a2db9911a5b6.sock every 8 connection(s)
I20260928 11:42:45.183547 600 rpc-test-base.h:222] got call: sleep_micros: 3000000 deferred: true
I20260928 11:42:48.187508 600 rpcz_store.cc:275] Call kudu.rpc.GenericCalculatorService.Sleep from unix:<unnamed> (request call id 0) took 3004 ms. Trace:
I20260928 11:42:48.187788 600 rpcz_store.cc:276] 0928 11:42:45.183415 (+ 0us) service_pool.cc:170] Inserting onto call queue
0928 11:42:45.183495 (+ 80us) service_pool.cc:227] Handling call
0928 11:42:48.187464 (+3003969us) inbound_call.cc:173] Queueing success response
Metrics: {}
W20260928 11:42:48.190954 593 connection.cc:196] Error closing socket: Network error: TlsSocket::Close: Broken pipe
[ OK ] Parameters/TestRpc.TestCallLongerThanKeepalive/SSL_UnixSocket (3063 ms)
[ RUN ] Parameters/TestRpc.TestRpcSidecar/SSL_UnixSocket
I20260928 11:42:48.212404 621 acceptor_pool.cc:254] collecting diagnostics on the listening RPC socket unix:/tmp/dist-test-task2shO_t/test-tmp/rpc-test-bb3cf2f6c0b742b0965c7a80085d0264.sock every 8 connection(s)
I20260928 11:42:48.213064 622 acceptor_pool.cc:254] collecting diagnostics on the listening RPC socket unix:/tmp/dist-test-task2shO_t/test-tmp/rpc-test-bb3cf2f6c0b742b0965c7a80085d0264.sock every 8 connection(s)
W20260928 11:42:48.677611 618 connection.cc:196] Error closing socket: Network error: TlsSocket::Close: Broken pipe
[ OK ] Parameters/TestRpc.TestRpcSidecar/SSL_UnixSocket (486 ms)
[ RUN ] Parameters/TestRpc.TestRpcSidecarLimits/SSL_UnixSocket
I20260928 11:43:04.389075 648 acceptor_pool.cc:254] collecting diagnostics on the listening RPC socket unix:/tmp/dist-test-task2shO_t/test-tmp/rpc-test-4ffa2b9aab274f1d9480900242ebc72a.sock every 8 connection(s)
I20260928 11:43:04.389806 649 acceptor_pool.cc:254] collecting diagnostics on the listening RPC socket unix:/tmp/dist-test-task2shO_t/test-tmp/rpc-test-4ffa2b9aab274f1d9480900242ebc72a.sock every 8 connection(s)
W20260928 11:43:04.405041 390 serialization.cc:72] Serialized kudu.rpc_test.PushStringsRequestPB (2147483654 bytes) is larger than the maximum configured RPC message size (52428800 bytes). Sending anyway, but peer may reject the data.
W20260928 11:43:04.413973 645 connection.cc:535] server connection from unix:<unnamed> recv error: Network error: RPC frame had a length of 2147483714, but we only support messages up to 52428800 bytes long.
W20260928 11:43:04.414269 645 connection.cc:158] shutting down server connection from unix:<unnamed> with pending inbound data: 4/2147483714 bytes received; last active 0 ns ago: status Network error: RPC frame had a length of 2147483714, but we only support messages up to 52428800 bytes long.
W20260928 11:43:04.414922 661 connection.cc:698] client connection to unix:/tmp/dist-test-task2shO_t/test-tmp/rpc-test-4ffa2b9aab274f1d9480900242ebc72a.sock send error: Network error: failed to write to TLS socket: Broken pipe
W20260928 11:43:04.415423 661 connection.cc:196] Error closing socket: Network error: TlsSocket::Close: Success
[ OK ] Parameters/TestRpc.TestRpcSidecarLimits/SSL_UnixSocket (16370 ms)
[ RUN ] Parameters/TestRpc.TestCallTimeoutDoesntAffectNegotiation/SSL_UnixSocket
I20260928 11:43:05.080647 673 acceptor_pool.cc:254] collecting diagnostics on the listening RPC socket unix:/tmp/dist-test-task2shO_t/test-tmp/rpc-test-f013faf8cb7f41b5955deb0dac77ea43.sock every 8 connection(s)
I20260928 11:43:05.081292 674 acceptor_pool.cc:254] collecting diagnostics on the listening RPC socket unix:/tmp/dist-test-task2shO_t/test-tmp/rpc-test-f013faf8cb7f41b5955deb0dac77ea43.sock every 8 connection(s)
W20260928 11:43:05.108700 669 negotiation.cc:266] Injecting 500ms delay in negotiation
I20260928 11:43:05.159175 390 rpc-test-base.h:595] status: Timed out: connection negotiation to unix:/tmp/dist-test-task2shO_t/test-tmp/rpc-test-f013faf8cb7f41b5955deb0dac77ea43.sock for RPC Sleep timed out after 0.050s (ON_OUTBOUND_QUEUE), seconds elapsed: 0.0512569
[ OK ] Parameters/TestRpc.TestCallTimeoutDoesntAffectNegotiation/SSL_UnixSocket (570 ms)
[ RUN ] Parameters/TestRpc.TestRpcHandlerLatencyMetric/SSL_UnixSocket
I20260928 11:43:05.647616 698 acceptor_pool.cc:254] collecting diagnostics on the listening RPC socket unix:/tmp/dist-test-task2shO_t/test-tmp/rpc-test-5186cad668fa4dd1bf6445c2f72a7b29.sock every 8 connection(s)
I20260928 11:43:05.648276 699 acceptor_pool.cc:254] collecting diagnostics on the listening RPC socket unix:/tmp/dist-test-task2shO_t/test-tmp/rpc-test-5186cad668fa4dd1bf6445c2f72a7b29.sock every 8 connection(s)
I20260928 11:43:05.697510 390 rpc-test.cc:1236] Sleep() min lat: 21362
I20260928 11:43:05.697687 390 rpc-test.cc:1237] Sleep() mean lat: 21362
I20260928 11:43:05.697808 390 rpc-test.cc:1238] Sleep() max lat: 21362
I20260928 11:43:05.697926 390 rpc-test.cc:1239] Sleep() #calls: 1
[ OK ] Parameters/TestRpc.TestRpcHandlerLatencyMetric/SSL_UnixSocket (80 ms)
[ RUN ] Parameters/TestRpc.TimedOutOnResponseMetricServiceQueue/SSL_UnixSocket
I20260928 11:43:05.729849 724 acceptor_pool.cc:254] collecting diagnostics on the listening RPC socket unix:/tmp/dist-test-task2shO_t/test-tmp/rpc-test-773e478035e24bc29ac3d48970210ef8.sock every 8 connection(s)
I20260928 11:43:05.730556 725 acceptor_pool.cc:254] collecting diagnostics on the listening RPC socket unix:/tmp/dist-test-task2shO_t/test-tmp/rpc-test-773e478035e24bc29ac3d48970210ef8.sock every 8 connection(s)
W20260928 11:43:05.799281 726 rpcz_store.cc:267] Call kudu.rpc_test.CalculatorService.Sleep from unix:<unnamed> (request call id 2) took 20 ms (client timeout 20 ms). Trace:
W20260928 11:43:05.799566 726 rpcz_store.cc:269] 0928 11:43:05.778988 (+ 0us) service_pool.cc:170] Inserting onto call queue
0928 11:43:05.799170 (+ 20182us) service_pool.cc:214] Skipping call since client already timed out
0928 11:43:05.799238 (+ 68us) inbound_call.cc:173] Queueing failure response
Metrics: {}
W20260928 11:43:05.801237 721 connection.cc:196] Error closing socket: Network error: TlsSocket::Close: Broken pipe
[ OK ] Parameters/TestRpc.TimedOutOnResponseMetricServiceQueue/SSL_UnixSocket (100 ms)
[ RUN ] Parameters/TestRpc.RpcPendingConnectionsMetric/SSL_UnixSocket
I20260928 11:43:05.814384 747 acceptor_pool.cc:254] collecting diagnostics on the listening RPC socket 0.0.0.0:41137 every 8 connection(s)
I20260928 11:43:05.815032 748 acceptor_pool.cc:254] collecting diagnostics on the listening RPC socket 0.0.0.0:41137 every 8 connection(s)
W20260928 11:43:05.826967 743 negotiation.cc:337] Failed RPC negotiation. Trace:
0928 11:43:05.825472 (+ 0us) reactor.cc:625] Submitting negotiation task for server connection from 127.0.0.1:55940 (local address 127.0.0.1:41137)
0928 11:43:05.825976 (+ 504us) server_negotiation.cc:206] Beginning negotiation
0928 11:43:05.826001 (+ 25us) server_negotiation.cc:399] Waiting for connection header
0928 11:43:05.826317 (+ 316us) negotiation.cc:327] Negotiation complete: Network error: Server connection negotiation failed: server connection from 127.0.0.1:55940: BlockingRecv error: recv got EOF from 127.0.0.1:55940 (error 108)
Metrics: {"server-negotiator.queue_time_us":124}
[ OK ] Parameters/TestRpc.RpcPendingConnectionsMetric/SSL_UnixSocket (34 ms)
[ RUN ] Parameters/TestRpc.TestRpcContextClientDeadline/SSL_UnixSocket
I20260928 11:43:05.857064 763 acceptor_pool.cc:254] collecting diagnostics on the listening RPC socket unix:/tmp/dist-test-task2shO_t/test-tmp/rpc-test-06aa1cb68c4e405fb382279553549c41.sock every 8 connection(s)
I20260928 11:43:05.857714 764 acceptor_pool.cc:254] collecting diagnostics on the listening RPC socket unix:/tmp/dist-test-task2shO_t/test-tmp/rpc-test-06aa1cb68c4e405fb382279553549c41.sock every 8 connection(s)
[ OK ] Parameters/TestRpc.TestRpcContextClientDeadline/SSL_UnixSocket (78 ms)
[ RUN ] Parameters/TestRpc.TestApplicationFeatureFlagUnsupportedServer/SSL_UnixSocket
I20260928 11:43:05.943934 788 acceptor_pool.cc:254] collecting diagnostics on the listening RPC socket unix:/tmp/dist-test-task2shO_t/test-tmp/rpc-test-4fdc5be9899b493189f24aa6c55a8d43.sock every 8 connection(s)
I20260928 11:43:05.944579 789 acceptor_pool.cc:254] collecting diagnostics on the listening RPC socket unix:/tmp/dist-test-task2shO_t/test-tmp/rpc-test-4fdc5be9899b493189f24aa6c55a8d43.sock every 8 connection(s)
W20260928 11:43:05.973898 785 connection.cc:196] Error closing socket: Network error: TlsSocket::Close: Broken pipe
[ OK ] Parameters/TestRpc.TestApplicationFeatureFlagUnsupportedServer/SSL_UnixSocket (59 ms)
[ RUN ] Parameters/TestRpc.TestCancellationAsync/SSL_UnixSocket
I20260928 11:43:06.012858 813 acceptor_pool.cc:254] collecting diagnostics on the listening RPC socket unix:/tmp/dist-test-task2shO_t/test-tmp/rpc-test-be350715b9d34d24a7759b701c137a3b.sock every 8 connection(s)
I20260928 11:43:06.013525 814 acceptor_pool.cc:254] collecting diagnostics on the listening RPC socket unix:/tmp/dist-test-task2shO_t/test-tmp/rpc-test-be350715b9d34d24a7759b701c137a3b.sock every 8 connection(s)
I20260928 11:43:06.016340 390 rpc-test.cc:1716] Connecting to unix:/tmp/dist-test-task2shO_t/test-tmp/rpc-test-be350715b9d34d24a7759b701c137a3b.sock
I20260928 11:43:06.034677 390 test_util.cc:268] Using random seed: -1849471525
I20260928 11:43:06.247794 817 rpc-test-base.h:240] got call: sleep_micros: 500 pattern: 4294967295 num_repetitions: 2097152 sidecar_idx: 0
I20260928 11:43:06.431744 816 rpc-test-base.h:240] got call: sleep_micros: 500 pattern: 4294967295 num_repetitions: 2097152 sidecar_idx: 0
I20260928 11:43:06.651911 816 rpc-test-base.h:240] got call: sleep_micros: 500 pattern: 4294967295 num_repetitions: 2097152 sidecar_idx: 0
I20260928 11:43:06.854293 816 rpc-test-base.h:240] got call: sleep_micros: 500 pattern: 4294967295 num_repetitions: 2097152 sidecar_idx: 0
I20260928 11:43:07.052227 816 rpc-test-base.h:240] got call: sleep_micros: 500 pattern: 4294967295 num_repetitions: 2097152 sidecar_idx: 0
I20260928 11:43:07.220492 817 rpc-test-base.h:240] got call: sleep_micros: 500 pattern: 4294967295 num_repetitions: 2097152 sidecar_idx: 0
I20260928 11:43:07.418757 816 rpc-test-base.h:240] got call: sleep_micros: 500 pattern: 4294967295 num_repetitions: 2097152 sidecar_idx: 0
I20260928 11:43:07.619310 816 rpc-test-base.h:240] got call: sleep_micros: 500 pattern: 4294967295 num_repetitions: 2097152 sidecar_idx: 0
I20260928 11:43:07.815476 816 rpc-test-base.h:240] got call: sleep_micros: 500 pattern: 4294967295 num_repetitions: 2097152 sidecar_idx: 0
W20260928 11:43:07.837421 810 connection.cc:196] Error closing socket: Network error: TlsSocket::Close: Broken pipe
W20260928 11:43:07.957911 810 connection.cc:441] server connection from unix:<unnamed> torn down before Call kudu.rpc.GenericCalculatorService.SleepWithSidecar from unix:<unnamed> (request call id 9) could send its response
[ OK ] Parameters/TestRpc.TestCancellationAsync/SSL_UnixSocket (1988 ms)
[ RUN ] Parameters/TestRpc.TestPerformanceBySocketType/SSL_UnixSocket
I20260928 11:43:08.052096 838 acceptor_pool.cc:254] collecting diagnostics on the listening RPC socket unix:/tmp/dist-test-task2shO_t/test-tmp/rpc-test-00199f2790d540ef81801ac89e6b74dc.sock every 8 connection(s)
I20260928 11:43:08.052740 839 acceptor_pool.cc:254] collecting diagnostics on the listening RPC socket unix:/tmp/dist-test-task2shO_t/test-tmp/rpc-test-00199f2790d540ef81801ac89e6b74dc.sock every 8 connection(s)
I20260928 11:43:08.055558 390 rpc-test.cc:1846] Connecting to unix:/tmp/dist-test-task2shO_t/test-tmp/rpc-test-00199f2790d540ef81801ac89e6b74dc.sock
I20260928 11:43:27.658553 390 rpc-test.cc:1859] Sending 1024MB via ssl-enabled unix socket: real 19.592s user 17.253s sys 11.919s
I20260928 11:43:47.151504 390 rpc-test.cc:1859] Sending 1024MB via ssl-enabled unix socket: real 19.493s user 17.085s sys 11.890s
I20260928 11:44:06.662345 390 rpc-test.cc:1859] Sending 1024MB via ssl-enabled unix socket: real 19.510s user 17.458s sys 11.539s
I20260928 11:44:26.043092 390 rpc-test.cc:1859] Sending 1024MB via ssl-enabled unix socket: real 19.380s user 17.194s sys 11.563s
I20260928 11:44:45.557673 390 rpc-test.cc:1859] Sending 1024MB via ssl-enabled unix socket: real 19.514s user 17.508s sys 11.543s
W20260928 11:44:45.563139 835 connection.cc:196] Error closing socket: Network error: TlsSocket::Close: Broken pipe
[ OK ] Parameters/TestRpc.TestPerformanceBySocketType/SSL_UnixSocket (97606 ms)
[----------] 20 tests from Parameters/TestRpc (246629 ms total)
[----------] 1 test from Parameters/TestRpcSocketTxRxQueue
[ RUN ] Parameters/TestRpcSocketTxRxQueue.AcceptorRxQueueSizeMetric/0
I20260928 11:44:45.586534 873 acceptor_pool.cc:254] collecting diagnostics on the listening RPC socket 0.0.0.0:35161 every 1 connection(s)
I20260928 11:44:45.587344 874 acceptor_pool.cc:254] collecting diagnostics on the listening RPC socket 0.0.0.0:35161 every 1 connection(s)
W20260928 11:44:45.591890 869 negotiation.cc:337] Failed RPC negotiation. Trace:
0928 11:44:45.590684 (+ 0us) reactor.cc:625] Submitting negotiation task for server connection from 127.0.0.1:47148 (local address 127.0.0.1:35161)
0928 11:44:45.591083 (+ 399us) server_negotiation.cc:206] Beginning negotiation
0928 11:44:45.591105 (+ 22us) server_negotiation.cc:399] Waiting for connection header
0928 11:44:45.591319 (+ 214us) negotiation.cc:327] Negotiation complete: Network error: Server connection negotiation failed: server connection from 127.0.0.1:47148: BlockingRecv error: recv got EOF from 127.0.0.1:47148 (error 108)
Metrics: {"server-negotiator.queue_time_us":87}
[ OK ] Parameters/TestRpcSocketTxRxQueue.AcceptorRxQueueSizeMetric/0 (24 ms)
[----------] 1 test from Parameters/TestRpcSocketTxRxQueue (24 ms total)
[----------] Global test environment tear-down
[==========] 21 tests from 2 test suites ran. (246654 ms total)
[ PASSED ] 20 tests.
[ FAILED ] 1 test, listed below:
[ FAILED ] Parameters/TestRpc.TestCallWithChainCertAndChainCA/SSL_UnixSocket, where GetParam() = (true, true)
1 FAILED TEST