Diagnosed failure

Parameters/TestRpc.TestCallWithChainCertAndChainCA/SSL_TCP: /data0/somelongdirectorytoavoidrpathissues/src/kudu/src/kudu/rpc/rpc-test.cc:270: Failure
Failed
Bad status: Runtime error: could not verify certificate chain (error with cert: subject=CN = localhost, ST = sadfjas, C = AS, emailAddress = sdflkdsajf, O = lskdfjlsad, OU = sldfkja, issuer=C = AS, ST = ASDfkjdhf, L = lskdjf, O = saldfja, OU = skdjf, CN = localhost, emailAddress = sadjflkadsj): : certificate has expired
Google Test trace:
/data0/somelongdirectorytoavoidrpathissues/src/kudu/src/kudu/rpc/rpc-test.cc:267: Connecting to 0.0.0.0:45017
I20260926 04:01:16.914037   383 test_util.cc:175] -----------------------------------------------
I20260926 04:01:16.914111   383 test_util.cc:176] Had fatal failures, leaving test files at /tmp/dist-test-taskE5n9_9/test-tmp/rpc-test.5.Parameters_TestRpc.TestCallWithChainCertAndChainCA_SSL_TCP.1790395276862684-383-0

Full log

Note: This is test shard 6 of 8.
[==========] Running 21 tests from 2 test suites.
[----------] Global test environment set-up.
[----------] 20 tests from Parameters/TestRpc
[ RUN      ] Parameters/TestRpc.TestMessengerCreateDestroy/SSL_TCP
WARNING: Logging before InitGoogleLogging() is written to STDERR
I20260926 04:01:16.881354   383 rpc-test.cc:169] started messenger TestCreateDestroy
[       OK ] Parameters/TestRpc.TestMessengerCreateDestroy/SSL_TCP (17 ms)
[ RUN      ] Parameters/TestRpc.TestNegotiationDeadlock/SSL_TCP
I20260926 04:01:16.887805   403 acceptor_pool.cc:254] collecting diagnostics on the listening RPC socket 0.0.0.0:44499 every 8 connection(s)
I20260926 04:01:16.887822   404 acceptor_pool.cc:254] collecting diagnostics on the listening RPC socket 0.0.0.0:44499 every 8 connection(s)
[       OK ] Parameters/TestRpc.TestNegotiationDeadlock/SSL_TCP (13 ms)
[ RUN      ] Parameters/TestRpc.TestCallWithChainCertAndChainCA/SSL_TCP
I20260926 04:01:16.909909   419 acceptor_pool.cc:254] collecting diagnostics on the listening RPC socket 0.0.0.0:45017 every 8 connection(s)
I20260926 04:01:16.909929   420 acceptor_pool.cc:254] collecting diagnostics on the listening RPC socket 0.0.0.0:45017 every 8 connection(s)
/data0/somelongdirectorytoavoidrpathissues/src/kudu/src/kudu/rpc/rpc-test.cc:270: Failure
Failed
Bad status: Runtime error: could not verify certificate chain (error with cert: subject=CN = localhost, ST = sadfjas, C = AS, emailAddress = sdflkdsajf, O = lskdfjlsad, OU = sldfkja, issuer=C = AS, ST = ASDfkjdhf, L = lskdjf, O = saldfja, OU = skdjf, CN = localhost, emailAddress = sadjflkadsj): : certificate has expired
Google Test trace:
/data0/somelongdirectorytoavoidrpathissues/src/kudu/src/kudu/rpc/rpc-test.cc:267: Connecting to 0.0.0.0:45017
I20260926 04:01:16.914037   383 test_util.cc:175] -----------------------------------------------
I20260926 04:01:16.914111   383 test_util.cc:176] Had fatal failures, leaving test files at /tmp/dist-test-taskE5n9_9/test-tmp/rpc-test.5.Parameters_TestRpc.TestCallWithChainCertAndChainCA_SSL_TCP.1790395276862684-383-0
[  FAILED  ] Parameters/TestRpc.TestCallWithChainCertAndChainCA/SSL_TCP, where GetParam() = (true, false) (18 ms)
[ RUN      ] Parameters/TestRpc.TestCallWithPasswordProtectedKey/SSL_TCP
I20260926 04:01:16.926422   444 acceptor_pool.cc:254] collecting diagnostics on the listening RPC socket 0.0.0.0:46419 every 8 connection(s)
I20260926 04:01:16.926453   445 acceptor_pool.cc:254] collecting diagnostics on the listening RPC socket 0.0.0.0:46419 every 8 connection(s)
[       OK ] Parameters/TestRpc.TestCallWithPasswordProtectedKey/SSL_TCP (27 ms)
[ RUN      ] Parameters/TestRpc.TestCallToBadServer/SSL_TCP
I20260926 04:01:16.956125   383 rpc-test.cc:394] Status: Network error: Client connection negotiation failed: client connection to 0.0.0.0:0: connect: Connection refused (error 111)
I20260926 04:01:16.956454   383 rpc-test.cc:394] Status: Network error: Client connection negotiation failed: client connection to 0.0.0.0:0: connect: Connection refused (error 111)
I20260926 04:01:16.956696   383 rpc-test.cc:394] Status: Network error: Client connection negotiation failed: client connection to 0.0.0.0:0: connect: Connection refused (error 111)
I20260926 04:01:16.956918   383 rpc-test.cc:394] Status: Network error: Client connection negotiation failed: client connection to 0.0.0.0:0: connect: Connection refused (error 111)
I20260926 04:01:16.957141   383 rpc-test.cc:394] Status: Network error: Client connection negotiation failed: client connection to 0.0.0.0:0: connect: Connection refused (error 111)
[       OK ] Parameters/TestRpc.TestCallToBadServer/SSL_TCP (15 ms)
[ RUN      ] Parameters/TestRpc.TestWrongService/SSL_TCP
I20260926 04:01:16.972482   479 acceptor_pool.cc:254] collecting diagnostics on the listening RPC socket 0.0.0.0:46291 every 8 connection(s)
I20260926 04:01:16.972519   480 acceptor_pool.cc:254] collecting diagnostics on the listening RPC socket 0.0.0.0:46291 every 8 connection(s)
I20260926 04:01:16.990543   476 messenger.cc:345] service WrongServiceName not registered on TestServer
[       OK ] Parameters/TestRpc.TestWrongService/SSL_TCP (34 ms)
[ RUN      ] Parameters/TestRpc.TestConnectionKeepalive/SSL_TCP
I20260926 04:01:17.006516   502 acceptor_pool.cc:254] collecting diagnostics on the listening RPC socket 0.0.0.0:37125 every 8 connection(s)
I20260926 04:01:17.006563   503 acceptor_pool.cc:254] collecting diagnostics on the listening RPC socket 0.0.0.0:37125 every 8 connection(s)
I20260926 04:01:17.006736   383 rpc-test.cc:488] Connecting to 0.0.0.0:37125
[       OK ] Parameters/TestRpc.TestConnectionKeepalive/SSL_TCP (1046 ms)
[ RUN      ] Parameters/TestRpc.TestClientConnectionMetrics/SSL_TCP
I20260926 04:01:18.065271   527 acceptor_pool.cc:254] collecting diagnostics on the listening RPC socket 0.0.0.0:41863 every 8 connection(s)
I20260926 04:01:18.065290   528 acceptor_pool.cc:254] collecting diagnostics on the listening RPC socket 0.0.0.0:41863 every 8 connection(s)
I20260926 04:01:18.065428   383 rpc-test.cc:569] Connecting to 0.0.0.0:41863
[       OK ] Parameters/TestRpc.TestClientConnectionMetrics/SSL_TCP (8840 ms)
[ RUN      ] Parameters/TestRpc.TestCredentialsPolicy/SSL_TCP
I20260926 04:01:26.899716   550 acceptor_pool.cc:254] collecting diagnostics on the listening RPC socket 0.0.0.0:41711 every 8 connection(s)
I20260926 04:01:26.899751   551 acceptor_pool.cc:254] collecting diagnostics on the listening RPC socket 0.0.0.0:41711 every 8 connection(s)
I20260926 04:01:26.899885   383 rpc-test.cc:700] Connecting to 0.0.0.0:41711
[       OK ] Parameters/TestRpc.TestCredentialsPolicy/SSL_TCP (59 ms)
[ RUN      ] Parameters/TestRpc.TestCallLongerThanKeepalive/SSL_TCP
I20260926 04:01:26.947618   575 acceptor_pool.cc:254] collecting diagnostics on the listening RPC socket 0.0.0.0:34875 every 8 connection(s)
I20260926 04:01:26.947665   576 acceptor_pool.cc:254] collecting diagnostics on the listening RPC socket 0.0.0.0:34875 every 8 connection(s)
I20260926 04:01:26.964541   579 rpc-test-base.h:222] got call: sleep_micros: 3000000 deferred: true
I20260926 04:01:29.965227   579 rpcz_store.cc:275] Call kudu.rpc.GenericCalculatorService.Sleep from 127.0.0.1:50556 (request call id 0) took 3000 ms. Trace:
I20260926 04:01:29.965334   579 rpcz_store.cc:276] 0926 04:01:26.964493 (+     0us) service_pool.cc:170] Inserting onto call queue
0926 04:01:26.964526 (+    33us) service_pool.cc:227] Handling call
0926 04:01:29.965211 (+3000685us) inbound_call.cc:173] Queueing success response
Metrics: {}
[       OK ] Parameters/TestRpc.TestCallLongerThanKeepalive/SSL_TCP (3029 ms)
[ RUN      ] Parameters/TestRpc.TestRpcSidecar/SSL_TCP
I20260926 04:01:29.978417   600 acceptor_pool.cc:254] collecting diagnostics on the listening RPC socket 0.0.0.0:40353 every 8 connection(s)
I20260926 04:01:29.978520   601 acceptor_pool.cc:254] collecting diagnostics on the listening RPC socket 0.0.0.0:40353 every 8 connection(s)
[       OK ] Parameters/TestRpc.TestRpcSidecar/SSL_TCP (57 ms)
[ RUN      ] Parameters/TestRpc.TestRpcSidecarLimits/SSL_TCP
I20260926 04:01:31.778245   625 acceptor_pool.cc:254] collecting diagnostics on the listening RPC socket 0.0.0.0:42541 every 8 connection(s)
I20260926 04:01:31.778301   626 acceptor_pool.cc:254] collecting diagnostics on the listening RPC socket 0.0.0.0:42541 every 8 connection(s)
W20260926 04:01:31.795228   383 serialization.cc:72] Serialized kudu.rpc_test.PushStringsRequestPB (2147483654 bytes) is larger than the maximum configured RPC message size (52428800 bytes). Sending anyway, but peer may reject the data.
W20260926 04:01:31.798734   624 connection.cc:535] server connection from 127.0.0.1:58264 recv error: Network error: RPC frame had a length of 2147483714, but we only support messages up to 52428800 bytes long.
W20260926 04:01:31.798816   624 connection.cc:158] shutting down server connection from 127.0.0.1:58264 with pending inbound data: 4/2147483714 bytes received; last active 0 ns ago: status Network error: RPC frame had a length of 2147483714, but we only support messages up to 52428800 bytes long.
W20260926 04:01:31.799042   638 connection.cc:196] Error closing socket: Network error: TlsSocket::Close: Connection reset by peer
I20260926 04:01:31.820812   650 acceptor_pool.cc:254] collecting diagnostics on the listening RPC socket 0.0.0.0:36761 every 8 connection(s)
I20260926 04:01:31.820822   651 acceptor_pool.cc:254] collecting diagnostics on the listening RPC socket 0.0.0.0:36761 every 8 connection(s)
W20260926 04:01:40.999078   649 connection.cc:577] server connection from 127.0.0.1:36752: received bad data: 'Corruption: Invalid packet: message had a length of 2147483710, but we only support messages up to 2147483647 bytes
'
[       OK ] Parameters/TestRpc.TestRpcSidecarLimits/SSL_TCP (10976 ms)
[ RUN      ] Parameters/TestRpc.TestCallTimeoutDoesntAffectNegotiation/SSL_TCP
I20260926 04:01:41.031052   675 acceptor_pool.cc:254] collecting diagnostics on the listening RPC socket 0.0.0.0:42657 every 8 connection(s)
I20260926 04:01:41.031083   676 acceptor_pool.cc:254] collecting diagnostics on the listening RPC socket 0.0.0.0:42657 every 8 connection(s)
W20260926 04:01:41.042814   671 negotiation.cc:266] Injecting 500ms delay in negotiation
I20260926 04:01:41.093093   383 rpc-test-base.h:595] status: Timed out: connection negotiation to 0.0.0.0:42657 for RPC Sleep timed out after 0.050s (ON_OUTBOUND_QUEUE), seconds elapsed: 0.0507034
[       OK ] Parameters/TestRpc.TestCallTimeoutDoesntAffectNegotiation/SSL_TCP (545 ms)
[ RUN      ] Parameters/TestRpc.TestRpcHandlerLatencyMetric/SSL_TCP
I20260926 04:01:41.569412   700 acceptor_pool.cc:254] collecting diagnostics on the listening RPC socket 0.0.0.0:37205 every 8 connection(s)
I20260926 04:01:41.569451   701 acceptor_pool.cc:254] collecting diagnostics on the listening RPC socket 0.0.0.0:37205 every 8 connection(s)
I20260926 04:01:41.600360   383 rpc-test.cc:1236] Sleep() min lat: 20295
I20260926 04:01:41.600426   383 rpc-test.cc:1237] Sleep() mean lat: 20295
I20260926 04:01:41.600452   383 rpc-test.cc:1238] Sleep() max lat: 20295
I20260926 04:01:41.600466   383 rpc-test.cc:1239] Sleep() #calls: 1
[       OK ] Parameters/TestRpc.TestRpcHandlerLatencyMetric/SSL_TCP (54 ms)
[ RUN      ] Parameters/TestRpc.TimedOutOnResponseMetricServiceQueue/SSL_TCP
I20260926 04:01:41.623937   726 acceptor_pool.cc:254] collecting diagnostics on the listening RPC socket 0.0.0.0:33309 every 8 connection(s)
I20260926 04:01:41.623975   727 acceptor_pool.cc:254] collecting diagnostics on the listening RPC socket 0.0.0.0:33309 every 8 connection(s)
W20260926 04:01:41.687532   728 rpcz_store.cc:267] Call kudu.rpc_test.CalculatorService.Sleep from 127.0.0.1:51600 (request call id 2) took 20 ms (client timeout 20 ms). Trace:
W20260926 04:01:41.687645   728 rpcz_store.cc:269] 0926 04:01:41.667278 (+     0us) service_pool.cc:170] Inserting onto call queue
0926 04:01:41.687511 (+ 20233us) service_pool.cc:214] Skipping call since client already timed out
0926 04:01:41.687519 (+     8us) inbound_call.cc:173] Queueing failure response
Metrics: {}
[       OK ] Parameters/TestRpc.TimedOutOnResponseMetricServiceQueue/SSL_TCP (87 ms)
[ RUN      ] Parameters/TestRpc.RpcPendingConnectionsMetric/SSL_TCP
I20260926 04:01:41.691087   749 acceptor_pool.cc:254] collecting diagnostics on the listening RPC socket 0.0.0.0:40153 every 8 connection(s)
I20260926 04:01:41.691149   750 acceptor_pool.cc:254] collecting diagnostics on the listening RPC socket 0.0.0.0:40153 every 8 connection(s)
W20260926 04:01:41.700721   745 negotiation.cc:337] Failed RPC negotiation. Trace:
0926 04:01:41.700534 (+     0us) reactor.cc:625] Submitting negotiation task for server connection from 127.0.0.1:53880 (local address 127.0.0.1:40153)
0926 04:01:41.700583 (+    49us) server_negotiation.cc:206] Beginning negotiation
0926 04:01:41.700585 (+     2us) server_negotiation.cc:399] Waiting for connection header
0926 04:01:41.700660 (+    75us) negotiation.cc:327] Negotiation complete: Network error: Server connection negotiation failed: server connection from 127.0.0.1:53880: BlockingRecv error: recv got EOF from 127.0.0.1:53880 (error 108)
Metrics: {"server-negotiator.queue_time_us":19}
[       OK ] Parameters/TestRpc.RpcPendingConnectionsMetric/SSL_TCP (22 ms)
[ RUN      ] Parameters/TestRpc.TestRpcContextClientDeadline/SSL_TCP
I20260926 04:01:41.721069   765 acceptor_pool.cc:254] collecting diagnostics on the listening RPC socket 0.0.0.0:41323 every 8 connection(s)
I20260926 04:01:41.721117   766 acceptor_pool.cc:254] collecting diagnostics on the listening RPC socket 0.0.0.0:41323 every 8 connection(s)
[       OK ] Parameters/TestRpc.TestRpcContextClientDeadline/SSL_TCP (48 ms)
[ RUN      ] Parameters/TestRpc.TestApplicationFeatureFlagUnsupportedServer/SSL_TCP
I20260926 04:01:41.777027   790 acceptor_pool.cc:254] collecting diagnostics on the listening RPC socket 0.0.0.0:36051 every 8 connection(s)
I20260926 04:01:41.777077   791 acceptor_pool.cc:254] collecting diagnostics on the listening RPC socket 0.0.0.0:36051 every 8 connection(s)
[       OK ] Parameters/TestRpc.TestApplicationFeatureFlagUnsupportedServer/SSL_TCP (57 ms)
[ RUN      ] Parameters/TestRpc.TestCancellationAsync/SSL_TCP
I20260926 04:01:41.831743   815 acceptor_pool.cc:254] collecting diagnostics on the listening RPC socket 0.0.0.0:42041 every 8 connection(s)
I20260926 04:01:41.831779   816 acceptor_pool.cc:254] collecting diagnostics on the listening RPC socket 0.0.0.0:42041 every 8 connection(s)
I20260926 04:01:41.831969   383 rpc-test.cc:1716] Connecting to 0.0.0.0:42041
I20260926 04:01:41.851439   383 test_util.cc:268] Using random seed: -470191828
I20260926 04:01:41.866554   819 rpc-test-base.h:240] got call: sleep_micros: 500 pattern: 4294967295 num_repetitions: 2097152 sidecar_idx: 0
I20260926 04:01:41.878582   819 rpc-test-base.h:240] got call: sleep_micros: 500 pattern: 4294967295 num_repetitions: 2097152 sidecar_idx: 0
I20260926 04:01:41.890462   819 rpc-test-base.h:240] got call: sleep_micros: 500 pattern: 4294967295 num_repetitions: 2097152 sidecar_idx: 0
I20260926 04:01:41.904505   819 rpc-test-base.h:240] got call: sleep_micros: 500 pattern: 4294967295 num_repetitions: 2097152 sidecar_idx: 0
I20260926 04:01:41.919750   819 rpc-test-base.h:240] got call: sleep_micros: 500 pattern: 4294967295 num_repetitions: 2097152 sidecar_idx: 0
I20260926 04:01:41.934938   819 rpc-test-base.h:240] got call: sleep_micros: 500 pattern: 4294967295 num_repetitions: 2097152 sidecar_idx: 0
I20260926 04:01:41.949882   819 rpc-test-base.h:240] got call: sleep_micros: 500 pattern: 4294967295 num_repetitions: 2097152 sidecar_idx: 0
I20260926 04:01:41.964551   819 rpc-test-base.h:240] got call: sleep_micros: 500 pattern: 4294967295 num_repetitions: 2097152 sidecar_idx: 0
W20260926 04:01:41.967983   812 connection.cc:441] server connection from 127.0.0.1:60000 torn down before Call kudu.rpc.GenericCalculatorService.SleepWithSidecar from 127.0.0.1:60000 (request call id 9) could send its response
[       OK ] Parameters/TestRpc.TestCancellationAsync/SSL_TCP (151 ms)
[ RUN      ] Parameters/TestRpc.TestPerformanceBySocketType/SSL_TCP
I20260926 04:01:41.981853   840 acceptor_pool.cc:254] collecting diagnostics on the listening RPC socket 0.0.0.0:43801 every 8 connection(s)
I20260926 04:01:41.981900   841 acceptor_pool.cc:254] collecting diagnostics on the listening RPC socket 0.0.0.0:43801 every 8 connection(s)
I20260926 04:01:41.982081   383 rpc-test.cc:1846] Connecting to 0.0.0.0:43801
I20260926 04:01:43.644426   383 rpc-test.cc:1859] Sending 1024MB via ssl-enabled tcp socket: real 1.645s	user 1.432s	sys 1.506s
I20260926 04:01:45.348650   383 rpc-test.cc:1859] Sending 1024MB via ssl-enabled tcp socket: real 1.704s	user 1.506s	sys 1.489s
I20260926 04:01:46.945798   383 rpc-test.cc:1859] Sending 1024MB via ssl-enabled tcp socket: real 1.597s	user 1.484s	sys 1.360s
I20260926 04:01:48.552784   383 rpc-test.cc:1859] Sending 1024MB via ssl-enabled tcp socket: real 1.607s	user 1.439s	sys 1.430s
I20260926 04:01:50.110909   383 rpc-test.cc:1859] Sending 1024MB via ssl-enabled tcp socket: real 1.558s	user 1.406s	sys 1.369s
[       OK ] Parameters/TestRpc.TestPerformanceBySocketType/SSL_TCP (8143 ms)
[----------] 20 tests from Parameters/TestRpc (33247 ms total)

[----------] 1 test from Parameters/TestRpcSocketTxRxQueue
[ RUN      ] Parameters/TestRpcSocketTxRxQueue.OverCapacity/0
W20260926 04:01:50.384056   857 negotiation.cc:337] Failed RPC negotiation. Trace:
0926 04:01:50.118407 (+     0us) reactor.cc:625] Submitting negotiation task for client connection to 0.0.0.0:41739 (local address 127.0.0.1:50098)
0926 04:01:50.118479 (+    72us) negotiation.cc:107] Waiting for socket to connect
0926 04:01:50.118490 (+    11us) client_negotiation.cc:174] Beginning negotiation
0926 04:01:50.118548 (+    58us) client_negotiation.cc:252] Sending NEGOTIATE NegotiatePB request
0926 04:01:50.383841 (+265293us) negotiation.cc:327] Negotiation complete: Network error: Client connection negotiation failed: client connection to 0.0.0.0:41739: BlockingRecv error: recv error from unknown peer: Transport endpoint is not connected (error 107)
Metrics: {"client-negotiator.queue_time_us":41}
W20260926 04:01:50.384055   893 negotiation.cc:337] Failed RPC negotiation. Trace:
0926 04:01:50.122518 (+     0us) reactor.cc:625] Submitting negotiation task for client connection to 0.0.0.0:41739 (local address 127.0.0.1:50152)
0926 04:01:50.122599 (+    81us) negotiation.cc:107] Waiting for socket to connect
0926 04:01:50.122611 (+    12us) client_negotiation.cc:174] Beginning negotiation
0926 04:01:50.122660 (+    49us) client_negotiation.cc:252] Sending NEGOTIATE NegotiatePB request
0926 04:01:50.384002 (+261342us) negotiation.cc:327] Negotiation complete: Network error: Client connection negotiation failed: client connection to 0.0.0.0:41739: BlockingRecv error: recv error from unknown peer: Transport endpoint is not connected (error 107)
Metrics: {"client-negotiator.queue_time_us":53}
W20260926 04:01:50.384199   884 negotiation.cc:337] Failed RPC negotiation. Trace:
0926 04:01:50.121549 (+     0us) reactor.cc:625] Submitting negotiation task for client connection to 0.0.0.0:41739 (local address 127.0.0.1:50136)
0926 04:01:50.121635 (+    86us) negotiation.cc:107] Waiting for socket to connect
0926 04:01:50.121646 (+    11us) client_negotiation.cc:174] Beginning negotiation
0926 04:01:50.121694 (+    48us) client_negotiation.cc:252] Sending NEGOTIATE NegotiatePB request
0926 04:01:50.384100 (+262406us) negotiation.cc:327] Negotiation complete: Network error: Client connection negotiation failed: client connection to 0.0.0.0:41739: BlockingRecv error: recv error from unknown peer: Transport endpoint is not connected (error 107)
Metrics: {"client-negotiator.queue_time_us":39}
W20260926 04:01:50.384274   902 negotiation.cc:337] Failed RPC negotiation. Trace:
0926 04:01:50.123409 (+     0us) reactor.cc:625] Submitting negotiation task for client connection to 0.0.0.0:41739 (local address 127.0.0.1:50164)
0926 04:01:50.123505 (+    96us) negotiation.cc:107] Waiting for socket to connect
0926 04:01:50.123516 (+    11us) client_negotiation.cc:174] Beginning negotiation
0926 04:01:50.123564 (+    48us) client_negotiation.cc:252] Sending NEGOTIATE NegotiatePB request
0926 04:01:50.384147 (+260583us) negotiation.cc:327] Negotiation complete: Network error: Client connection negotiation failed: client connection to 0.0.0.0:41739: BlockingRecv error: recv error from unknown peer: Transport endpoint is not connected (error 107)
Metrics: {"client-negotiator.queue_time_us":71}
W20260926 04:01:50.384342   875 negotiation.cc:337] Failed RPC negotiation. Trace:
0926 04:01:50.120413 (+     0us) reactor.cc:625] Submitting negotiation task for client connection to 0.0.0.0:41739 (local address 127.0.0.1:50120)
0926 04:01:50.120450 (+    37us) negotiation.cc:107] Waiting for socket to connect
0926 04:01:50.120458 (+     8us) client_negotiation.cc:174] Beginning negotiation
0926 04:01:50.120494 (+    36us) client_negotiation.cc:252] Sending NEGOTIATE NegotiatePB request
0926 04:01:50.383948 (+263454us) negotiation.cc:327] Negotiation complete: Network error: Client connection negotiation failed: client connection to 0.0.0.0:41739: BlockingRecv error: recv error from unknown peer: Transport endpoint is not connected (error 107)
Metrics: {"client-negotiator.queue_time_us":18}
W20260926 04:01:50.384055   866 negotiation.cc:337] Failed RPC negotiation. Trace:
0926 04:01:50.119527 (+     0us) reactor.cc:625] Submitting negotiation task for client connection to 0.0.0.0:41739 (local address 127.0.0.1:50114)
0926 04:01:50.119567 (+    40us) negotiation.cc:107] Waiting for socket to connect
0926 04:01:50.119577 (+    10us) client_negotiation.cc:174] Beginning negotiation
0926 04:01:50.119620 (+    43us) client_negotiation.cc:252] Sending NEGOTIATE NegotiatePB request
0926 04:01:50.383948 (+264328us) negotiation.cc:327] Negotiation complete: Network error: Client connection negotiation failed: client connection to 0.0.0.0:41739: BlockingRecv error: recv error from unknown peer: Transport endpoint is not connected (error 107)
Metrics: {"client-negotiator.queue_time_us":17}
[       OK ] Parameters/TestRpcSocketTxRxQueue.OverCapacity/0 (1047 ms)
[----------] 1 test from Parameters/TestRpcSocketTxRxQueue (1047 ms total)

[----------] Global test environment tear-down
[==========] 21 tests from 2 test suites ran. (34295 ms total)
[  PASSED  ] 20 tests.
[  FAILED  ] 1 test, listed below:
[  FAILED  ] Parameters/TestRpc.TestCallWithChainCertAndChainCA/SSL_TCP, where GetParam() = (true, false)

 1 FAILED TEST