Diagnosed failure

Parameters/TestRpc.TestCallWithChainCertAndRootCA/SSL_UnixSocket: /data0/somelongdirectorytoavoidrpathissues/src/kudu/src/kudu/rpc/rpc-test.cc:303: Failure
Failed
Bad status: Runtime error: could not verify certificate chain (error with cert: subject=CN = localhost, ST = sadfjas, C = AS, emailAddress = sdflkdsajf, O = lskdfjlsad, OU = sldfkja, issuer=C = AS, ST = ASDfkjdhf, L = lskdjf, O = saldfja, OU = skdjf, CN = localhost, emailAddress = sadjflkadsj): : certificate has expired
Google Test trace:
/data0/somelongdirectorytoavoidrpathissues/src/kudu/src/kudu/rpc/rpc-test.cc:300: Connecting to unix:/tmp/dist-test-taskCsUAtV/test-tmp/rpc-test-84cdcdab658545deb65caf11a10a02e4.sock
I20260924 14:12:02.376322 18247 test_util.cc:175] -----------------------------------------------
I20260924 14:12:02.376482 18247 test_util.cc:176] Had fatal failures, leaving test files at /tmp/dist-test-taskCsUAtV/test-tmp/rpc-test.2.Parameters_TestRpc.TestCallWithChainCertAndRootCA_SSL_UnixSocket.1790259118810848-18247-0

Full log

Note: This is test shard 3 of 8.
[==========] Running 21 tests from 2 test suites.
[----------] Global test environment set-up.
[----------] 1 test from TestRpc
[ RUN      ] TestRpc.TestNegotiationTimeout
WARNING: Logging before InitGoogleLogging() is written to STDERR
I20260924 14:11:58.994663 18247 rpc-test-base.h:595] status: Timed out: connection negotiation to 0.0.0.0:37141 for RPC Sleep timed out after 0.100s (ON_OUTBOUND_QUEUE), seconds elapsed: 0.101515
W20260924 14:12:02.064942 18257 negotiation.cc:337] Failed RPC negotiation. Trace:
0924 14:11:58.893964 (+     0us) reactor.cc:625] Submitting negotiation task for client connection to 0.0.0.0:37141 (local address 127.0.0.1:60272)
0924 14:11:58.894701 (+   737us) negotiation.cc:107] Waiting for socket to connect
0924 14:11:58.894745 (+    44us) client_negotiation.cc:174] Beginning negotiation
0924 14:11:58.906360 (+ 11615us) client_negotiation.cc:252] Sending NEGOTIATE NegotiatePB request
0924 14:12:02.063865 (+3157505us) negotiation.cc:327] Negotiation complete: Timed out: Client connection negotiation failed: client connection to 0.0.0.0:37141: received 0 of 4 requested bytes
Metrics: {"client-negotiator.queue_time_us":202}
[       OK ] TestRpc.TestNegotiationTimeout (3206 ms)
[----------] 1 test from TestRpc (3206 ms total)

[----------] 20 tests from Parameters/TestRpc
[ RUN      ] Parameters/TestRpc.TestAcceptorPoolStartStop/SSL_UnixSocket
I20260924 14:12:02.103161 18273 acceptor_pool.cc:254] collecting diagnostics on the listening RPC socket unix:/tmp/dist-test-taskCsUAtV/test-tmp/rpc-test-15a1741965d84e59af5afd626dc5fc73.sock every 8 connection(s)
I20260924 14:12:02.104717 18274 acceptor_pool.cc:254] collecting diagnostics on the listening RPC socket unix:/tmp/dist-test-taskCsUAtV/test-tmp/rpc-test-15a1741965d84e59af5afd626dc5fc73.sock every 8 connection(s)
I20260924 14:12:02.137511 18284 acceptor_pool.cc:254] collecting diagnostics on the listening RPC socket unix:/tmp/dist-test-taskCsUAtV/test-tmp/rpc-test-15a1741965d84e59af5afd626dc5fc73.sock every 8 connection(s)
I20260924 14:12:02.138803 18285 acceptor_pool.cc:254] collecting diagnostics on the listening RPC socket unix:/tmp/dist-test-taskCsUAtV/test-tmp/rpc-test-15a1741965d84e59af5afd626dc5fc73.sock every 8 connection(s)
I20260924 14:12:02.171154 18295 acceptor_pool.cc:254] collecting diagnostics on the listening RPC socket unix:/tmp/dist-test-taskCsUAtV/test-tmp/rpc-test-15a1741965d84e59af5afd626dc5fc73.sock every 8 connection(s)
I20260924 14:12:02.171833 18296 acceptor_pool.cc:254] collecting diagnostics on the listening RPC socket unix:/tmp/dist-test-taskCsUAtV/test-tmp/rpc-test-15a1741965d84e59af5afd626dc5fc73.sock every 8 connection(s)
I20260924 14:12:02.204147 18306 acceptor_pool.cc:254] collecting diagnostics on the listening RPC socket unix:/tmp/dist-test-taskCsUAtV/test-tmp/rpc-test-15a1741965d84e59af5afd626dc5fc73.sock every 8 connection(s)
I20260924 14:12:02.204810 18307 acceptor_pool.cc:254] collecting diagnostics on the listening RPC socket unix:/tmp/dist-test-taskCsUAtV/test-tmp/rpc-test-15a1741965d84e59af5afd626dc5fc73.sock every 8 connection(s)
I20260924 14:12:02.244102 18318 acceptor_pool.cc:254] collecting diagnostics on the listening RPC socket unix:/tmp/dist-test-taskCsUAtV/test-tmp/rpc-test-15a1741965d84e59af5afd626dc5fc73.sock every 8 connection(s)
I20260924 14:12:02.244786 18319 acceptor_pool.cc:254] collecting diagnostics on the listening RPC socket unix:/tmp/dist-test-taskCsUAtV/test-tmp/rpc-test-15a1741965d84e59af5afd626dc5fc73.sock every 8 connection(s)
[       OK ] Parameters/TestRpc.TestAcceptorPoolStartStop/SSL_UnixSocket (179 ms)
[ RUN      ] Parameters/TestRpc.TestCall/SSL_UnixSocket
I20260924 14:12:02.279201 18331 acceptor_pool.cc:254] collecting diagnostics on the listening RPC socket unix:/tmp/dist-test-taskCsUAtV/test-tmp/rpc-test-a0bbb9719dac4d5bbcfcf20b1dc64f60.sock every 8 connection(s)
I20260924 14:12:02.281123 18332 acceptor_pool.cc:254] collecting diagnostics on the listening RPC socket unix:/tmp/dist-test-taskCsUAtV/test-tmp/rpc-test-a0bbb9719dac4d5bbcfcf20b1dc64f60.sock every 8 connection(s)
I20260924 14:12:02.285688 18247 rpc-test.cc:234] Connecting to unix:/tmp/dist-test-taskCsUAtV/test-tmp/rpc-test-a0bbb9719dac4d5bbcfcf20b1dc64f60.sock
W20260924 14:12:02.334486 18328 connection.cc:196] Error closing socket: Network error: TlsSocket::Close: Broken pipe
[       OK ] Parameters/TestRpc.TestCall/SSL_UnixSocket (90 ms)
[ RUN      ] Parameters/TestRpc.TestCallWithChainCertAndRootCA/SSL_UnixSocket
I20260924 14:12:02.357582 18356 acceptor_pool.cc:254] collecting diagnostics on the listening RPC socket unix:/tmp/dist-test-taskCsUAtV/test-tmp/rpc-test-84cdcdab658545deb65caf11a10a02e4.sock every 8 connection(s)
I20260924 14:12:02.358292 18357 acceptor_pool.cc:254] collecting diagnostics on the listening RPC socket unix:/tmp/dist-test-taskCsUAtV/test-tmp/rpc-test-84cdcdab658545deb65caf11a10a02e4.sock every 8 connection(s)
/data0/somelongdirectorytoavoidrpathissues/src/kudu/src/kudu/rpc/rpc-test.cc:303: Failure
Failed
Bad status: Runtime error: could not verify certificate chain (error with cert: subject=CN = localhost, ST = sadfjas, C = AS, emailAddress = sdflkdsajf, O = lskdfjlsad, OU = sldfkja, issuer=C = AS, ST = ASDfkjdhf, L = lskdjf, O = saldfja, OU = skdjf, CN = localhost, emailAddress = sadjflkadsj): : certificate has expired
Google Test trace:
/data0/somelongdirectorytoavoidrpathissues/src/kudu/src/kudu/rpc/rpc-test.cc:300: Connecting to unix:/tmp/dist-test-taskCsUAtV/test-tmp/rpc-test-84cdcdab658545deb65caf11a10a02e4.sock
I20260924 14:12:02.376322 18247 test_util.cc:175] -----------------------------------------------
I20260924 14:12:02.376482 18247 test_util.cc:176] Had fatal failures, leaving test files at /tmp/dist-test-taskCsUAtV/test-tmp/rpc-test.2.Parameters_TestRpc.TestCallWithChainCertAndRootCA_SSL_UnixSocket.1790259118810848-18247-0
[  FAILED  ] Parameters/TestRpc.TestCallWithChainCertAndRootCA/SSL_UnixSocket, where GetParam() = (true, true) (37 ms)
[ RUN      ] Parameters/TestRpc.TestCallWithBadPasswordProtectedKey/SSL_UnixSocket
[       OK ] Parameters/TestRpc.TestCallWithBadPasswordProtectedKey/SSL_UnixSocket (33 ms)
[ RUN      ] Parameters/TestRpc.TestInvalidMethodCall/SSL_UnixSocket
I20260924 14:12:02.424552 18393 acceptor_pool.cc:254] collecting diagnostics on the listening RPC socket unix:/tmp/dist-test-taskCsUAtV/test-tmp/rpc-test-5cdd431f916842fe9d261ca90685e09d.sock every 8 connection(s)
I20260924 14:12:02.425326 18394 acceptor_pool.cc:254] collecting diagnostics on the listening RPC socket unix:/tmp/dist-test-taskCsUAtV/test-tmp/rpc-test-5cdd431f916842fe9d261ca90685e09d.sock every 8 connection(s)
I20260924 14:12:02.428517 18247 rpc-test.cc:406] Connecting to unix:/tmp/dist-test-taskCsUAtV/test-tmp/rpc-test-5cdd431f916842fe9d261ca90685e09d.sock
[       OK ] Parameters/TestRpc.TestInvalidMethodCall/SSL_UnixSocket (51 ms)
[ RUN      ] Parameters/TestRpc.TestHighFDs/SSL_UnixSocket
I20260924 14:12:02.656944 18419 acceptor_pool.cc:254] collecting diagnostics on the listening RPC socket unix:/tmp/dist-test-taskCsUAtV/test-tmp/rpc-test-3f8ffeb0e1e040a1a075c380f6968d0c.sock every 8 connection(s)
I20260924 14:12:02.657619 18420 acceptor_pool.cc:254] collecting diagnostics on the listening RPC socket unix:/tmp/dist-test-taskCsUAtV/test-tmp/rpc-test-3f8ffeb0e1e040a1a075c380f6968d0c.sock every 8 connection(s)
[       OK ] Parameters/TestRpc.TestHighFDs/SSL_UnixSocket (238 ms)
[ RUN      ] Parameters/TestRpc.TestConnectionAlwaysKeepalive/SSL_UnixSocket
I20260924 14:12:02.724176 18442 acceptor_pool.cc:254] collecting diagnostics on the listening RPC socket unix:/tmp/dist-test-taskCsUAtV/test-tmp/rpc-test-b837b00e35ea45c69b99d2c86da44529.sock every 8 connection(s)
I20260924 14:12:02.724835 18443 acceptor_pool.cc:254] collecting diagnostics on the listening RPC socket unix:/tmp/dist-test-taskCsUAtV/test-tmp/rpc-test-b837b00e35ea45c69b99d2c86da44529.sock every 8 connection(s)
I20260924 14:12:02.727713 18247 rpc-test.cc:532] Connecting to unix:/tmp/dist-test-taskCsUAtV/test-tmp/rpc-test-b837b00e35ea45c69b99d2c86da44529.sock
W20260924 14:12:05.764248 18441 connection.cc:196] Error closing socket: Network error: TlsSocket::Close: Broken pipe
[       OK ] Parameters/TestRpc.TestConnectionAlwaysKeepalive/SSL_UnixSocket (3067 ms)
[ RUN      ] Parameters/TestRpc.TestReopenOutboundConnections/SSL_UnixSocket
I20260924 14:12:05.796054 18465 acceptor_pool.cc:254] collecting diagnostics on the listening RPC socket unix:/tmp/dist-test-taskCsUAtV/test-tmp/rpc-test-a7b4ae77346b4fc59e035c008c22d087.sock every 8 connection(s)
I20260924 14:12:05.796744 18466 acceptor_pool.cc:254] collecting diagnostics on the listening RPC socket unix:/tmp/dist-test-taskCsUAtV/test-tmp/rpc-test-a7b4ae77346b4fc59e035c008c22d087.sock every 8 connection(s)
I20260924 14:12:05.800040 18247 rpc-test.cc:658] Connecting to unix:/tmp/dist-test-taskCsUAtV/test-tmp/rpc-test-a7b4ae77346b4fc59e035c008c22d087.sock
W20260924 14:12:05.826296 18464 connection.cc:196] Error closing socket: Network error: TlsSocket::Close: Broken pipe
W20260924 14:12:05.835618 18464 connection.cc:196] Error closing socket: Network error: TlsSocket::Close: Broken pipe
W20260924 14:12:05.844575 18464 connection.cc:196] Error closing socket: Network error: TlsSocket::Close: Broken pipe
W20260924 14:12:05.853819 18464 connection.cc:196] Error closing socket: Network error: TlsSocket::Close: Broken pipe
W20260924 14:12:05.862107 18464 connection.cc:196] Error closing socket: Network error: TlsSocket::Close: Broken pipe
W20260924 14:12:05.870131 18464 connection.cc:196] Error closing socket: Network error: TlsSocket::Close: Broken pipe
W20260924 14:12:05.878288 18464 connection.cc:196] Error closing socket: Network error: TlsSocket::Close: Broken pipe
W20260924 14:12:05.886487 18464 connection.cc:196] Error closing socket: Network error: TlsSocket::Close: Broken pipe
W20260924 14:12:05.894675 18464 connection.cc:196] Error closing socket: Network error: TlsSocket::Close: Broken pipe
W20260924 14:12:05.904862 18464 connection.cc:196] Error closing socket: Network error: TlsSocket::Close: Broken pipe
W20260924 14:12:05.913539 18464 connection.cc:196] Error closing socket: Network error: TlsSocket::Close: Broken pipe
W20260924 14:12:05.922494 18464 connection.cc:196] Error closing socket: Network error: TlsSocket::Close: Broken pipe
W20260924 14:12:05.930845 18464 connection.cc:196] Error closing socket: Network error: TlsSocket::Close: Broken pipe
W20260924 14:12:05.939975 18464 connection.cc:196] Error closing socket: Network error: TlsSocket::Close: Broken pipe
W20260924 14:12:05.940061 18465 acceptor_pool.cc:285] unable to collect diagnostics on RPC socket unix:/tmp/dist-test-taskCsUAtV/test-tmp/rpc-test-a7b4ae77346b4fc59e035c008c22d087.sock: Not implemented: netlink diagnostics is currently supported only on IPv4 TCP sockets
W20260924 14:12:05.948347 18464 connection.cc:196] Error closing socket: Network error: TlsSocket::Close: Broken pipe
W20260924 14:12:05.956606 18464 connection.cc:196] Error closing socket: Network error: TlsSocket::Close: Broken pipe
W20260924 14:12:05.965267 18464 connection.cc:196] Error closing socket: Network error: TlsSocket::Close: Broken pipe
W20260924 14:12:05.974671 18464 connection.cc:196] Error closing socket: Network error: TlsSocket::Close: Broken pipe
W20260924 14:12:05.983769 18464 connection.cc:196] Error closing socket: Network error: TlsSocket::Close: Broken pipe
W20260924 14:12:05.992985 18464 connection.cc:196] Error closing socket: Network error: TlsSocket::Close: Broken pipe
W20260924 14:12:06.003015 18464 connection.cc:196] Error closing socket: Network error: TlsSocket::Close: Broken pipe
W20260924 14:12:06.012614 18464 connection.cc:196] Error closing socket: Network error: TlsSocket::Close: Broken pipe
W20260924 14:12:06.022768 18464 connection.cc:196] Error closing socket: Network error: TlsSocket::Close: Broken pipe
W20260924 14:12:06.031525 18464 connection.cc:196] Error closing socket: Network error: TlsSocket::Close: Broken pipe
W20260924 14:12:06.039852 18464 connection.cc:196] Error closing socket: Network error: TlsSocket::Close: Broken pipe
W20260924 14:12:06.047858 18464 connection.cc:196] Error closing socket: Network error: TlsSocket::Close: Broken pipe
W20260924 14:12:06.056453 18464 connection.cc:196] Error closing socket: Network error: TlsSocket::Close: Broken pipe
W20260924 14:12:06.064284 18464 connection.cc:196] Error closing socket: Network error: TlsSocket::Close: Broken pipe
W20260924 14:12:06.072750 18464 connection.cc:196] Error closing socket: Network error: TlsSocket::Close: Broken pipe
W20260924 14:12:06.080605 18464 connection.cc:196] Error closing socket: Network error: TlsSocket::Close: Broken pipe
W20260924 14:12:06.088886 18464 connection.cc:196] Error closing socket: Network error: TlsSocket::Close: Broken pipe
W20260924 14:12:06.097826 18464 connection.cc:196] Error closing socket: Network error: TlsSocket::Close: Broken pipe
[       OK ] Parameters/TestRpc.TestReopenOutboundConnections/SSL_UnixSocket (333 ms)
[ RUN      ] Parameters/TestRpc.TestConnectionNetworkPlane/SSL_UnixSocket
I20260924 14:12:06.130605 18488 acceptor_pool.cc:254] collecting diagnostics on the listening RPC socket unix:/tmp/dist-test-taskCsUAtV/test-tmp/rpc-test-9eb69a2bb0a6430ea4d75f723b01abbb.sock every 8 connection(s)
I20260924 14:12:06.131337 18489 acceptor_pool.cc:254] collecting diagnostics on the listening RPC socket unix:/tmp/dist-test-taskCsUAtV/test-tmp/rpc-test-9eb69a2bb0a6430ea4d75f723b01abbb.sock every 8 connection(s)
I20260924 14:12:06.134255 18247 rpc-test.cc:772] Connecting to unix:/tmp/dist-test-taskCsUAtV/test-tmp/rpc-test-9eb69a2bb0a6430ea4d75f723b01abbb.sock
W20260924 14:12:06.179863 18487 connection.cc:196] Error closing socket: Network error: TlsSocket::Close: Broken pipe
W20260924 14:12:06.180629 18487 connection.cc:196] Error closing socket: Network error: TlsSocket::Close: Broken pipe
[       OK ] Parameters/TestRpc.TestConnectionNetworkPlane/SSL_UnixSocket (83 ms)
[ RUN      ] Parameters/TestRpc.TestTCPKeepalive/SSL_UnixSocket
I20260924 14:12:06.200963 18514 acceptor_pool.cc:254] collecting diagnostics on the listening RPC socket unix:/tmp/dist-test-taskCsUAtV/test-tmp/rpc-test-63ada9a66cef4228a7c6329904a05394.sock every 8 connection(s)
I20260924 14:12:06.201620 18515 acceptor_pool.cc:254] collecting diagnostics on the listening RPC socket unix:/tmp/dist-test-taskCsUAtV/test-tmp/rpc-test-63ada9a66cef4228a7c6329904a05394.sock every 8 connection(s)
I20260924 14:12:06.251955 18518 rpc-test-base.h:222] got call: sleep_micros: 8000000 deferred: true
I20260924 14:12:14.255936 18518 rpcz_store.cc:275] Call kudu.rpc.GenericCalculatorService.Sleep from unix:<unnamed> (request call id 0) took 8004 ms. Trace:
I20260924 14:12:14.256366 18518 rpcz_store.cc:276] 0924 14:12:06.251808 (+     0us) service_pool.cc:170] Inserting onto call queue
0924 14:12:06.251901 (+    93us) service_pool.cc:227] Handling call
0924 14:12:14.255764 (+8003863us) inbound_call.cc:173] Queueing success response
Metrics: {}
W20260924 14:12:14.262123 18511 connection.cc:196] Error closing socket: Network error: TlsSocket::Close: Broken pipe
[       OK ] Parameters/TestRpc.TestTCPKeepalive/SSL_UnixSocket (8082 ms)
[ RUN      ] Parameters/TestRpc.TestMaxSmallSidecars/SSL_UnixSocket
I20260924 14:12:14.291280 18540 acceptor_pool.cc:254] collecting diagnostics on the listening RPC socket unix:/tmp/dist-test-taskCsUAtV/test-tmp/rpc-test-e24c4d70f18247909eb0b37422f1c3ea.sock every 8 connection(s)
I20260924 14:12:14.292070 18541 acceptor_pool.cc:254] collecting diagnostics on the listening RPC socket unix:/tmp/dist-test-taskCsUAtV/test-tmp/rpc-test-e24c4d70f18247909eb0b37422f1c3ea.sock every 8 connection(s)
W20260924 14:12:14.448808 18537 connection.cc:196] Error closing socket: Network error: TlsSocket::Close: Broken pipe
[       OK ] Parameters/TestRpc.TestMaxSmallSidecars/SSL_UnixSocket (184 ms)
[ RUN      ] Parameters/TestRpc.TestCallTimeout/SSL_UnixSocket
I20260924 14:12:14.474851 18565 acceptor_pool.cc:254] collecting diagnostics on the listening RPC socket unix:/tmp/dist-test-taskCsUAtV/test-tmp/rpc-test-0e0eca6e553e4b15bcc838654c242ce9.sock every 8 connection(s)
I20260924 14:12:14.475530 18566 acceptor_pool.cc:254] collecting diagnostics on the listening RPC socket unix:/tmp/dist-test-taskCsUAtV/test-tmp/rpc-test-0e0eca6e553e4b15bcc838654c242ce9.sock every 8 connection(s)
I20260924 14:12:14.500823 18247 rpc-test-base.h:595] status: Timed out: connection negotiation to unix:/tmp/dist-test-taskCsUAtV/test-tmp/rpc-test-0e0eca6e553e4b15bcc838654c242ce9.sock for RPC Sleep timed out after 0.000s (ON_OUTBOUND_QUEUE), seconds elapsed: 0.00223967
I20260924 14:12:14.507184 18569 rpc-test-base.h:222] got call: sleep_micros: 700000
I20260924 14:12:14.701568 18247 rpc-test-base.h:595] status: Timed out: Sleep RPC to unix:/tmp/dist-test-taskCsUAtV/test-tmp/rpc-test-0e0eca6e553e4b15bcc838654c242ce9.sock timed out after 0.200s (SENT), seconds elapsed: 0.200427
I20260924 14:12:14.702909 18568 rpc-test-base.h:222] got call: sleep_micros: 2000000
W20260924 14:12:15.207748 18569 rpcz_store.cc:267] Call kudu.rpc.GenericCalculatorService.Sleep from unix:<unnamed> (request call id 1) took 700 ms (client timeout 200 ms). Trace:
W20260924 14:12:15.208083 18569 rpcz_store.cc:269] 0924 14:12:14.507054 (+     0us) service_pool.cc:170] Inserting onto call queue
0924 14:12:14.507143 (+    89us) service_pool.cc:227] Handling call
0924 14:12:15.207696 (+700553us) inbound_call.cc:173] Queueing success response
Metrics: {}
I20260924 14:12:16.203447 18247 rpc-test-base.h:595] status: Timed out: Sleep RPC to unix:/tmp/dist-test-taskCsUAtV/test-tmp/rpc-test-0e0eca6e553e4b15bcc838654c242ce9.sock timed out after 1.500s (SENT), seconds elapsed: 1.50155
W20260924 14:12:16.205475 18562 connection.cc:196] Error closing socket: Network error: TlsSocket::Close: Broken pipe
W20260924 14:12:16.703418 18568 rpcz_store.cc:267] Call kudu.rpc.GenericCalculatorService.Sleep from unix:<unnamed> (request call id 2) took 2000 ms (client timeout 1500 ms). Trace:
W20260924 14:12:16.703714 18568 rpcz_store.cc:269] 0924 14:12:14.702649 (+     0us) service_pool.cc:170] Inserting onto call queue
0924 14:12:14.702761 (+   112us) service_pool.cc:227] Handling call
0924 14:12:16.703362 (+2000601us) inbound_call.cc:173] Queueing success response
Metrics: {}
W20260924 14:12:16.704289 18562 connection.cc:441] server connection from unix:<unnamed> torn down before Call kudu.rpc.GenericCalculatorService.Sleep from unix:<unnamed> (request call id 2) could send its response
[       OK ] Parameters/TestRpc.TestCallTimeout/SSL_UnixSocket (2256 ms)
[ RUN      ] Parameters/TestRpc.TestServerShutsDown/SSL_UnixSocket
I20260924 14:12:16.710780 18247 rpc-test.cc:1125] Connecting to 0.0.0.0:36661
W20260924 14:12:16.719025 18582 negotiation.cc:337] Failed RPC negotiation. Trace:
0924 14:12:16.717650 (+     0us) reactor.cc:625] Submitting negotiation task for client connection to 0.0.0.0:36661 (local address 127.0.0.1:41052)
0924 14:12:16.718075 (+   425us) negotiation.cc:107] Waiting for socket to connect
0924 14:12:16.718126 (+    51us) client_negotiation.cc:174] Beginning negotiation
0924 14:12:16.718335 (+   209us) client_negotiation.cc:252] Sending NEGOTIATE NegotiatePB request
0924 14:12:16.718541 (+   206us) negotiation.cc:327] Negotiation complete: Network error: Client connection negotiation failed: client connection to 0.0.0.0:36661: BlockingWrite error: write error: Broken pipe (error 32)
Metrics: {"client-negotiator.queue_time_us":114}
[       OK ] Parameters/TestRpc.TestServerShutsDown/SSL_UnixSocket (12 ms)
[ RUN      ] Parameters/TestRpc.TimedOutOnResponseMetric/SSL_UnixSocket
I20260924 14:12:16.749316 18599 acceptor_pool.cc:254] collecting diagnostics on the listening RPC socket unix:/tmp/dist-test-taskCsUAtV/test-tmp/rpc-test-6037396129e74f78b26e567adfddedd8.sock every 8 connection(s)
I20260924 14:12:16.749948 18600 acceptor_pool.cc:254] collecting diagnostics on the listening RPC socket unix:/tmp/dist-test-taskCsUAtV/test-tmp/rpc-test-6037396129e74f78b26e567adfddedd8.sock every 8 connection(s)
W20260924 14:12:17.012979 18603 rpcz_store.cc:267] Call kudu.rpc_test.CalculatorService.Sleep from unix:<unnamed> (request call id 3) took 50 ms (client timeout 25 ms). Trace:
W20260924 14:12:17.013257 18603 rpcz_store.cc:269] 0924 14:12:16.962490 (+     0us) service_pool.cc:170] Inserting onto call queue
0924 14:12:16.962572 (+    82us) service_pool.cc:227] Handling call
0924 14:12:17.012914 (+ 50342us) inbound_call.cc:173] Queueing success response
Related trace 'test_child':
Metrics: {"test_sleep_us":50000,"child_traces":[["test_child",{"related_trace_metric":1}]]}
W20260924 14:12:17.071468 18603 rpcz_store.cc:267] Call kudu.rpc_test.CalculatorService.Sleep from unix:<unnamed> (request call id 4) took 50 ms (client timeout 50 ms). Trace:
W20260924 14:12:17.071746 18603 rpcz_store.cc:269] 0924 14:12:17.021012 (+     0us) service_pool.cc:170] Inserting onto call queue
0924 14:12:17.021115 (+   103us) service_pool.cc:227] Handling call
0924 14:12:17.071416 (+ 50301us) inbound_call.cc:173] Queueing success response
Related trace 'test_child':
Metrics: {"test_sleep_us":50000,"child_traces":[["test_child",{"related_trace_metric":1}]]}
W20260924 14:12:17.074680 18596 connection.cc:196] Error closing socket: Network error: TlsSocket::Close: Broken pipe
[       OK ] Parameters/TestRpc.TimedOutOnResponseMetric/SSL_UnixSocket (357 ms)
[ RUN      ] Parameters/TestRpc.AcceptorDispatchingTimesMetric/SSL_UnixSocket
I20260924 14:12:17.090477 18624 acceptor_pool.cc:254] collecting diagnostics on the listening RPC socket 0.0.0.0:39563 every 8 connection(s)
I20260924 14:12:17.091066 18625 acceptor_pool.cc:254] collecting diagnostics on the listening RPC socket 0.0.0.0:39563 every 8 connection(s)
W20260924 14:12:17.095366 18620 negotiation.cc:337] Failed RPC negotiation. Trace:
0924 14:12:17.094326 (+     0us) reactor.cc:625] Submitting negotiation task for server connection from 127.0.0.1:56330 (local address 127.0.0.1:39563)
0924 14:12:17.094681 (+   355us) server_negotiation.cc:206] Beginning negotiation
0924 14:12:17.094698 (+    17us) server_negotiation.cc:399] Waiting for connection header
0924 14:12:17.094905 (+   207us) negotiation.cc:327] Negotiation complete: Network error: Server connection negotiation failed: server connection from 127.0.0.1:56330: BlockingRecv error: recv got EOF from 127.0.0.1:56330 (error 108)
Metrics: {"server-negotiator.queue_time_us":87}
[       OK ] Parameters/TestRpc.AcceptorDispatchingTimesMetric/SSL_UnixSocket (20 ms)
[ RUN      ] Parameters/TestRpc.TestRpcCallbackDestroysMessenger/SSL_UnixSocket
[       OK ] Parameters/TestRpc.TestRpcCallbackDestroysMessenger/SSL_UnixSocket (22 ms)
[ RUN      ] Parameters/TestRpc.TestApplicationFeatureFlag/SSL_UnixSocket
I20260924 14:12:17.147145 18650 acceptor_pool.cc:254] collecting diagnostics on the listening RPC socket unix:/tmp/dist-test-taskCsUAtV/test-tmp/rpc-test-5820325b25134815b7e64d136efc673d.sock every 8 connection(s)
I20260924 14:12:17.147856 18651 acceptor_pool.cc:254] collecting diagnostics on the listening RPC socket unix:/tmp/dist-test-taskCsUAtV/test-tmp/rpc-test-5820325b25134815b7e64d136efc673d.sock every 8 connection(s)
W20260924 14:12:17.191032 18647 messenger.cc:357] Unable to handle RPC call: Not implemented: call requires unsupported application feature flags: 99
W20260924 14:12:17.193485 18647 connection.cc:196] Error closing socket: Network error: TlsSocket::Close: Broken pipe
[       OK ] Parameters/TestRpc.TestApplicationFeatureFlag/SSL_UnixSocket (76 ms)
[ RUN      ] Parameters/TestRpc.TestCancellation/SSL_UnixSocket
I20260924 14:12:17.224059 18675 acceptor_pool.cc:254] collecting diagnostics on the listening RPC socket unix:/tmp/dist-test-taskCsUAtV/test-tmp/rpc-test-058f32df8b134304b60b3609f01ac65f.sock every 8 connection(s)
I20260924 14:12:17.224754 18676 acceptor_pool.cc:254] collecting diagnostics on the listening RPC socket unix:/tmp/dist-test-taskCsUAtV/test-tmp/rpc-test-058f32df8b134304b60b3609f01ac65f.sock every 8 connection(s)
I20260924 14:12:17.227566 18247 rpc-test.cc:1648] Connecting to unix:/tmp/dist-test-taskCsUAtV/test-tmp/rpc-test-058f32df8b134304b60b3609f01ac65f.sock
I20260924 14:12:17.330550 18247 rpc-test-base.h:595] status: Aborted: Sleep RPC to unix:/tmp/dist-test-taskCsUAtV/test-tmp/rpc-test-058f32df8b134304b60b3609f01ac65f.sock is cancelled in state READY, seconds elapsed: 0.000263947
I20260924 14:12:17.490372 18247 rpc-test-base.h:595] status: Aborted: Sleep RPC to unix:/tmp/dist-test-taskCsUAtV/test-tmp/rpc-test-058f32df8b134304b60b3609f01ac65f.sock is cancelled in state SENT, seconds elapsed: 0.000622509
I20260924 14:12:17.490687 18678 rpc-test-base.h:222] got call: sleep_micros: 510000
I20260924 14:12:17.652341 18247 rpc-test-base.h:595] status: Aborted: Sleep RPC to unix:/tmp/dist-test-taskCsUAtV/test-tmp/rpc-test-058f32df8b134304b60b3609f01ac65f.sock is cancelled in state SENT, seconds elapsed: 0.000652045
I20260924 14:12:17.652700 18677 rpc-test-base.h:222] got call: sleep_micros: 510000
I20260924 14:12:17.813398 18247 rpc-test-base.h:595] status: Aborted: Sleep RPC to unix:/tmp/dist-test-taskCsUAtV/test-tmp/rpc-test-058f32df8b134304b60b3609f01ac65f.sock is cancelled in state SENT, seconds elapsed: 0.000621813
W20260924 14:12:17.824067 18679 rpcz_store.cc:267] Call kudu.rpc.GenericCalculatorService.Sleep from unix:<unnamed> (request call id 11) took 10 ms (client timeout 10 ms). Trace:
W20260924 14:12:17.824368 18679 rpcz_store.cc:269] 0924 14:12:17.813525 (+     0us) service_pool.cc:170] Inserting onto call queue
0924 14:12:17.823923 (+ 10398us) service_pool.cc:214] Skipping call since client already timed out
0924 14:12:17.824024 (+   101us) inbound_call.cc:173] Queueing failure response
Metrics: {}
I20260924 14:12:17.824838 18679 rpc-test-base.h:222] got call: sleep_micros: 1500000
W20260924 14:12:18.001127 18678 rpcz_store.cc:267] Call kudu.rpc.GenericCalculatorService.Sleep from unix:<unnamed> (request call id 3) took 510 ms (client timeout 10 ms). Trace:
W20260924 14:12:18.001426 18678 rpcz_store.cc:269] 0924 14:12:17.490539 (+     0us) service_pool.cc:170] Inserting onto call queue
0924 14:12:17.490638 (+    99us) service_pool.cc:227] Handling call
0924 14:12:18.001075 (+510437us) inbound_call.cc:173] Queueing success response
Metrics: {}
W20260924 14:12:18.163271 18677 rpcz_store.cc:267] Call kudu.rpc.GenericCalculatorService.Sleep from unix:<unnamed> (request call id 7) took 510 ms (client timeout 10 ms). Trace:
W20260924 14:12:18.163564 18677 rpcz_store.cc:269] 0924 14:12:17.652494 (+     0us) service_pool.cc:170] Inserting onto call queue
0924 14:12:17.652637 (+   143us) service_pool.cc:227] Handling call
0924 14:12:18.163196 (+510559us) inbound_call.cc:173] Queueing success response
Metrics: {}
I20260924 14:12:18.814944 18247 rpc-test-base.h:595] status: Timed out: Sleep RPC to unix:/tmp/dist-test-taskCsUAtV/test-tmp/rpc-test-058f32df8b134304b60b3609f01ac65f.sock timed out after 1.000s (SENT), seconds elapsed: 1.00125
I20260924 14:12:18.816129 18677 rpc-test-base.h:222] got call: sleep_micros: 1500000
W20260924 14:12:19.325482 18679 rpcz_store.cc:267] Call kudu.rpc.GenericCalculatorService.Sleep from unix:<unnamed> (request call id 12) took 1511 ms (client timeout 1000 ms). Trace:
W20260924 14:12:19.325877 18679 rpcz_store.cc:269] 0924 14:12:17.814339 (+     0us) service_pool.cc:170] Inserting onto call queue
0924 14:12:17.824799 (+ 10460us) service_pool.cc:227] Handling call
0924 14:12:19.325321 (+1500522us) inbound_call.cc:173] Queueing success response
Metrics: {}
I20260924 14:12:19.817355 18247 rpc-test-base.h:595] status: Timed out: Sleep RPC to unix:/tmp/dist-test-taskCsUAtV/test-tmp/rpc-test-058f32df8b134304b60b3609f01ac65f.sock timed out after 1.000s (SENT), seconds elapsed: 1.00196
W20260924 14:12:19.818907 18672 messenger.cc:357] Unable to handle RPC call: Not implemented: call requires unsupported application feature flags: 99, 1
W20260924 14:12:19.820304 18672 messenger.cc:357] Unable to handle RPC call: Not implemented: call requires unsupported application feature flags: 99, 1
W20260924 14:12:20.025605 18672 connection.cc:196] Error closing socket: Network error: TlsSocket::Close: Broken pipe
W20260924 14:12:20.316708 18677 rpcz_store.cc:267] Call kudu.rpc.GenericCalculatorService.Sleep from unix:<unnamed> (request call id 13) took 1500 ms (client timeout 1000 ms). Trace:
W20260924 14:12:20.317005 18677 rpcz_store.cc:269] 0924 14:12:18.815971 (+     0us) service_pool.cc:170] Inserting onto call queue
0924 14:12:18.816086 (+   115us) service_pool.cc:227] Handling call
0924 14:12:20.316571 (+1500485us) inbound_call.cc:173] Queueing success response
Metrics: {}
W20260924 14:12:20.317600 18672 connection.cc:441] server connection from unix:<unnamed> torn down before Call kudu.rpc.GenericCalculatorService.Sleep from unix:<unnamed> (request call id 13) could send its response
[       OK ] Parameters/TestRpc.TestCancellation/SSL_UnixSocket (3126 ms)
[ RUN      ] Parameters/TestRpc.TestCancellationMultiThreads/SSL_UnixSocket
I20260924 14:12:20.343824 18701 acceptor_pool.cc:254] collecting diagnostics on the listening RPC socket unix:/tmp/dist-test-taskCsUAtV/test-tmp/rpc-test-1b8afca3ad57438ebdd5ca5dac5db583.sock every 8 connection(s)
I20260924 14:12:20.344607 18702 acceptor_pool.cc:254] collecting diagnostics on the listening RPC socket unix:/tmp/dist-test-taskCsUAtV/test-tmp/rpc-test-1b8afca3ad57438ebdd5ca5dac5db583.sock every 8 connection(s)
I20260924 14:12:20.348132 18247 rpc-test.cc:1808] Connecting to unix:/tmp/dist-test-taskCsUAtV/test-tmp/rpc-test-1b8afca3ad57438ebdd5ca5dac5db583.sock
I20260924 14:12:20.495292 18715 test_util.cc:268] Using random seed: 807405369
I20260924 14:12:20.496538 18716 test_util.cc:268] Using random seed: 807406718
I20260924 14:12:20.497983 18717 test_util.cc:268] Using random seed: 807408094
I20260924 14:12:20.499511 18718 test_util.cc:268] Using random seed: 807409675
I20260924 14:12:20.500712 18719 test_util.cc:268] Using random seed: 807410802
I20260924 14:12:20.501963 18720 test_util.cc:268] Using random seed: 807412050
I20260924 14:12:20.503518 18721 test_util.cc:268] Using random seed: 807413609
I20260924 14:12:20.504765 18722 test_util.cc:268] Using random seed: 807414854
I20260924 14:12:20.505952 18723 test_util.cc:268] Using random seed: 807416045
I20260924 14:12:20.507391 18724 test_util.cc:268] Using random seed: 807417447
I20260924 14:12:20.508932 18725 test_util.cc:268] Using random seed: 807418994
I20260924 14:12:20.510336 18726 test_util.cc:268] Using random seed: 807420388
I20260924 14:12:20.512187 18727 test_util.cc:268] Using random seed: 807422176
I20260924 14:12:20.516048 18728 test_util.cc:268] Using random seed: 807426081
I20260924 14:12:20.519870 18729 test_util.cc:268] Using random seed: 807429879
I20260924 14:12:20.521394 18730 test_util.cc:268] Using random seed: 807431418
I20260924 14:12:20.523121 18731 test_util.cc:268] Using random seed: 807433146
I20260924 14:12:20.524739 18732 test_util.cc:268] Using random seed: 807434756
I20260924 14:12:20.526300 18733 test_util.cc:268] Using random seed: 807436334
I20260924 14:12:20.527958 18734 test_util.cc:268] Using random seed: 807437985
I20260924 14:12:20.529520 18735 test_util.cc:268] Using random seed: 807439536
I20260924 14:12:20.531081 18736 test_util.cc:268] Using random seed: 807441083
I20260924 14:12:20.532680 18737 test_util.cc:268] Using random seed: 807442709
I20260924 14:12:20.534354 18738 test_util.cc:268] Using random seed: 807444386
I20260924 14:12:20.540110 18739 test_util.cc:268] Using random seed: 807450078
I20260924 14:12:20.542111 18740 test_util.cc:268] Using random seed: 807452122
I20260924 14:12:20.543705 18741 test_util.cc:268] Using random seed: 807453673
I20260924 14:12:20.545158 18742 test_util.cc:268] Using random seed: 807455180
I20260924 14:12:20.546763 18743 test_util.cc:268] Using random seed: 807456745
I20260924 14:12:20.548331 18744 test_util.cc:268] Using random seed: 807458416
W20260924 14:12:38.718636 18698 connection.cc:196] Error closing socket: Network error: TlsSocket::Close: Broken pipe
[       OK ] Parameters/TestRpc.TestCancellationMultiThreads/SSL_UnixSocket (18408 ms)
[ RUN      ] Parameters/TestRpc.TestCallId/SSL_UnixSocket
I20260924 14:12:38.773909 18757 acceptor_pool.cc:254] collecting diagnostics on the listening RPC socket unix:/tmp/dist-test-taskCsUAtV/test-tmp/rpc-test-b15afd745c3d48de8cf2135b6a9682b9.sock every 8 connection(s)
I20260924 14:12:38.774726 18758 acceptor_pool.cc:254] collecting diagnostics on the listening RPC socket unix:/tmp/dist-test-taskCsUAtV/test-tmp/rpc-test-b15afd745c3d48de8cf2135b6a9682b9.sock every 8 connection(s)
[       OK ] Parameters/TestRpc.TestCallId/SSL_UnixSocket (90 ms)
[----------] 20 tests from Parameters/TestRpc (36756 ms total)

[----------] Global test environment tear-down
[==========] 21 tests from 2 test suites ran. (39963 ms total)
[  PASSED  ] 20 tests.
[  FAILED  ] 1 test, listed below:
[  FAILED  ] Parameters/TestRpc.TestCallWithChainCertAndRootCA/SSL_UnixSocket, where GetParam() = (true, true)

 1 FAILED TEST
I20260924 14:12:38.841120 18247 logging.cc:424] LogThrottler /data0/somelongdirectorytoavoidrpathissues/src/kudu/src/kudu/rpc/acceptor_pool.cc:285: suppressed but not reported on 3 messages since previous log ~32 seconds ago